<86>Mar 18 07:56:33 userdel[59429]: delete user 'rooter'
<86>Mar 18 07:56:33 groupadd[59448]: group added to /etc/group: name=rooter, GID=579
<86>Mar 18 07:56:33 groupadd[59448]: group added to /etc/gshadow: name=rooter
<86>Mar 18 07:56:33 groupadd[59448]: new group: name=rooter, GID=579
<86>Mar 18 07:56:33 useradd[59460]: new user: name=rooter, UID=579, GID=579, home=/root, shell=/bin/bash
<86>Mar 18 07:56:33 userdel[59504]: delete user 'builder'
<86>Mar 18 07:56:33 userdel[59504]: removed group 'builder' owned by 'builder'
<86>Mar 18 07:56:33 userdel[59504]: removed shadow group 'builder' owned by 'builder'
<86>Mar 18 07:56:33 groupadd[59521]: group added to /etc/group: name=builder, GID=580
<86>Mar 18 07:56:33 groupadd[59521]: group added to /etc/gshadow: name=builder
<86>Mar 18 07:56:33 groupadd[59521]: new group: name=builder, GID=580
<86>Mar 18 07:56:33 useradd[59552]: new user: name=builder, UID=580, GID=580, home=/usr/src, shell=/bin/bash
warning: Macro %meson not found
warning: Macro %meson_build not found
warning: Macro %meson_install not found
warning: Macro %_typelibdir not found
warning: Macro %_girdir not found
warning: Macro %ubt not found
warning: Macro %ubt not found
warning: Macro %ubt not found
warning: Macro %ubt not found
<13>Mar 18 07:56:38 rpmi: sgml-common-0.6.3-alt15 1423664786 installed
<13>Mar 18 07:56:38 rpmi: xml-utils-1:2.9.4.0.12.e905-alt1.1 1525115767 installed
<13>Mar 18 07:56:38 rpmi: docbook-dtds-4.5-alt1 1223476557 installed
<13>Mar 18 07:56:38 rpmi: rpm-build-gir-0.7.2-alt4 1534675014 installed
<13>Mar 18 07:56:38 rpmi: libsqlite3-3.26.0-alt2 sisyphus+220766.100.5.1 1549611685 installed
<13>Mar 18 07:56:38 rpmi: libnspr-1:4.20-alt1 sisyphus.216395.100 1542113039 installed
<13>Mar 18 07:56:38 rpmi: libgdbm-1.8.3-alt10 1454943334 installed
<13>Mar 18 07:56:38 rpmi: libexpat-2.2.4-alt1 1503305345 installed
<13>Mar 18 07:56:38 rpmi: docbook-style-xsl-1.79.1-alt2 sisyphus.213665.100 1537949315 installed
<13>Mar 18 07:56:38 rpmi: ninja-build-1.9.0-alt1 sisyphus+220351.200.2.1 1549032788 installed
<13>Mar 18 07:56:38 rpmi: liblz4-1:1.8.3-alt2 sisyphus+221902.4200.4.1 1550599659 installed
<13>Mar 18 07:56:38 rpmi: libOpenSP-1.5.2-alt3.qa1 1365943435 installed
<13>Mar 18 07:56:38 rpmi: openjade-1.3.2-alt15 sisyphus+219815.100.1.1 1548167857 installed
<13>Mar 18 07:56:38 rpmi: docbook-style-dsssl-1.79-alt3 1324062818 installed
<13>Mar 18 07:56:39 rpmi: highlight-3.38-alt1 1499785557 installed
<13>Mar 18 07:56:39 rpmi: python-modules-curses-2.7.15-alt1 sisyphus.217364.100 1544022423 installed
<13>Mar 18 07:56:39 rpmi: libverto-0.3.0-alt1_7 sisyphus+223221.100.1.1 1551348953 installed
<13>Mar 18 07:56:39 rpmi: libkeyutils-1.6-alt2 sisyphus.217337.100 1544003161 installed
<13>Mar 18 07:56:39 rpmi: libcom_err-1.44.6-alt1 sisyphus+224154.100.1.1 1552091678 installed
<13>Mar 18 07:56:39 rpmi: libxapian-1.4.5-alt3 sisyphus+222778.100.1.1 1551144773 installed
<13>Mar 18 07:56:39 rpmi: python-sphinx-objects.inv-1:2.3.8.20190312-alt1 sisyphus+224905.100.1.1 1552438838 installed
<13>Mar 18 07:56:39 rpmi: libgpg-error-1.31-alt1.S1 1529015802 installed
<13>Mar 18 07:56:39 rpmi: libgcrypt20-1.8.3-alt4 sisyphus+222598.100.1.1 1550924043 installed
<13>Mar 18 07:56:39 rpmi: libsystemd-1:241-alt3 sisyphus+222052.100.2.1 1550681059 installed
<13>Mar 18 07:56:39 rpmi: libxslt-1.1.32-alt2 1517429984 installed
<13>Mar 18 07:56:39 rpmi: xsltproc-1.1.32-alt2 1517429984 installed
<13>Mar 18 07:56:39 rpmi: libdbus-1.12.12-alt2 sisyphus+221234.100.1.2 1549918047 installed
<13>Mar 18 07:56:39 rpmi: libffi-devel-1:3.2.1-alt2 1528881777 installed
<13>Mar 18 07:56:39 rpmi: shared-mime-info-1.12-alt1 sisyphus+219597.100.2.2 1548057005 installed
<13>Mar 18 07:56:39 rpmi: gsettings-desktop-schemas-data-3.28.1-alt1 sisyphus.212587.100 1536082062 installed
<13>Mar 18 07:56:39 rpmi: libgio-2.58.3-alt1 sisyphus+219722.100.1.1 1548088777 installed
<13>Mar 18 07:56:39 rpmi: gsettings-desktop-schemas-3.28.1-alt1 sisyphus.212587.100 1536082066 installed
<13>Mar 18 07:56:39 rpmi: gobject-introspection-1.58.3-alt1 sisyphus.218857.100 1546259916 installed
<13>Mar 18 07:56:39 rpmi: gobject-introspection-x11-1.58.3-alt1 sisyphus.218857.100 1546259916 installed
<13>Mar 18 07:56:39 rpmi: libpolkit-0.115-alt5 sisyphus.219065.100 1547027030 installed
<13>Mar 18 07:56:39 rpmi: libtasn1-4.13-alt2 1521133850 installed
<13>Mar 18 07:56:39 rpmi: libp11-kit-0.23.9-alt5 1525798298 installed
<13>Mar 18 07:56:39 rpmi: rpm-macros-alternatives-0.5.0-alt1 sisyphus+221902.300.4.1 1550587121 installed
<13>Mar 18 07:56:39 rpmi: alternatives-0.5.0-alt1 sisyphus+221902.300.4.1 1550587121 installed
<13>Mar 18 07:56:39 rpmi: ca-certificates-2019.02.01-alt1 sisyphus+220384.200.1.1 1549032756 installed
<13>Mar 18 07:56:39 rpmi: ca-trust-0.1.1-alt2 1515595785 installed
<13>Mar 18 07:56:39 rpmi: p11-kit-trust-0.23.9-alt5 1525798298 installed
<13>Mar 18 07:56:39 rpmi: libcrypto1.1-1.1.0j-alt2 sisyphus+223638.100.2.1 1551791072 installed
<13>Mar 18 07:56:39 rpmi: libssl1.1-1.1.0j-alt2 sisyphus+223638.100.2.1 1551791072 installed
<13>Mar 18 07:56:40 rpmi: libpython3-3.6.8-alt1 sisyphus+220164.200.3.1 1548842636 installed
<13>Mar 18 07:56:40 rpmi: python3-3.6.8-alt1 sisyphus+220164.200.3.1 1548842636 installed
<13>Mar 18 07:56:40 rpmi: python3-base-3.6.8-alt1 sisyphus+220164.200.3.1 1548842636 installed
<13>Mar 18 07:56:41 rpmi: python3-module-pkg_resources-1:40.8.0-alt1 sisyphus+221229.100.2.1 1550559950 installed
<13>Mar 18 07:56:41 rpmi: python3-module-six-1.12.0-alt1 sisyphus+219665.100.2.1 1548148570 installed
<13>Mar 18 07:56:41 rpmi: glib2-devel-2.58.3-alt1 sisyphus+219722.100.1.1 1548088777 installed
<13>Mar 18 07:56:41 rpmi: libgio-devel-2.58.3-alt1 sisyphus+219722.100.1.1 1548088777 installed
<13>Mar 18 07:56:41 rpmi: python3-module-more-itertools-5.0.0-alt1 sisyphus.218699.100 1545980609 installed
<13>Mar 18 07:56:41 rpmi: python3-module-anytree-2.6.0-alt1 sisyphus+221296.100.1.2 1549960078 installed
<13>Mar 18 07:56:41 rpmi: python3-module-ntlm-1.1.0-alt1.1.1.1 1460405346 installed
<13>Mar 18 07:56:41 rpmi: python3-module-pycparser-2.19-alt1 sisyphus.216095.100 1541345023 installed
<13>Mar 18 07:56:41 rpmi: python3-module-cffi-1.10.0-alt1.1 1525117736 installed
<13>Mar 18 07:56:41 rpmi: python3-module-asn1crypto-0.24.0-alt1 1521037480 installed
<13>Mar 18 07:56:41 rpmi: python3-module-cryptography-2.6.1-alt1 sisyphus+224961.100.1.1 1552501268 installed
<13>Mar 18 07:56:41 rpmi: python3-module-OpenSSL-18.0.0-alt1 1532996168 installed
<13>Mar 18 07:56:41 rpmi: python3-module-pytz-1:2016.10-alt1 1484291011 installed
<13>Mar 18 07:56:41 rpmi: python3-module-babel-1:2.6.0-alt1 sisyphus+221000.100.1.2 1549688063 installed
<13>Mar 18 07:56:41 rpmi: python3-module-zope.interface-4.5.0-alt1.qa1 sisyphus.214938.100 1539939473 installed
<13>Mar 18 07:56:42 rpmi: python3-module-chameleon.core-3.1-alt1.2 1527237057 installed
<13>Mar 18 07:56:42 rpmi: python3-module-polib-1.0.5-alt1.1.2 1526977584 installed
<13>Mar 18 07:56:42 rpmi: python3-module-lingua-4.13-alt1.1 1517783822 installed
<13>Mar 18 07:56:42 rpmi: python3-module-genshi-0.7-alt1.1.1.1 1460400448 installed
<13>Mar 18 07:56:42 rpmi: python3-module-webencodings-0.5.1-alt1.1 1517943573 installed
<13>Mar 18 07:56:42 rpmi: python3-module-cssselect-0.9.1-alt1.2 1526980827 installed
<13>Mar 18 07:56:42 rpmi: python3-module-html5lib-1:0.999999999-alt4.qa1 sisyphus.214868.100 1539741045 installed
<13>Mar 18 07:56:42 rpmi: python3-module-lxml-4.3.2-alt1 sisyphus+223616.100.1.1 1551715577 installed
<13>Mar 18 07:56:42 rpmi: python3-module-docutils-0.14-alt2 1535729778 installed
<13>Mar 18 07:56:42 rpmi: python3-module-chardet-3.0.4-alt1 1506613818 installed
<13>Mar 18 07:56:42 rpmi: python3-module-idna-2.7-alt1 1530720902 installed
<13>Mar 18 07:56:42 rpmi: python3-module-ndg-0.4.2-alt1.qa1 1531457735 installed
<13>Mar 18 07:56:42 rpmi: python3-module-ndg-httpsclient-0.4.2-alt1.qa1 1531457735 installed
<13>Mar 18 07:56:42 rpmi: python3-module-urllib3-2:1.24.1-alt2 sisyphus.218529.100 1545673498 installed
<13>Mar 18 07:56:42 rpmi: python3-module-requests-2.21.0-alt1 sisyphus.218511.200 1545669878 installed
<13>Mar 18 07:56:42 rpmi: python3-module-imagesize-0.7.1-alt1 1461387704 installed
<13>Mar 18 07:56:42 rpmi: python3-module-markupsafe-0.23-alt1.2.1.1 1525118834 installed
<13>Mar 18 07:56:42 rpmi: python3-module-jinja2-2.10-alt1 1521724576 installed
<13>Mar 18 07:56:42 rpmi: python3-module-atomicwrites-1.3.0-alt1 sisyphus+221237.100.1.2 1549921064 installed
<13>Mar 18 07:56:42 rpmi: python3-module-attrs-19.1.0-alt1 sisyphus+224963.100.1.1 1552501935 installed
<13>Mar 18 07:56:42 rpmi: python3-module-pluggy-0.9.0-alt1 sisyphus+225174.100.1.1 1552829122 installed
<13>Mar 18 07:56:42 rpmi: python3-module-apipkg-1.5-alt1 1531926938 installed
<13>Mar 18 07:56:42 rpmi: python3-module-iniconfig-1.0.0-alt1 sisyphus+225153.100.1.1 1552826442 installed
<13>Mar 18 07:56:42 rpmi: python3-module-py-1.8.0-alt2 sisyphus+225173.100.1.1 1552828593 installed
<13>Mar 18 07:56:42 rpmi: python3-module-pytest-3.10.1-alt4 sisyphus+220988.200.2.1 1549800021 installed
<13>Mar 18 07:56:42 rpmi: python3-module-snowballstemmer-1.2.0-alt2.1 1457859319 installed
<13>Mar 18 07:56:42 rpmi: python3-module-whoosh-2.7.4-alt1 1527698183 installed
<13>Mar 18 07:56:42 rpmi: python3-module-xapian-1.4.5-alt3 sisyphus+223819.200.2.1 1551806724 installed
<13>Mar 18 07:56:42 rpmi: python3-module-markdown-2.6.7-alt1.1 1517789319 installed
<13>Mar 18 07:56:42 rpmi: python3-modules-sqlite3-3.6.8-alt1 sisyphus+220164.200.3.1 1548842636 installed
<13>Mar 18 07:56:43 rpmi: python3-module-SQLAlchemy-1.2.15-alt1 sisyphus+224192.100.1.1 1552146172 installed
<13>Mar 18 07:56:43 rpmi: python3-module-sphinxcontrib-websupport-1.0.1-alt3.qa1 sisyphus.214922.100 1539851266 installed
<13>Mar 18 07:56:43 rpmi: python3-module-alabaster-0.7.6-alt3 1526385201 installed
<13>Mar 18 07:56:43 rpmi: python3-module-Pygments-2.2.0-alt2 1526455576 installed
<13>Mar 18 07:56:43 rpmi: python3-module-sphinx-1:1.6.5-alt3 sisyphus.213215.100 1537280252 installed
<86>Mar 18 07:56:43 groupadd[56771]: group added to /etc/group: name=_keytab, GID=499
<86>Mar 18 07:56:43 groupadd[56771]: group added to /etc/gshadow: name=_keytab
<86>Mar 18 07:56:43 groupadd[56771]: new group: name=_keytab, GID=499
<13>Mar 18 07:56:43 rpmi: libkrb5-1.16.3-alt1 sisyphus+223678.100.1.1 1551746516 installed
<13>Mar 18 07:56:43 rpmi: libtirpc-1.0.3-alt1 1532008017 installed
<13>Mar 18 07:56:43 rpmi: libnsl2-1.1.0-alt1_1 1511548749 installed
<13>Mar 18 07:56:43 rpmi: python-modules-compiler-2.7.15-alt1 sisyphus.217364.100 1544022423 installed
<13>Mar 18 07:56:43 rpmi: python-modules-email-2.7.15-alt1 sisyphus.217364.100 1544022423 installed
<13>Mar 18 07:56:43 rpmi: python-modules-unittest-2.7.15-alt1 sisyphus.217364.100 1544022423 installed
<13>Mar 18 07:56:43 rpmi: python-modules-nis-2.7.15-alt1 sisyphus.217364.100 1544022423 installed
<13>Mar 18 07:56:44 rpmi: python-modules-encodings-2.7.15-alt1 sisyphus.217364.100 1544022423 installed
<13>Mar 18 07:56:44 rpmi: python-modules-2.7.15-alt1 sisyphus.217364.100 1544022423 installed
<13>Mar 18 07:56:44 rpmi: python-modules-xml-2.7.15-alt1 sisyphus.217364.100 1544022423 installed
<13>Mar 18 07:56:44 rpmi: python-modules-hotshot-2.7.15-alt1 sisyphus.217364.100 1544022423 installed
<13>Mar 18 07:56:44 rpmi: python-modules-bsddb-2.7.15-alt1 sisyphus.217364.100 1544022423 installed
<13>Mar 18 07:56:44 rpmi: python-modules-ctypes-2.7.15-alt1 sisyphus.217364.100 1544022423 installed
<13>Mar 18 07:56:44 rpmi: python-modules-multiprocessing-2.7.15-alt1 sisyphus.217364.100 1544022423 installed
<13>Mar 18 07:56:44 rpmi: python-modules-logging-2.7.15-alt1 sisyphus.217364.100 1544022423 installed
<13>Mar 18 07:56:44 rpmi: python-2.7.15-alt1 sisyphus.217364.100 1544022423 installed
<13>Mar 18 07:56:44 rpmi: libnss-3.42.1-alt1 sisyphus+220384.100.1.1 1549032573 installed
<13>Mar 18 07:56:44 rpmi: python3-module-nss-1.0.1-alt2.S1.1 1525119671 installed
<13>Mar 18 07:56:44 rpmi: python3-module-beaker-1.9.0-alt1 1521467136 installed
<13>Mar 18 07:56:45 rpmi: python3-module-mako-1.0.1-alt1.1.1.1 1460400692 installed
<13>Mar 18 07:56:45 rpmi: gobject-introspection-devel-1.58.3-alt1 sisyphus.218857.100 1546259916 installed
<13>Mar 18 07:56:45 rpmi: gtk-doc-1.29-alt2 sisyphus.217088.100 1543518451 installed
<13>Mar 18 07:56:45 rpmi: libpolkit-devel-0.115-alt5 sisyphus.219065.100 1547027030 installed
<13>Mar 18 07:56:45 rpmi: meson-0.49.2-alt3 sisyphus+224994.100.1.1 1552558451 installed
<13>Mar 18 07:56:45 rpmi: libdbus-devel-1.12.12-alt2 sisyphus+221234.100.1.2 1549918047 installed
<13>Mar 18 07:56:45 rpmi: libsystemd-devel-1:241-alt3 sisyphus+222052.100.2.1 1550681059 installed
warning: Macro %ubt not found
warning: Macro %ubt not found
warning: Macro %ubt not found
warning: Macro %ubt not found
Building target platforms: i586
Building for target i586
Wrote: /usr/src/in/nosrpm/accountsservice-0.6.54-alt1.nosrc.rpm
warning: Macro %ubt not found
warning: Macro %ubt not found
warning: Macro %ubt not found
warning: Macro %ubt not found
Installing accountsservice-0.6.54-alt1.src.rpm
Building target platforms: i586
Building for target i586
Executing(%prep): /bin/sh -e /usr/src/tmp/rpm-tmp.6328
+ umask 022
+ /bin/mkdir -p /usr/src/RPM/BUILD
+ cd /usr/src/RPM/BUILD
+ cd /usr/src/RPM/BUILD
+ rm -rf accountsservice-0.6.54
+ echo 'Source #0 (accountsservice-0.6.54.tar):'
Source #0 (accountsservice-0.6.54.tar):
+ /bin/tar -xf /usr/src/RPM/SOURCES/accountsservice-0.6.54.tar
+ cd accountsservice-0.6.54
+ /bin/chmod -c -Rf u+rwX,go-w .
+ echo 'Patch #1 (accountsservice-0.6.54.patch):'
Patch #1 (accountsservice-0.6.54.patch):
+ /usr/bin/patch -p1
patching file meson.build
patching file meson_options.txt
patching file src/user-classify.c
+ exit 0
Executing(%build): /bin/sh -e /usr/src/tmp/rpm-tmp.6328
+ umask 022
+ /bin/mkdir -p /usr/src/RPM/BUILD
+ cd /usr/src/RPM/BUILD
+ cd accountsservice-0.6.54
+ mkdir -p i586-alt-linux
+ CFLAGS='-pipe -frecord-gcc-switches -Wall -g -O2 -march=i586 -mtune=generic'
+ export CFLAGS
+ CXXFLAGS='-pipe -frecord-gcc-switches -Wall -g -O2 -march=i586 -mtune=generic'
+ export CXXFLAGS
+ FFLAGS='-pipe -frecord-gcc-switches -Wall -g -O2 -march=i586 -mtune=generic'
+ export FFLAGS
+ /usr/bin/meson . i586-alt-linux --buildtype=plain --prefix=/usr --bindir=/usr/bin --sbindir=/usr/sbin --libexecdir=/usr/libexec --libdir=/usr/lib --localstatedir=/var --sharedstatedir=/var/lib --includedir=/usr/include --datadir=/usr/share --sysconfdir=/etc --mandir=/usr/share/man --infodir=/usr/share/info --localedir=/usr/share/locale --wrap-mode=nodownload -Dadmin_group=wheel -Duser_heuristics=true -Dminimum_uid=500 -Dsystemd=true -Dsystemdsystemunitdir=/lib/systemd/system
The Meson build system
Version: 0.49.2
Source dir: /usr/src/RPM/BUILD/accountsservice-0.6.54
Build dir: /usr/src/RPM/BUILD/accountsservice-0.6.54/i586-alt-linux
Build type: native build
Project name: accountsservice
Project version: 0.6.54
Appending CFLAGS from environment: '-pipe -frecord-gcc-switches -Wall -g -O2 -march=i586 -mtune=generic'
Native C compiler: cc (gcc 8.3.1 "i586-alt-linux-gcc (GCC) 8.3.1 20190311 (ALT Sisyphus 8.3.1-alt2)")
Build machine cpu family: x86
Build machine cpu: i686
Has header "paths.h" : YES
Has header "shadow.h" : YES
Has header "utmpx.h" : YES
Checking for function "getusershell" : YES
Checking for function "setutxdb" : NO
Checking for function "fgetpwent" : YES
Header <utmpx.h> has symbol "WTMPX_FILENAME" : YES
Message: whether optimization is enabled: false
Found pkg-config: /usr/bin/pkg-config (0.29.2)
Dependency gio-2.0 found: YES 2.58.3
Dependency gio-unix-2.0 found: YES 2.58.3
Dependency glib-2.0 found: YES 2.58.3
Dependency polkit-gobject-1 found: YES 0.116
Library crypt found: YES
Dependency dbus-1 found: YES 1.12.12
Dependency libsystemd found: YES 241
Configuring org.freedesktop.Accounts.service using configuration
Configuring accounts-daemon.service using configuration
Compiler for C supports link arguments -Wl,--version-script,/usr/src/RPM/BUILD/accountsservice-0.6.54/src/libaccountsservice/symbol.map: YES
Configuring config.h using configuration
Program meson_post_install.py found: YES (/usr/bin/env python3 /usr/src/RPM/BUILD/accountsservice-0.6.54/meson_post_install.py)
Message: 
accountsservice was configured with the following options:
** DocBook documentation build: false
** Administrator group: wheel
** Extra administrator groups: 
** GDM configuration: /etc/gdm/custom.conf
Build targets in project: 21
Option buildtype is: plain [default: debugoptimized]
Found ninja-1.9.0 at /usr/bin/ninja
+ ninja-build -j8 -C i586-alt-linux
ninja: Entering directory `i586-alt-linux'
[1/33] Generating accounts-generated.h with a custom command.
[2/33] Generating accounts-user-generated.c with a custom command.
[3/33] Generating accounts-user-generated.h with a custom command.
[4/33] Generating accounts-generated.c with a custom command.
[5/33] Generating ck-manager-generated.h with a custom command.
[6/33] Generating ck-manager-generated.c with a custom command.
[7/33] Generating ck-seat-generated.c with a custom command.
[8/33] Generating ck-seat-generated.h with a custom command.
[9/33] Compiling C object 'src/25a6634@@accounts-daemon@exe/extensions.c.o'.
[10/33] Compiling C object 'src/25a6634@@accounts-daemon@exe/daemon.c.o'.
[11/33] Compiling C object 'src/25a6634@@accounts-daemon@exe/user-classify.c.o'.
[12/33] Compiling C object 'src/25a6634@@accounts-daemon@exe/main.c.o'.
[13/33] Generating org.freedesktop.accounts.policy_data_merge with a custom command.
[14/33] Compiling C object 'src/25a6634@@accounts-daemon@exe/util.c.o'.
../src/util.c: In function ‘setup_loginuid’:
../src/util.c:217:9: warning: ignoring return value of ‘write’, declared with attribute warn_unused_result [-Wunused-result]
         write (fd, id, strlen (id));
         ^~~~~~~~~~~~~~~~~~~~~~~~~~~
[15/33] Compiling C object 'src/25a6634@@accounts-generated@sta/meson-generated_.._accounts-generated.c.o'.
[16/33] Compiling C object 'src/25a6634@@accounts-daemon@exe/wtmp-helper.c.o'.
[17/33] Generating ck-session-generated.c with a custom command.
[18/33] Compiling C object 'src/25a6634@@accounts-daemon@exe/user.c.o'.
[19/33] Generating ck-session-generated.h with a custom command.
[20/33] Generating act-user-enum-types.h with a meson_exe.py custom command.
[21/33] Compiling C object 'src/25a6634@@accounts-generated@sta/meson-generated_.._accounts-user-generated.c.o'.
[22/33] Linking static target src/libaccounts-generated.a.
[23/33] Linking target src/accounts-daemon.
[24/33] Compiling C object 'src/libaccountsservice/92f4044@@accountsservice@sha/meson-generated_.._ck-seat-generated.c.o'.
[25/33] Compiling C object 'src/libaccountsservice/92f4044@@accountsservice@sha/meson-generated_.._ck-manager-generated.c.o'.
[26/33] Compiling C object 'src/libaccountsservice/92f4044@@accountsservice@sha/act-user.c.o'.
[27/33] Compiling C object 'src/libaccountsservice/92f4044@@accountsservice@sha/meson-generated_.._ck-session-generated.c.o'.
[28/33] Compiling C object 'src/libaccountsservice/92f4044@@accountsservice@sha/act-user-manager.c.o'.
../src/libaccountsservice/act-user-manager.c: In function ‘_systemd_session_is_on_our_seat’:
../src/libaccountsservice/act-user-manager.c:422:15: warning: variable ‘ret’ set but not used [-Wunused-but-set-variable]
         int   ret;
               ^~~
[29/33] Generating act-user-enum-types.c with a meson_exe.py custom command.
[30/33] Compiling C object 'src/libaccountsservice/92f4044@@accountsservice@sha/meson-generated_.._act-user-enum-types.c.o'.
[31/33] Linking target src/libaccountsservice/libaccountsservice.so.0.0.0.
[32/33] Generating AccountsService-1.0.gir with a custom command.
/usr/lib/gcc/i586-alt-linux/8/include/stddef.h:435: syntax error, unexpected identifier in '  __float128 __max_align_f128 __attribute__((__aligned__(__alignof(__float128))));' at '__float128'
g-ir-scanner: link: cc -o /usr/src/RPM/BUILD/accountsservice-0.6.54/i586-alt-linux/tmp-introspect_lkf6371/AccountsService-1.0 -pipe -frecord-gcc-switches -Wall -g -O2 -march=i586 -mtune=generic /usr/src/RPM/BUILD/accountsservice-0.6.54/i586-alt-linux/tmp-introspect_lkf6371/AccountsService-1.0.o -L. -Wl,-rpath,. -Wl,--no-as-needed -L/usr/src/RPM/BUILD/accountsservice-0.6.54/i586-alt-linux/src/libaccountsservice -Wl,-rpath,/usr/src/RPM/BUILD/accountsservice-0.6.54/i586-alt-linux/src/libaccountsservice -L/usr/src/RPM/BUILD/accountsservice-0.6.54/i586-alt-linux/src -Wl,-rpath,/usr/src/RPM/BUILD/accountsservice-0.6.54/i586-alt-linux/src -L/usr/src/RPM/BUILD/accountsservice-0.6.54/i586-alt-linux/src -Wl,-rpath,/usr/src/RPM/BUILD/accountsservice-0.6.54/i586-alt-linux/src -L/usr/src/RPM/BUILD/accountsservice-0.6.54/i586-alt-linux/src/libaccountsservice -Wl,-rpath,/usr/src/RPM/BUILD/accountsservice-0.6.54/i586-alt-linux/src/libaccountsservice -laccountsservice -laccountsservice -lcrypt -lgio-2.0 -lgobject-2.0 -lglib-2.0 -lsystemd -lgio-2.0 -lgobject-2.0 -Wl,--export-dynamic -lgmodule-2.0 -pthread -lglib-2.0
[33/33] Generating AccountsService-1.0.typelib with a custom command.
+ exit 0
Executing(%install): /bin/sh -e /usr/src/tmp/rpm-tmp.93683
+ umask 022
+ /bin/mkdir -p /usr/src/RPM/BUILD
+ cd /usr/src/RPM/BUILD
+ /bin/chmod -Rf u+rwX -- /usr/src/tmp/accountsservice-buildroot
+ :
+ /bin/rm -rf -- /usr/src/tmp/accountsservice-buildroot
+ cd accountsservice-0.6.54
+ DESTDIR=/usr/src/tmp/accountsservice-buildroot
+ ninja-build -C i586-alt-linux install
ninja: Entering directory `i586-alt-linux'
[0/1] Installing files.
Installing /usr/src/RPM/BUILD/accountsservice-0.6.54/i586-alt-linux/po/ar.gmo to /usr/src/tmp/accountsservice-buildroot/usr/share/locale/ar/LC_MESSAGES/accounts-service.mo
Installing /usr/src/RPM/BUILD/accountsservice-0.6.54/i586-alt-linux/po/bg.gmo to /usr/src/tmp/accountsservice-buildroot/usr/share/locale/bg/LC_MESSAGES/accounts-service.mo
Installing /usr/src/RPM/BUILD/accountsservice-0.6.54/i586-alt-linux/po/bn_IN.gmo to /usr/src/tmp/accountsservice-buildroot/usr/share/locale/bn_IN/LC_MESSAGES/accounts-service.mo
Installing /usr/src/RPM/BUILD/accountsservice-0.6.54/i586-alt-linux/po/ca.gmo to /usr/src/tmp/accountsservice-buildroot/usr/share/locale/ca/LC_MESSAGES/accounts-service.mo
Installing /usr/src/RPM/BUILD/accountsservice-0.6.54/i586-alt-linux/po/ca@valencia.gmo to /usr/src/tmp/accountsservice-buildroot/usr/share/locale/ca@valencia/LC_MESSAGES/accounts-service.mo
Installing /usr/src/RPM/BUILD/accountsservice-0.6.54/i586-alt-linux/po/cs.gmo to /usr/src/tmp/accountsservice-buildroot/usr/share/locale/cs/LC_MESSAGES/accounts-service.mo
Installing /usr/src/RPM/BUILD/accountsservice-0.6.54/i586-alt-linux/po/da.gmo to /usr/src/tmp/accountsservice-buildroot/usr/share/locale/da/LC_MESSAGES/accounts-service.mo
Installing /usr/src/RPM/BUILD/accountsservice-0.6.54/i586-alt-linux/po/de.gmo to /usr/src/tmp/accountsservice-buildroot/usr/share/locale/de/LC_MESSAGES/accounts-service.mo
Installing /usr/src/RPM/BUILD/accountsservice-0.6.54/i586-alt-linux/po/el.gmo to /usr/src/tmp/accountsservice-buildroot/usr/share/locale/el/LC_MESSAGES/accounts-service.mo
Installing /usr/src/RPM/BUILD/accountsservice-0.6.54/i586-alt-linux/po/en_GB.gmo to /usr/src/tmp/accountsservice-buildroot/usr/share/locale/en_GB/LC_MESSAGES/accounts-service.mo
Installing /usr/src/RPM/BUILD/accountsservice-0.6.54/i586-alt-linux/po/eo.gmo to /usr/src/tmp/accountsservice-buildroot/usr/share/locale/eo/LC_MESSAGES/accounts-service.mo
Installing /usr/src/RPM/BUILD/accountsservice-0.6.54/i586-alt-linux/po/es.gmo to /usr/src/tmp/accountsservice-buildroot/usr/share/locale/es/LC_MESSAGES/accounts-service.mo
Installing /usr/src/RPM/BUILD/accountsservice-0.6.54/i586-alt-linux/po/fa.gmo to /usr/src/tmp/accountsservice-buildroot/usr/share/locale/fa/LC_MESSAGES/accounts-service.mo
Installing /usr/src/RPM/BUILD/accountsservice-0.6.54/i586-alt-linux/po/fi.gmo to /usr/src/tmp/accountsservice-buildroot/usr/share/locale/fi/LC_MESSAGES/accounts-service.mo
Installing /usr/src/RPM/BUILD/accountsservice-0.6.54/i586-alt-linux/po/fr.gmo to /usr/src/tmp/accountsservice-buildroot/usr/share/locale/fr/LC_MESSAGES/accounts-service.mo
Installing /usr/src/RPM/BUILD/accountsservice-0.6.54/i586-alt-linux/po/ga.gmo to /usr/src/tmp/accountsservice-buildroot/usr/share/locale/ga/LC_MESSAGES/accounts-service.mo
Installing /usr/src/RPM/BUILD/accountsservice-0.6.54/i586-alt-linux/po/gl.gmo to /usr/src/tmp/accountsservice-buildroot/usr/share/locale/gl/LC_MESSAGES/accounts-service.mo
Installing /usr/src/RPM/BUILD/accountsservice-0.6.54/i586-alt-linux/po/he.gmo to /usr/src/tmp/accountsservice-buildroot/usr/share/locale/he/LC_MESSAGES/accounts-service.mo
Installing /usr/src/RPM/BUILD/accountsservice-0.6.54/i586-alt-linux/po/hi.gmo to /usr/src/tmp/accountsservice-buildroot/usr/share/locale/hi/LC_MESSAGES/accounts-service.mo
Installing /usr/src/RPM/BUILD/accountsservice-0.6.54/i586-alt-linux/po/hu.gmo to /usr/src/tmp/accountsservice-buildroot/usr/share/locale/hu/LC_MESSAGES/accounts-service.mo
Installing /usr/src/RPM/BUILD/accountsservice-0.6.54/i586-alt-linux/po/ia.gmo to /usr/src/tmp/accountsservice-buildroot/usr/share/locale/ia/LC_MESSAGES/accounts-service.mo
Installing /usr/src/RPM/BUILD/accountsservice-0.6.54/i586-alt-linux/po/id.gmo to /usr/src/tmp/accountsservice-buildroot/usr/share/locale/id/LC_MESSAGES/accounts-service.mo
Installing /usr/src/RPM/BUILD/accountsservice-0.6.54/i586-alt-linux/po/it.gmo to /usr/src/tmp/accountsservice-buildroot/usr/share/locale/it/LC_MESSAGES/accounts-service.mo
Installing /usr/src/RPM/BUILD/accountsservice-0.6.54/i586-alt-linux/po/ja.gmo to /usr/src/tmp/accountsservice-buildroot/usr/share/locale/ja/LC_MESSAGES/accounts-service.mo
Installing /usr/src/RPM/BUILD/accountsservice-0.6.54/i586-alt-linux/po/ka.gmo to /usr/src/tmp/accountsservice-buildroot/usr/share/locale/ka/LC_MESSAGES/accounts-service.mo
Installing /usr/src/RPM/BUILD/accountsservice-0.6.54/i586-alt-linux/po/kk.gmo to /usr/src/tmp/accountsservice-buildroot/usr/share/locale/kk/LC_MESSAGES/accounts-service.mo
Installing /usr/src/RPM/BUILD/accountsservice-0.6.54/i586-alt-linux/po/ko.gmo to /usr/src/tmp/accountsservice-buildroot/usr/share/locale/ko/LC_MESSAGES/accounts-service.mo
Installing /usr/src/RPM/BUILD/accountsservice-0.6.54/i586-alt-linux/po/lt.gmo to /usr/src/tmp/accountsservice-buildroot/usr/share/locale/lt/LC_MESSAGES/accounts-service.mo
Installing /usr/src/RPM/BUILD/accountsservice-0.6.54/i586-alt-linux/po/lv.gmo to /usr/src/tmp/accountsservice-buildroot/usr/share/locale/lv/LC_MESSAGES/accounts-service.mo
Installing /usr/src/RPM/BUILD/accountsservice-0.6.54/i586-alt-linux/po/nl.gmo to /usr/src/tmp/accountsservice-buildroot/usr/share/locale/nl/LC_MESSAGES/accounts-service.mo
Installing /usr/src/RPM/BUILD/accountsservice-0.6.54/i586-alt-linux/po/pa.gmo to /usr/src/tmp/accountsservice-buildroot/usr/share/locale/pa/LC_MESSAGES/accounts-service.mo
Installing /usr/src/RPM/BUILD/accountsservice-0.6.54/i586-alt-linux/po/pl.gmo to /usr/src/tmp/accountsservice-buildroot/usr/share/locale/pl/LC_MESSAGES/accounts-service.mo
Installing /usr/src/RPM/BUILD/accountsservice-0.6.54/i586-alt-linux/po/pt_BR.gmo to /usr/src/tmp/accountsservice-buildroot/usr/share/locale/pt_BR/LC_MESSAGES/accounts-service.mo
Installing /usr/src/RPM/BUILD/accountsservice-0.6.54/i586-alt-linux/po/ro.gmo to /usr/src/tmp/accountsservice-buildroot/usr/share/locale/ro/LC_MESSAGES/accounts-service.mo
Installing /usr/src/RPM/BUILD/accountsservice-0.6.54/i586-alt-linux/po/ru.gmo to /usr/src/tmp/accountsservice-buildroot/usr/share/locale/ru/LC_MESSAGES/accounts-service.mo
Installing /usr/src/RPM/BUILD/accountsservice-0.6.54/i586-alt-linux/po/sk.gmo to /usr/src/tmp/accountsservice-buildroot/usr/share/locale/sk/LC_MESSAGES/accounts-service.mo
Installing /usr/src/RPM/BUILD/accountsservice-0.6.54/i586-alt-linux/po/sl.gmo to /usr/src/tmp/accountsservice-buildroot/usr/share/locale/sl/LC_MESSAGES/accounts-service.mo
Installing /usr/src/RPM/BUILD/accountsservice-0.6.54/i586-alt-linux/po/sr@latin.gmo to /usr/src/tmp/accountsservice-buildroot/usr/share/locale/sr@latin/LC_MESSAGES/accounts-service.mo
Installing /usr/src/RPM/BUILD/accountsservice-0.6.54/i586-alt-linux/po/sr.gmo to /usr/src/tmp/accountsservice-buildroot/usr/share/locale/sr/LC_MESSAGES/accounts-service.mo
Installing /usr/src/RPM/BUILD/accountsservice-0.6.54/i586-alt-linux/po/sv.gmo to /usr/src/tmp/accountsservice-buildroot/usr/share/locale/sv/LC_MESSAGES/accounts-service.mo
Installing /usr/src/RPM/BUILD/accountsservice-0.6.54/i586-alt-linux/po/te.gmo to /usr/src/tmp/accountsservice-buildroot/usr/share/locale/te/LC_MESSAGES/accounts-service.mo
Installing /usr/src/RPM/BUILD/accountsservice-0.6.54/i586-alt-linux/po/tr.gmo to /usr/src/tmp/accountsservice-buildroot/usr/share/locale/tr/LC_MESSAGES/accounts-service.mo
Installing /usr/src/RPM/BUILD/accountsservice-0.6.54/i586-alt-linux/po/uk.gmo to /usr/src/tmp/accountsservice-buildroot/usr/share/locale/uk/LC_MESSAGES/accounts-service.mo
Installing /usr/src/RPM/BUILD/accountsservice-0.6.54/i586-alt-linux/po/vi.gmo to /usr/src/tmp/accountsservice-buildroot/usr/share/locale/vi/LC_MESSAGES/accounts-service.mo
Installing /usr/src/RPM/BUILD/accountsservice-0.6.54/i586-alt-linux/po/wa.gmo to /usr/src/tmp/accountsservice-buildroot/usr/share/locale/wa/LC_MESSAGES/accounts-service.mo
Installing /usr/src/RPM/BUILD/accountsservice-0.6.54/i586-alt-linux/po/zh_CN.gmo to /usr/src/tmp/accountsservice-buildroot/usr/share/locale/zh_CN/LC_MESSAGES/accounts-service.mo
Installing /usr/src/RPM/BUILD/accountsservice-0.6.54/i586-alt-linux/po/zh_TW.gmo to /usr/src/tmp/accountsservice-buildroot/usr/share/locale/zh_TW/LC_MESSAGES/accounts-service.mo
Installing data/org.freedesktop.accounts.policy to /usr/src/tmp/accountsservice-buildroot/usr/share/polkit-1/actions
Installing src/accounts-daemon to /usr/src/tmp/accountsservice-buildroot/usr/libexec
Installing src/libaccountsservice/act-user-enum-types.h to /usr/src/tmp/accountsservice-buildroot/usr/include/accountsservice-1.0/act
Installing src/libaccountsservice/libaccountsservice.so.0.0.0 to /usr/src/tmp/accountsservice-buildroot/usr/lib
Installing src/libaccountsservice/AccountsService-1.0.gir to /usr/src/tmp/accountsservice-buildroot/usr/share/gir-1.0
Installing src/libaccountsservice/AccountsService-1.0.typelib to /usr/src/tmp/accountsservice-buildroot/usr/lib/girepository-1.0
Installing /usr/src/RPM/BUILD/accountsservice-0.6.54/src/libaccountsservice/act-user.h to /usr/src/tmp/accountsservice-buildroot/usr/include/accountsservice-1.0/act
Installing /usr/src/RPM/BUILD/accountsservice-0.6.54/src/libaccountsservice/act-user-manager.h to /usr/src/tmp/accountsservice-buildroot/usr/include/accountsservice-1.0/act
Installing /usr/src/RPM/BUILD/accountsservice-0.6.54/src/libaccountsservice/act.h to /usr/src/tmp/accountsservice-buildroot/usr/include/accountsservice-1.0/act
Installing /usr/src/RPM/BUILD/accountsservice-0.6.54/data/org.freedesktop.Accounts.xml to /usr/src/tmp/accountsservice-buildroot/usr/share/dbus-1/interfaces
Installing /usr/src/RPM/BUILD/accountsservice-0.6.54/data/org.freedesktop.Accounts.User.xml to /usr/src/tmp/accountsservice-buildroot/usr/share/dbus-1/interfaces
Installing /usr/src/RPM/BUILD/accountsservice-0.6.54/data/org.freedesktop.Accounts.conf to /usr/src/tmp/accountsservice-buildroot/etc/dbus-1/system.d
Installing /usr/src/RPM/BUILD/accountsservice-0.6.54/i586-alt-linux/data/org.freedesktop.Accounts.service to /usr/src/tmp/accountsservice-buildroot/usr/share/dbus-1/system-services
Installing /usr/src/RPM/BUILD/accountsservice-0.6.54/i586-alt-linux/data/accounts-daemon.service to /usr/src/tmp/accountsservice-buildroot/lib/systemd/system
Installing /usr/src/RPM/BUILD/accountsservice-0.6.54/i586-alt-linux/meson-private/accountsservice.pc to /usr/src/tmp/accountsservice-buildroot/usr/lib/pkgconfig
Running custom install script '/usr/bin/meson --internal gettext install --subdir=po --localedir=share/locale --pkgname=accounts-service'
Running custom install script '/usr/bin/env python3 /usr/src/RPM/BUILD/accountsservice-0.6.54/meson_post_install.py /var'
+ /usr/lib/rpm/find-lang accounts-service
+ /usr/lib/rpm/brp-alt
Cleaning files in /usr/src/tmp/accountsservice-buildroot (auto)
mode of './usr/lib/libaccountsservice.so.0.0.0' changed from 0755 (rwxr-xr-x) to 0644 (rw-r--r--)
Verifying and fixing files in /usr/src/tmp/accountsservice-buildroot (binconfig,pkgconfig,libtool,desktop)
/usr/lib/pkgconfig/accountsservice.pc: Libs: '-L${libdir} -laccountsservice' --> '-laccountsservice'
Checking contents of files in /usr/src/tmp/accountsservice-buildroot/ (default)
Compressing files in /usr/src/tmp/accountsservice-buildroot (auto)
Adjusting library links in /usr/src/tmp/accountsservice-buildroot
./var/lib:
./lib:
./usr/lib:
	libaccountsservice.so.0 -> libaccountsservice.so.0.0.0
Verifying ELF objects in /usr/src/tmp/accountsservice-buildroot (arch=normal,fhs=normal,lfs=relaxed,lint=relaxed,rpath=normal,stack=normal,textrel=normal,unresolved=normal)
Hardlinking identical .pyc and .pyo files
Processing files: accountsservice-0.6.54-alt1
Executing(%doc): /bin/sh -e /usr/src/tmp/rpm-tmp.71853
+ umask 022
+ /bin/mkdir -p /usr/src/RPM/BUILD
+ cd /usr/src/RPM/BUILD
+ cd accountsservice-0.6.54
+ DOCDIR=/usr/src/tmp/accountsservice-buildroot/usr/share/doc/accountsservice-0.6.54
+ export DOCDIR
+ rm -rf /usr/src/tmp/accountsservice-buildroot/usr/share/doc/accountsservice-0.6.54
+ /bin/mkdir -p /usr/src/tmp/accountsservice-buildroot/usr/share/doc/accountsservice-0.6.54
+ cp -prL COPYING README.md AUTHORS NEWS /usr/src/tmp/accountsservice-buildroot/usr/share/doc/accountsservice-0.6.54
+ chmod -R go-w /usr/src/tmp/accountsservice-buildroot/usr/share/doc/accountsservice-0.6.54
+ chmod -R a+rX /usr/src/tmp/accountsservice-buildroot/usr/share/doc/accountsservice-0.6.54
+ exit 0
Finding Provides (using /usr/lib/rpm/find-provides)
Executing: /bin/sh -e /usr/src/tmp/rpm-tmp.j1vWMN
find-provides: running scripts (alternatives,debuginfo,gir,lib,pam,perl,pkgconfig,python,shell,typelib)
Finding Requires (using /usr/lib/rpm/find-requires)
Executing: /bin/sh -e /usr/src/tmp/rpm-tmp.Xj09oO
find-requires: running scripts (cpp,debuginfo,files,gir-js,gir-python,gir,lib,pam,perl,pkgconfig,pkgconfiglib,python,rpmlib,shebang,shell,static,symlinks,typelib)
Requires: polkit, shadow-utils, libaccountsservice = 0.6.54-alt1, /lib/ld-linux.so.2, libc.so.6(GLIBC_2.0), libc.so.6(GLIBC_2.1), libc.so.6(GLIBC_2.2), libc.so.6(GLIBC_2.2.4), libc.so.6(GLIBC_2.4), libgio-2.0.so.0 >= set:oiFVNLZILDuNVrYyYKRhcsdk6kHq2k7zt4L8Vy6nOs6ktrvE0TnOIWB6dFMbA4irT1sEvXppKBTWMu5xQnlyDG2ZnwmoCB3WBGNPstxCtW4HlZ3LZCBX7WZhShJYJp21A9b4OwMMfmXlbKH80UQAOtMAF8VCKtKK8lngStu, libglib-2.0.so.0 >= set:og1iApFEKSxbcR60978NAFdB69JR1XGvOWzDP05QRZwbS6XFB4gAV5fxlFrITJWcbdwZG2fRP53MzyciadqsvZ6glsv2iQMeaNs4ZlNC6uSNmvr3ZzP0MI8kBohxhxZu6ubP394nzFyoqPlZoCp2pK8N7dkc9IazLwZ1eSi8WNZ8eA3a1k9Y4mIeTr3hZmtfxC7R7daloiOdbDQpOrmMRxIA2jU3lSMZ0kVhdzeH02YqBqJdJrcoY3b4sVawKhDGsyYfuX4Dm2tlgsN2wgQEA39nFUHg0YLRbRILoq4ns8bvnANRM8tgTNmAEuD9uTHtpylWGeJu6Fjaubgv6y2TZjU92k8z3UBQxahsoAAK0I59bpSjAnEgR58rVTuWrig6gnLOJhUKndBl3RPKUA3D0, libgobject-2.0.so.0 >= set:mg2foJz1uAZ6JZmO4VJYLn1yUYerYIsyryrmdmZECd94lOp6f6PGb1Q0W2Cltohf2ooexm4G8LmQWhwBPCYYATlxOKutcEXGgwAgBf5YrWhd1n1FouQ03CJbuHLGUEZ7YkDezIJFCCevn7uLz2, libpolkit-gobject-1.so.0 >= set:liVcnQmoaKIi9BPaCUAG94, rtld(GNU_HASH)
Requires(rpmlib): rpmlib(SetVersions)
Finding debuginfo files (using /usr/lib/rpm/find-debuginfo-files)
Executing: /bin/sh -e /usr/src/tmp/rpm-tmp.yvCUz7
Creating accountsservice-debuginfo package
Processing files: libaccountsservice-0.6.54-alt1
Finding Provides (using /usr/lib/rpm/find-provides)
Executing: /bin/sh -e /usr/src/tmp/rpm-tmp.IIev9Y
find-provides: running scripts (alternatives,debuginfo,gir,lib,pam,perl,pkgconfig,python,shell,typelib)
lib.prov: /usr/src/tmp/accountsservice-buildroot/usr/lib/libaccountsservice.so.0: 507 symbols, 19 bpp
Finding Requires (using /usr/lib/rpm/find-requires)
Executing: /bin/sh -e /usr/src/tmp/rpm-tmp.uMmTYp
find-requires: running scripts (cpp,debuginfo,files,gir-js,gir-python,gir,lib,pam,perl,pkgconfig,pkgconfiglib,python,rpmlib,shebang,shell,static,symlinks,typelib)
Provides: libaccountsservice.so.0 = set:mdijdJptPaUnMFgQF8EsAXaajXy1OTEZfp8BpRlHqNLBZaRwS7FgqGcwtlmvryZFO7vCtOGdwIgZF4RSFxwBzkPcoGLQzZf4cBSm26ytZCm8pAjQJeOljgzddQooimrbPVZl0tcZjASHE68ie58yhD37xdojWA9a4aByteEEQsSQ1zTrdVGRQJ4gTomYlt2PhiF7jjilZ38pAUs9WCsxRCoUCzhXIFa7hMaJHF8viiNNZEhPQcqZ7SZyQ5wzhxeLBEO8KKK8jx0CwuQ5gYZHDxNaVBYaVER3Hp7TjMCWSvyXZf16bzM3UBojc5btuMfN2BvsgZodS01QlogOZqTnqD8ibRogDovbz6nTilzwtoeRc9ZfIZ86N0HTgFrE9elXBg638LmGFZ9auuJpC3PuS3H7O9XdC0zGF3ZmQ4XMzzRU14RWEkvPqYS51iA8ZsNnsrZbBtVbv4yxa7m2BH8UZ34TSiAHIvLqOZ70gjWP5Zzw2bCpwiZ9ZpxvRmA8P43ugItWdSIRwovAcbk8ipnmWTHFSZqVsLQtcHhosEk4QGlfxqitlPeeZ7IlNtfRZojBx2ReJzAiAVDNZEz3FA5ETUmKT8SLlsYjyqCJbPUMGghZ6nHyZpXA5FNLAU7hahxMocgjxfOkVkoPJCoVKfKpdBYP7hF06SDoGn1nEjkoYJZHZwZnqtMooyARCWtwKzfyDg4Zu6ZCngmAFsFbOLZBIpZyFvU7foTbccX4uxCjRyJCQNiKOMq183lh6KSlxHYF2wLy0A9P5ZHIQvife5rnk3K2UGh5979w4bq5cEAanfylM3qiBUH2zA3z2bDZ1YtwABEDnKi6kcZfp8MsGuZdVf7HJwvWnCSxhtXZ5S1Td1XMlMFov5hukCvPiDfnBO5DndiI75ditd7fqysX1Z4s6IBbFsUydq5oALDz4jXFZngp0HGi46ltr4aZBtG6F7CtOUaHlxiCIrMopAFZGpWxoD83qspaAeYe3PUm0
Requires: libc.so.6(GLIBC_2.0), libc.so.6(GLIBC_2.1.3), libc.so.6(GLIBC_2.4), libcrypt.so.1 >= set:ihuTa, libcrypt.so.1(XCRYPT_2.0), libgio-2.0.so.0 >= set:oiFVhSuna2yN2VtXh2805K6GLgJ4pBefutcIaSVcE0VqL0LLApRbdqixTP0SyX2AbqCxfoVfk1ZzgbcPOlwaEc1bKNsMaXQBsZ6QO2ADFeTjv12okD9rQLAsjTe7lWa, libglib-2.0.so.0 >= set:oh1iM8pCPUZj8qoFZd7id2ISkuZq5uVwL5T0ySAJ25G4181Us2uGLb60pdKusinaTEt5rqUxrzcYLqUYZE5SgalHUqQdLXEEZya6NfqwTyZBMdcWTB1TRxhVBQdtJoEyHjE4zRFOB3eAJ4woh7luEChDlYAD8EZIlcMGJTwpcEBsSH26nI086dWvZGEtZlxxZJG8VGgLK6CQ1v7r1oNNtDOAWYvQbJre5LbgXc45KZfwFPAWZhu65SycRK0JyzDHDHEkeO43nsOxjBxf, libgobject-2.0.so.0 >= set:mf3sZdGRe3Y8XJmv9jOrZfu58wveAGBdubDMdNmVxU4HnQIAgk9fLdXawNIt90Q0OYzc4ltohfZfg1ZFjQyg5pP66UkfG530vedVhQZKoFnRWo0WK62A4GRFJ2ycIDefG5s5UZz2kqRRh3oMItNZ5gceGUQZjuGjDhO7euBCCevj7uLz0, libsystemd.so.0 >= set:njTbQTk21LKXvMKZtgEGgd07Ph7iIeJR4LDi1FkR2, libsystemd.so.0(LIBSYSTEMD_209), rtld(GNU_HASH)
Requires(rpmlib): rpmlib(SetVersions)
Finding debuginfo files (using /usr/lib/rpm/find-debuginfo-files)
Executing: /bin/sh -e /usr/src/tmp/rpm-tmp.gwX83X
Creating libaccountsservice-debuginfo package
Processing files: libaccountsservice-devel-0.6.54-alt1
Finding Provides (using /usr/lib/rpm/find-provides)
Executing: /bin/sh -e /usr/src/tmp/rpm-tmp.cqzH9g
find-provides: running scripts (alternatives,debuginfo,gir,lib,pam,perl,pkgconfig,python,shell,typelib)
Finding Requires (using /usr/lib/rpm/find-requires)
Executing: /bin/sh -e /usr/src/tmp/rpm-tmp.oTVqSv
find-requires: running scripts (cpp,debuginfo,files,gir-js,gir-python,gir,lib,pam,perl,pkgconfig,pkgconfiglib,python,rpmlib,shebang,shell,static,symlinks,typelib)
In file included from /usr/src/tmp/accountsservice-buildroot/usr/include/accountsservice-1.0/act/act.h:24:
/usr/src/tmp/accountsservice-buildroot/usr/include/accountsservice-1.0/act/act-user-enum-types.h:7:10: fatal error: glib-object.h: No such file or directory
 #include <glib-object.h>
          ^~~~~~~~~~~~~~~
compilation terminated.
cpp.req: /usr/src/tmp/accountsservice-buildroot/usr/include/accountsservice-1.0/act/act.h: cpp failed, trying c++ mode
i586-alt-linux-cpp: error trying to exec 'cc1plus': execvp: No such file or directory
cpp.req: WARNING: /usr/src/tmp/accountsservice-buildroot/usr/include/accountsservice-1.0/act/act.h: cpp failed
/usr/src/tmp/accountsservice-buildroot/usr/include/accountsservice-1.0/act/act-user.h:29:10: fatal error: glib.h: No such file or directory
 #include <glib.h>
          ^~~~~~~~
compilation terminated.
cpp.req: WARNING: /usr/src/tmp/accountsservice-buildroot/usr/include/accountsservice-1.0/act/act-user.h: cpp failed
/usr/src/tmp/accountsservice-buildroot/usr/include/accountsservice-1.0/act/act-user-manager.h:24:10: fatal error: glib-object.h: No such file or directory
 #include <glib-object.h>
          ^~~~~~~~~~~~~~~
compilation terminated.
cpp.req: WARNING: /usr/src/tmp/accountsservice-buildroot/usr/include/accountsservice-1.0/act/act-user-manager.h: cpp failed
/usr/src/tmp/accountsservice-buildroot/usr/include/accountsservice-1.0/act/act-user-enum-types.h:7:10: fatal error: glib-object.h: No such file or directory
 #include <glib-object.h>
          ^~~~~~~~~~~~~~~
compilation terminated.
cpp.req: WARNING: /usr/src/tmp/accountsservice-buildroot/usr/include/accountsservice-1.0/act/act-user-enum-types.h: cpp failed
Provides: pkgconfig(accountsservice) = 0.6.54
Requires: libaccountsservice = 0.6.54-alt1, /usr/lib/libaccountsservice.so.0, /usr/lib/pkgconfig
Finding debuginfo files (using /usr/lib/rpm/find-debuginfo-files)
Executing: /bin/sh -e /usr/src/tmp/rpm-tmp.3gcUni
Processing files: libaccountsservice-gir-0.6.54-alt1
Finding Provides (using /usr/lib/rpm/find-provides)
Executing: /bin/sh -e /usr/src/tmp/rpm-tmp.WYbpOs
find-provides: running scripts (alternatives,debuginfo,gir,lib,pam,perl,pkgconfig,python,shell,typelib)
Finding Requires (using /usr/lib/rpm/find-requires)
Executing: /bin/sh -e /usr/src/tmp/rpm-tmp.Iq5p19
find-requires: running scripts (cpp,debuginfo,files,gir-js,gir-python,gir,lib,pam,perl,pkgconfig,pkgconfiglib,python,rpmlib,shebang,shell,static,symlinks,typelib)
Provides: typelib(AccountsService) = 1.0
Requires: libaccountsservice = 0.6.54-alt1, typelib(GObject) = 2.0, typelib(Gio) = 2.0
Finding debuginfo files (using /usr/lib/rpm/find-debuginfo-files)
Executing: /bin/sh -e /usr/src/tmp/rpm-tmp.NLeTyf
Processing files: libaccountsservice-gir-devel-0.6.54-alt1
Finding Provides (using /usr/lib/rpm/find-provides)
Executing: /bin/sh -e /usr/src/tmp/rpm-tmp.YcK6qw
find-provides: running scripts (alternatives,debuginfo,gir,lib,pam,perl,pkgconfig,python,shell,typelib)
Finding Requires (using /usr/lib/rpm/find-requires)
Executing: /bin/sh -e /usr/src/tmp/rpm-tmp.oT5M16
find-requires: running scripts (cpp,debuginfo,files,gir-js,gir-python,gir,lib,pam,perl,pkgconfig,pkgconfiglib,python,rpmlib,shebang,shell,static,symlinks,typelib)
Provides: gir(AccountsService) = 1.0
Requires: libaccountsservice-devel = 0.6.54-alt1, libaccountsservice-gir = 0.6.54-alt1, gir(GObject) = 2.0, gir(Gio) = 2.0
Processing files: accountsservice-debuginfo-0.6.54-alt1
Finding Provides (using /usr/lib/rpm/find-provides)
Executing: /bin/sh -e /usr/src/tmp/rpm-tmp.lqIyx9
find-provides: running scripts (debuginfo)
Finding Requires (using /usr/lib/rpm/find-requires)
Executing: /bin/sh -e /usr/src/tmp/rpm-tmp.2l8cTk
find-requires: running scripts (debuginfo)
Requires: accountsservice = 0.6.54-alt1, /usr/lib/debug/lib/ld-linux.so.2.debug, debug(libc.so.6), debug(libgio-2.0.so.0), debug(libglib-2.0.so.0), debug(libgobject-2.0.so.0), debug(libpolkit-gobject-1.so.0)
Processing files: libaccountsservice-debuginfo-0.6.54-alt1
Finding Provides (using /usr/lib/rpm/find-provides)
Executing: /bin/sh -e /usr/src/tmp/rpm-tmp.gOYgHO
find-provides: running scripts (debuginfo)
Finding Requires (using /usr/lib/rpm/find-requires)
Executing: /bin/sh -e /usr/src/tmp/rpm-tmp.jAQarx
find-requires: running scripts (debuginfo)
Provides: debug(libaccountsservice.so.0)
Requires: libaccountsservice = 0.6.54-alt1, debug(libc.so.6), debug(libcrypt.so.1), debug(libgio-2.0.so.0), debug(libglib-2.0.so.0), debug(libgobject-2.0.so.0), debug(libsystemd.so.0)
Adding to accountsservice a strict dependency on libaccountsservice
Adding to accountsservice-debuginfo a strict dependency on accountsservice
Adding to libaccountsservice-devel a strict dependency on libaccountsservice
Adding to libaccountsservice-gir a strict dependency on libaccountsservice
Adding to libaccountsservice-debuginfo a strict dependency on libaccountsservice
Adding to libaccountsservice-gir-devel a strict dependency on libaccountsservice-devel
Adding to libaccountsservice-gir-devel a strict dependency on libaccountsservice-gir
Adding to accountsservice-debuginfo a strict dependency on libaccountsservice-debuginfo
Removing from accountsservice-debuginfo 4 sources provided by libaccountsservice-debuginfo
also prunning dir /usr/src/debug/accountsservice-0.6.54/i586-alt-linux/src
also prunning dir /usr/src/debug/accountsservice-0.6.54/i586-alt-linux
Removing 1 extra deps from libaccountsservice-devel due to dependency on libaccountsservice
Removing 4 extra deps from accountsservice due to repentancy on libaccountsservice
Removing 4 extra deps from accountsservice-debuginfo due to repentancy on libaccountsservice-debuginfo
Wrote: /usr/src/RPM/RPMS/i586/accountsservice-0.6.54-alt1.i586.rpm
Wrote: /usr/src/RPM/RPMS/i586/libaccountsservice-0.6.54-alt1.i586.rpm
Wrote: /usr/src/RPM/RPMS/i586/libaccountsservice-devel-0.6.54-alt1.i586.rpm
Wrote: /usr/src/RPM/RPMS/i586/libaccountsservice-gir-0.6.54-alt1.i586.rpm
Wrote: /usr/src/RPM/RPMS/noarch/libaccountsservice-gir-devel-0.6.54-alt1.noarch.rpm
Wrote: /usr/src/RPM/RPMS/i586/accountsservice-debuginfo-0.6.54-alt1.i586.rpm
Wrote: /usr/src/RPM/RPMS/i586/libaccountsservice-debuginfo-0.6.54-alt1.i586.rpm
29.87user 2.98system 0:46.03elapsed 71%CPU (0avgtext+0avgdata 46428maxresident)k
0inputs+0outputs (0major+995853minor)pagefaults 0swaps
50.19user 7.97system 1:13.12elapsed 79%CPU (0avgtext+0avgdata 119548maxresident)k
0inputs+0outputs (0major+1664598minor)pagefaults 0swaps