<86>Mar  6 11:30:16 userdel[118831]: delete user 'rooter'
<86>Mar  6 11:30:16 userdel[118831]: removed group 'rooter' owned by 'rooter'
<86>Mar  6 11:30:16 userdel[118831]: removed shadow group 'rooter' owned by 'rooter'
<86>Mar  6 11:30:16 groupadd[119093]: group added to /etc/group: name=rooter, GID=699
<86>Mar  6 11:30:16 groupadd[119093]: group added to /etc/gshadow: name=rooter
<86>Mar  6 11:30:16 groupadd[119093]: new group: name=rooter, GID=699
<86>Mar  6 11:30:16 useradd[119176]: new user: name=rooter, UID=699, GID=699, home=/root, shell=/bin/bash
<86>Mar  6 11:30:16 userdel[119826]: delete user 'builder'
<86>Mar  6 11:30:16 userdel[119826]: removed group 'builder' owned by 'builder'
<86>Mar  6 11:30:16 userdel[119826]: removed shadow group 'builder' owned by 'builder'
<86>Mar  6 11:30:16 groupadd[120015]: group added to /etc/group: name=builder, GID=700
<86>Mar  6 11:30:16 groupadd[120015]: group added to /etc/gshadow: name=builder
<86>Mar  6 11:30:16 groupadd[120015]: new group: name=builder, GID=700
<86>Mar  6 11:30:16 useradd[120217]: new user: name=builder, UID=700, GID=700, home=/usr/src, shell=/bin/bash
warning: Macro %cmake_insource not found
<13>Mar  6 11:30:28 rpmi: xorg-proto-devel-2018.4-alt3 1527685079 installed
<13>Mar  6 11:30:28 rpmi: libgpg-error-1.31-alt1.S1 1529015802 installed
<13>Mar  6 11:30:28 rpmi: libboost_system1.67.0-1:1.67.0-alt5 sisyphus+222775.100.1.3 1551154450 installed
<13>Mar  6 11:30:28 rpmi: libjpeg-2:1.5.1-alt1 1498218318 installed
<13>Mar  6 11:30:28 rpmi: libpng16-1.6.36-alt1 sisyphus+219478.100.1.1 1547633314 installed
<13>Mar  6 11:30:28 rpmi: libexpat-2.2.4-alt1 1503305345 installed
<13>Mar  6 11:30:28 rpmi: libICE-1.0.9-alt1 1409902721 installed
<13>Mar  6 11:30:29 rpmi: libicu63-1:6.3.1-alt1 sisyphus.215328.100 1540049988 installed
<13>Mar  6 11:30:29 rpmi: libSM-1.2.3-alt1 sisyphus.215747.100 1540812795 installed
<13>Mar  6 11:30:29 rpmi: libglvnd-7:1.1.0-alt3 sisyphus.215982.100 1541498632 installed
<13>Mar  6 11:30:29 rpmi: xml-utils-1:2.9.4.0.12.e905-alt1.1 1525115767 installed
<13>Mar  6 11:30:29 rpmi: qt4-common-4.8.7-alt13.S1 1535591248 installed
<13>Mar  6 11:30:29 rpmi: libqt4-core-4.8.7-alt13.S1 1535591248 installed
<13>Mar  6 11:30:29 rpmi: libqt4-xml-4.8.7-alt13.S1 1535591248 installed
<13>Mar  6 11:30:29 rpmi: libqt4-sql-4.8.7-alt13.S1 1535591248 installed
<13>Mar  6 11:30:29 rpmi: libgcrypt20-1.8.3-alt4 sisyphus+222598.100.1.1 1550924043 installed
<13>Mar  6 11:30:29 rpmi: libogg-1.3.3-alt1 sisyphus+221902.4000.4.1 1550598661 installed
<13>Mar  6 11:30:29 rpmi: libwayland-client-1.16.0-alt1 1535614871 installed
<13>Mar  6 11:30:29 rpmi: shared-mime-info-1.12-alt1 sisyphus+219597.100.2.2 1548057005 installed
<13>Mar  6 11:30:29 rpmi: kde-common-15.12.1-alt1 1453450783 installed
<13>Mar  6 11:30:29 rpmi: kde4pimlibs-common-4.14.11-alt9.S1 1524201573 installed
<13>Mar  6 11:30:29 rpmi: libsqlite3-3.26.0-alt2 sisyphus+220766.100.5.1 1549611685 installed
<13>Mar  6 11:30:29 rpmi: libidn2-2.1.1-alt1 sisyphus+221274.100.1.2 1549951289 installed
<13>Mar  6 11:30:29 rpmi: libnettle6-3.4.1-alt1 sisyphus.217427.100 1544107917 installed
<13>Mar  6 11:30:29 rpmi: libopenblas-0.2.20-alt1 1527005646 installed
<13>Mar  6 11:30:29 rpmi: libgdbm-1.8.3-alt10 1454943334 installed
<13>Mar  6 11:30:29 rpmi: libqt4-sql-sqlite-4.8.7-alt13.S1 1535591248 installed
<13>Mar  6 11:30:29 rpmi: libxslt-1.1.32-alt2 1517429984 installed
<13>Mar  6 11:30:29 rpmi: libqt4-test-4.8.7-alt13.S1 1535591248 installed
<13>Mar  6 11:30:29 rpmi: libqjson-0.8.1-alt2 1446565447 installed
<13>Mar  6 11:30:29 rpmi: libical-3.0.4-alt1 sisyphus.215328.400 1540234054 installed
<13>Mar  6 11:30:29 rpmi: libICE-devel-1.0.9-alt1 1409902721 installed
<13>Mar  6 11:30:29 rpmi: libSM-devel-1.2.3-alt1 sisyphus.215747.100 1540812795 installed
<13>Mar  6 11:30:29 rpmi: libboost_thread1.67.0-1:1.67.0-alt5 sisyphus+222775.100.1.3 1551154450 installed
<13>Mar  6 11:30:29 rpmi: libassuan-2.5.1-alt1.S1 1516191052 installed
<13>Mar  6 11:30:29 rpmi: libgpg-error-devel-1.31-alt1.S1 1529015802 installed
<13>Mar  6 11:30:30 rpmi: libxerces-c-3.2.2-alt1.qa1 sisyphus+222675.100.1.1 1550961366 installed
<13>Mar  6 11:30:30 rpmi: zlib-devel-1.2.11-alt1 sisyphus+221902.6000.4.1 1550601058 installed
<86>Mar  6 11:30:30 groupadd[43154]: group added to /etc/group: name=utempter, GID=499
<86>Mar  6 11:30:30 groupadd[43154]: group added to /etc/gshadow: name=utempter
<86>Mar  6 11:30:30 groupadd[43154]: new group: name=utempter, GID=499
<13>Mar  6 11:30:30 rpmi: libutempter-1.1.6-alt2 1299636220 installed
<13>Mar  6 11:30:30 rpmi: libgif-4.1.6-alt3 1299634261 installed
<13>Mar  6 11:30:30 rpmi: libwayland-server-1.16.0-alt1 1535614871 installed
<13>Mar  6 11:30:30 rpmi: libXdmcp-1.1.1-alt1 1334617701 installed
<13>Mar  6 11:30:30 rpmi: libXau-1.0.9-alt1 sisyphus+223149.200.2.1 1551268152 installed
<13>Mar  6 11:30:30 rpmi: libxcb-1.13.1-alt1 sisyphus.214413.100 1539170896 installed
<13>Mar  6 11:30:30 rpmi: ilmbase12-common-2.2.0-alt1.1 1434452921 installed
<13>Mar  6 11:30:30 rpmi: libiex12-2.2.0-alt1.1 1434452921 installed
<13>Mar  6 11:30:30 rpmi: libhalf12-2.2.0-alt1.1 1434452921 installed
<13>Mar  6 11:30:30 rpmi: su-0.60-alt35 1484567251 installed
<13>Mar  6 11:30:30 rpmi: libgraphite2-1.3.13-alt1 sisyphus.218545.100 1545686511 installed
<13>Mar  6 11:30:30 rpmi: libharfbuzz-2.2.0-alt1 sisyphus.218134.500 1545261518 installed
<13>Mar  6 11:30:30 rpmi: libfreetype-2.9.1-alt1.S1 1530781053 installed
<13>Mar  6 11:30:30 rpmi: fontconfig-2.13.1-alt1 sisyphus.215917.100 1540973886 installed
Updating fonts cache: <29>Mar  6 11:30:31 fontconfig: Updating fonts cache: succeeded
[ DONE ]
<13>Mar  6 11:30:31 rpmi: libtasn1-4.13-alt2 1521133850 installed
<13>Mar  6 11:30:31 rpmi: libp11-kit-0.23.9-alt5 1525798298 installed
<13>Mar  6 11:30:31 rpmi: icon-theme-hicolor-0.17-alt1 1505715846 installed
<13>Mar  6 11:30:32 rpmi: menu-icons-default-0.2.0.20-alt1 1479213521 installed
<13>Mar  6 11:30:32 rpmi: altlinux-freedesktop-menu-icon-theme-default-0.0.26-alt1 1366231495 installed
<13>Mar  6 11:30:32 rpmi: libharfbuzz-icu-2.2.0-alt1 sisyphus.218134.500 1545261518 installed
<13>Mar  6 11:30:32 rpmi: libgraphite2-devel-1.3.13-alt1 sisyphus.218545.100 1545686511 installed
<13>Mar  6 11:30:32 rpmi: libilmthread12-2.2.0-alt1.1 1434452921 installed
<13>Mar  6 11:30:33 rpmi: libxcb-devel-1.13.1-alt1 sisyphus.214413.100 1539170896 installed
<13>Mar  6 11:30:33 rpmi: libXau-devel-1.0.9-alt1 sisyphus+223149.200.2.1 1551268152 installed
<13>Mar  6 11:30:33 rpmi: libXdmcp-devel-1.1.1-alt1 1334617701 installed
<13>Mar  6 11:30:33 rpmi: libgif-devel-4.1.6-alt3 1299634261 installed
<13>Mar  6 11:30:33 rpmi: libutempter-devel-1.1.6-alt2 1299636220 installed
<13>Mar  6 11:30:33 rpmi: libpng-devel-1.6.36-alt1 sisyphus+219478.100.1.1 1547633314 installed
<13>Mar  6 11:30:33 rpmi: libboost_type_erasure1.67.0-1:1.67.0-alt5 sisyphus+222775.100.1.3 1551154450 installed
<13>Mar  6 11:30:33 rpmi: libgdbm-devel-1.8.3-alt10 1454943334 installed
<13>Mar  6 11:30:33 rpmi: libarchive13-3.3.1-alt2 sisyphus.219343.100 1547461970 installed
<13>Mar  6 11:30:33 rpmi: libhogweed4-3.4.1-alt1 sisyphus.217427.100 1544107917 installed
<13>Mar  6 11:30:33 rpmi: libgnutls30-3.6.6-alt1 sisyphus+219978.100.1.1 1548422819 installed
<13>Mar  6 11:30:33 rpmi: libakonadi4-kabc-4.14.11-alt9.S1 1524201573 installed
<13>Mar  6 11:30:33 rpmi: libwayland-egl-4:18.1.0-alt1 1535614871 installed
<13>Mar  6 11:30:33 rpmi: libflac8-1.3.2-alt1 1507623955 installed
<13>Mar  6 11:30:33 rpmi: libvorbis-1.3.6-alt2 sisyphus+220072.200.2.2 1548744475 installed
<13>Mar  6 11:30:33 rpmi: automoc-0.9.88-alt1.qa1 1366273811 installed
<13>Mar  6 11:30:33 rpmi: libqt4-clucene-4.8.7-alt13.S1 1535591248 installed
<13>Mar  6 11:30:33 rpmi: rpm-macros-qt4-4.8.7-alt13.S1 1535591089 installed
<13>Mar  6 11:30:56 rpmi: qt4-doc-html-4.8.7-alt13.S1 1535591089 installed
<13>Mar  6 11:30:57 rpmi: qt4-doc-examples-src-4.8.7-alt13.S1 1535591089 installed
<13>Mar  6 11:30:57 rpmi: rpm-build-gir-0.7.2-alt4 1534675014 installed
<13>Mar  6 11:30:57 rpmi: libOpenGL-7:1.1.0-alt3 sisyphus.215982.100 1541498632 installed
<13>Mar  6 11:30:57 rpmi: libGLES-7:1.1.0-alt3 sisyphus.215982.100 1541498632 installed
<13>Mar  6 11:30:57 rpmi: libboost_regex1.67.0-1:1.67.0-alt5 sisyphus+222775.100.1.3 1551154450 installed
<13>Mar  6 11:30:57 rpmi: libboost_graph1.67.0-1:1.67.0-alt5 sisyphus+222775.100.1.3 1551154450 installed
<13>Mar  6 11:30:57 rpmi: icu-utils-1:6.3.1-alt1 sisyphus.215328.100 1540049988 installed
<13>Mar  6 11:30:57 rpmi: libicu-devel-1:6.3.1-alt1 sisyphus.215328.100 1540049988 installed
<13>Mar  6 11:30:57 rpmi: libtiff5-4.0.3-alt1 1348347501 installed
<13>Mar  6 11:30:57 rpmi: libjasper-2.0.14-alt1 1530105217 installed
<13>Mar  6 11:30:57 rpmi: libboost_atomic1.67.0-1:1.67.0-alt5 sisyphus+222775.100.1.3 1551154450 installed
<13>Mar  6 11:30:57 rpmi: libboost_contract1.67.0-1:1.67.0-alt5 sisyphus+222775.100.1.3 1551154450 installed
<13>Mar  6 11:30:57 rpmi: libboost_random1.67.0-1:1.67.0-alt5 sisyphus+222775.100.1.3 1551154450 installed
<13>Mar  6 11:30:57 rpmi: libboost_chrono1.67.0-1:1.67.0-alt5 sisyphus+222775.100.1.3 1551154450 installed
<13>Mar  6 11:30:57 rpmi: libboost_timer1.67.0-1:1.67.0-alt5 sisyphus+222775.100.1.3 1551154450 installed
<13>Mar  6 11:30:57 rpmi: libboost_filesystem1.67.0-1:1.67.0-alt5 sisyphus+222775.100.1.3 1551154450 installed
<13>Mar  6 11:30:57 rpmi: libksba-1.3.6-alt8 sisyphus.218050.140 1545222925 installed
<13>Mar  6 11:30:57 rpmi: libdb4.7-devel-4.7.25-alt9 1490438479 installed
<13>Mar  6 11:30:57 rpmi: perl-devel-1:5.28.1-alt1 sisyphus+219907.100.1.1 1548343222 installed
<13>Mar  6 11:30:57 rpmi: swig-data-1:3.0.12-alt6 sisyphus+219804.100.1.1 1548164495 installed
<13>Mar  6 11:30:57 rpmi: libboost_program_options1.67.0-1:1.67.0-alt5 sisyphus+222775.100.1.3 1551154450 installed
<13>Mar  6 11:30:57 rpmi: qt5-base-common-5.11.3-alt2 sisyphus+221574.100.1.2 1550273545 installed
<13>Mar  6 11:30:57 rpmi: libpcre2-10.32-alt1 sisyphus.212994.100 1536866761 installed
<13>Mar  6 11:30:57 rpmi: libqt5-core-5.11.3-alt2 sisyphus+221574.100.1.2 1550273545 installed
<13>Mar  6 11:30:57 rpmi: libqrencode4-4.0.2-alt1 sisyphus.213106.400 1537186499 installed
<13>Mar  6 11:30:57 rpmi: libdmtx-0.7.2-alt7 1527709184 installed
<13>Mar  6 11:30:57 rpmi: sgml-common-0.6.3-alt15 1423664786 installed
<13>Mar  6 11:30:57 rpmi: docbook-dtds-4.5-alt1 1223476557 installed
<13>Mar  6 11:30:58 rpmi: docbook-style-xsl-1.79.1-alt2 sisyphus.213665.100 1537949315 installed
<13>Mar  6 11:30:58 rpmi: shared-desktop-ontologies-1:0.11.0-alt1 1378390330 installed
<13>Mar  6 11:30:58 rpmi: shared-desktop-ontologies-devel-1:0.11.0-alt1 1378390330 installed
<13>Mar  6 11:30:58 rpmi: bzlib-devel-1:1.0.6-alt5 1508883171 installed
<13>Mar  6 11:30:58 rpmi: libpcre16-8.43-alt1 sisyphus+222771.100.1.1 1551029673 installed
<13>Mar  6 11:30:58 rpmi: pcretest-8.43-alt1 sisyphus+222771.100.1.1 1551029673 installed
<13>Mar  6 11:30:58 rpmi: libpcre-devel-8.43-alt1 sisyphus+222771.100.1.1 1551029673 installed
<13>Mar  6 11:30:58 rpmi: libltdl7-2.4.2-alt8 sisyphus+220900.100.1.1 1549488295 installed
<13>Mar  6 11:30:58 rpmi: libunixODBC2-2.3.4-alt2.1 sisyphus+220885.100.1.1 1549488931 installed
<13>Mar  6 11:30:58 rpmi: libunixODBC-devel-compat-2.3.4-alt2.1 sisyphus+220885.100.1.1 1549488931 installed
<13>Mar  6 11:30:58 rpmi: libunixODBC-devel-2.3.4-alt2.1 sisyphus+220885.100.1.1 1549488931 installed
<13>Mar  6 11:30:58 rpmi: libalsa-1:1.1.8-alt2 sisyphus+221894.200.4.1 1550583286 installed
<13>Mar  6 11:30:58 rpmi: libgsm-1.0.17-alt1 1523356165 installed
<13>Mar  6 11:30:58 rpmi: libsndfile-1.0.28-alt2 sisyphus.212728.100 1536333068 installed
<13>Mar  6 11:30:58 rpmi: libasyncns-0.8-alt2.qa1 1365949820 installed
<13>Mar  6 11:30:58 rpmi: libhunspell-1.7.0-alt1 sisyphus.216944.100 1543319096 installed
<13>Mar  6 11:30:58 rpmi: libenchant-1.6.0-alt3.qa1 1460409853 installed
<13>Mar  6 11:30:58 rpmi: libwebp7-1.0.2-alt1 sisyphus+219651.100.1.2 1548057725 installed
<13>Mar  6 11:30:58 rpmi: liborc-0.4.28-alt1 1511201506 installed
<13>Mar  6 11:30:58 rpmi: libgudev-1:232-alt3 1523738518 installed
<13>Mar  6 11:30:58 rpmi: libxshmfence-1.3-alt1 sisyphus+223149.1000.2.1 1551268571 installed
<13>Mar  6 11:30:58 rpmi: libpciaccess-1:0.14-alt1 1528969252 installed
<13>Mar  6 11:30:58 rpmi: libdrm-1:2.4.97-alt1 sisyphus+220483.100.1.1 1549270242 installed
<13>Mar  6 11:30:58 rpmi: libgbm-4:18.3.4-alt1 sisyphus+222018.100.1.1 1550567661 installed
<13>Mar  6 11:30:58 rpmi: liblz4-1:1.8.3-alt2 sisyphus+221902.4200.4.1 1550599659 installed
<13>Mar  6 11:30:58 rpmi: libsystemd-1:241-alt3 sisyphus+222052.100.2.1 1550681059 installed
<13>Mar  6 11:30:58 rpmi: libdbus-1.12.12-alt2 sisyphus+221234.100.1.2 1549918047 installed
<13>Mar  6 11:30:58 rpmi: libqt4-dbus-4.8.7-alt13.S1 1535591248 installed
<13>Mar  6 11:30:58 rpmi: libqt4-script-4.8.7-alt13.S1 1535591248 installed
<13>Mar  6 11:30:58 rpmi: libstrigi-0.7.8-alt8 1529687726 installed
<13>Mar  6 11:30:58 rpmi: libstrigi-devel-0.7.8-alt8 1529687726 installed
<13>Mar  6 11:30:59 rpmi: libpulseaudio-12.2-alt1 1535623585 installed
<13>Mar  6 11:30:59 rpmi: libdbus-devel-1.12.12-alt2 sisyphus+221234.100.1.2 1549918047 installed
<13>Mar  6 11:30:59 rpmi: liblcms2-2.9-alt1 1516411892 installed
<13>Mar  6 11:30:59 rpmi: libmng-2.0.3-alt2 sisyphus+222619.100.1.1 1550943853 installed
<13>Mar  6 11:30:59 rpmi: openexr22-common-2.2.0-alt3 sisyphus+221267.100.1.2 1549944972 installed
<13>Mar  6 11:30:59 rpmi: libilmimf22-2.2.0-alt3 sisyphus+221267.100.1.2 1549944972 installed
<13>Mar  6 11:30:59 rpmi: url_handler-0.3.1-alt1 1290564262 installed
<13>Mar  6 11:30:59 rpmi: libX11-locales-3:1.6.7-alt1 sisyphus.214413.200 1539171080 installed
<13>Mar  6 11:30:59 rpmi: libX11-3:1.6.7-alt1 sisyphus.214413.200 1539171143 installed
<13>Mar  6 11:30:59 rpmi: libXext-1.3.3-alt1 1409902959 installed
<13>Mar  6 11:30:59 rpmi: libX11-devel-3:1.6.7-alt1 sisyphus.214413.200 1539171143 installed
<13>Mar  6 11:30:59 rpmi: libXrender-0.9.8-alt1 1371312112 installed
<13>Mar  6 11:30:59 rpmi: libXfixes-5.0.3-alt1 sisyphus.216396.300 1542022162 installed
<13>Mar  6 11:30:59 rpmi: libXfixes-devel-5.0.3-alt1 sisyphus.216396.300 1542022162 installed
<13>Mar  6 11:30:59 rpmi: libXrender-devel-0.9.8-alt1 1371312112 installed
<13>Mar  6 11:30:59 rpmi: libXext-devel-1.3.3-alt1 1409902959 installed
<13>Mar  6 11:30:59 rpmi: libXcursor-1.1.15-alt1.S1 1512373366 installed
<13>Mar  6 11:30:59 rpmi: libXtst-1.2.2-alt1 1369984893 installed
<13>Mar  6 11:30:59 rpmi: libXt-1.1.4-alt1 1369984722 installed
<13>Mar  6 11:30:59 rpmi: libXrandr-1.5.0-alt1 1431936189 installed
<13>Mar  6 11:30:59 rpmi: libXi-1.7.9-alt1.S1 1515755342 installed
<13>Mar  6 11:30:59 rpmi: libXi-devel-1.7.9-alt1.S1 1515755342 installed
<13>Mar  6 11:30:59 rpmi: libXtst-devel-1.2.2-alt1 1369984893 installed
<13>Mar  6 11:30:59 rpmi: libXinerama-1.1.4-alt1 sisyphus+223149.300.2.1 1551268216 installed
<13>Mar  6 11:31:00 rpmi: libqt4-gui-4.8.7-alt13.S1 1535591248 installed
<13>Mar  6 11:31:00 rpmi: libqt4-svg-4.8.7-alt13.S1 1535591248 installed
<13>Mar  6 11:31:00 rpmi: libqt4-uitools-4.8.7-alt13.S1 1535591248 installed
<13>Mar  6 11:31:00 rpmi: libphonon-4.8.3-alt1 1418134069 installed
<13>Mar  6 11:31:01 rpmi: libqt4-designer-4.8.7-alt13.S1 1535591248 installed
<13>Mar  6 11:31:01 rpmi: libqt4-multimedia-4.8.7-alt13.S1 1535591248 installed
<13>Mar  6 11:31:01 rpmi: libqt4-scripttools-4.8.7-alt13.S1 1535591248 installed
<13>Mar  6 11:31:01 rpmi: libXxf86vm-1.1.4-alt2 1527672187 installed
<13>Mar  6 11:31:01 rpmi: libXScrnSaver-1.2.3-alt1 sisyphus+223149.500.2.1 1551268358 installed
<13>Mar  6 11:31:01 rpmi: libXdamage-1.1.3-alt4 1297162593 installed
<13>Mar  6 11:31:01 rpmi: libGLX-mesa-4:18.3.4-alt1 sisyphus+222018.100.1.1 1550567661 installed
<13>Mar  6 11:31:01 rpmi: libEGL-mesa-4:18.3.4-alt1 sisyphus+222018.100.1.1 1550567661 installed
<13>Mar  6 11:31:01 rpmi: libEGL-7:1.1.0-alt3 sisyphus.215982.100 1541498632 installed
<13>Mar  6 11:31:01 rpmi: libGLX-7:1.1.0-alt3 sisyphus.215982.100 1541498632 installed
<13>Mar  6 11:31:01 rpmi: libGL-7:1.1.0-alt3 sisyphus.215982.100 1541498632 installed
<13>Mar  6 11:31:01 rpmi: libqt4-opengl-4.8.7-alt13.S1 1535591248 installed
<13>Mar  6 11:31:01 rpmi: libglvnd-devel-7:1.1.0-alt3 sisyphus.215982.100 1541498632 installed
<13>Mar  6 11:31:01 rpmi: libEGL-devel-4:18.3.4-alt1 sisyphus+222018.100.1.1 1550567661 installed
<13>Mar  6 11:31:01 rpmi: libGL-devel-4:18.3.4-alt1 sisyphus+222018.100.1.1 1550567661 installed
<13>Mar  6 11:31:01 rpmi: libGLU-4:9.0.0-alt1 1347643784 installed
<13>Mar  6 11:31:01 rpmi: libGLU-devel-4:9.0.0-alt1 1347643784 installed
<13>Mar  6 11:31:01 rpmi: libXdamage-devel-1.1.3-alt4 1297162593 installed
<13>Mar  6 11:31:01 rpmi: libXScrnSaver-devel-1.2.3-alt1 sisyphus+223149.500.2.1 1551268358 installed
<13>Mar  6 11:31:01 rpmi: libXxf86vm-devel-1.1.4-alt2 1527672187 installed
<13>Mar  6 11:31:01 rpmi: libphononexperimental-4.8.3-alt1 1418134069 installed
<13>Mar  6 11:31:01 rpmi: libdbusmenu-qt2-0.9.3-alt0.2 1463760662 installed
<13>Mar  6 11:31:01 rpmi: libprison0-1.1.1-alt1 sisyphus+223025.400.3.1 1551263266 installed
<13>Mar  6 11:31:01 rpmi: qt4-qvfb-4.8.7-alt13.S1 1535591248 installed
<13>Mar  6 11:31:01 rpmi: libXinerama-devel-1.1.4-alt1 sisyphus+223149.300.2.1 1551268216 installed
<13>Mar  6 11:31:01 rpmi: libXrandr-devel-1.5.0-alt1 1431936189 installed
<13>Mar  6 11:31:01 rpmi: libXmu-1.1.2-alt1 1391072530 installed
<13>Mar  6 11:31:01 rpmi: xset-1.2.4-alt1 sisyphus.213358.100 1537438594 installed
<13>Mar  6 11:31:01 rpmi: libXpm-3.5.12-alt1 sisyphus+223149.400.2.1 1551268289 installed
<13>Mar  6 11:31:01 rpmi: libXpm-devel-3.5.12-alt1 sisyphus+223149.400.2.1 1551268289 installed
<13>Mar  6 11:31:01 rpmi: libXt-devel-1.1.4-alt1 1369984722 installed
<13>Mar  6 11:31:01 rpmi: libXcursor-devel-1.1.15-alt1.S1 1512373366 installed
<13>Mar  6 11:31:01 rpmi: libXft-2.3.2-alt1 1409902660 installed
<13>Mar  6 11:31:01 rpmi: libXv-1.0.11-alt1 1527685499 installed
<13>Mar  6 11:31:01 rpmi: libXv-devel-1.0.11-alt1 1527685499 installed
<13>Mar  6 11:31:01 rpmi: xprop-1.2.3-alt1 sisyphus.213300.100 1537401932 installed
<13>Mar  6 11:31:01 rpmi: xdg-utils-1.1.3-alt5 sisyphus.216143.100 1541504685 installed
<13>Mar  6 11:31:01 rpmi: libXcomposite-0.4.3-alt3 1297306936 installed
<13>Mar  6 11:31:01 rpmi: libXcomposite-devel-0.4.3-alt3 1297306936 installed
<13>Mar  6 11:31:01 rpmi: libxkbfile-1.0.9-alt1 1527685441 installed
<13>Mar  6 11:31:01 rpmi: libxkbfile-devel-1.0.9-alt1 1527685441 installed
<13>Mar  6 11:31:01 rpmi: desktop-file-utils-0.23-alt1 sisyphus.214313.100 1539037620 installed
<13>Mar  6 11:31:01 rpmi: rpm-macros-kde-common-devel-14.12.1-alt1 1422279175 installed
<13>Mar  6 11:31:01 rpmi: strace-4.26-alt1 sisyphus.218650.100 1545875033 installed
<13>Mar  6 11:31:01 rpmi: gsettings-desktop-schemas-data-3.28.1-alt1 sisyphus.212587.100 1536082062 installed
<13>Mar  6 11:31:01 rpmi: libgio-2.58.3-alt1 sisyphus+219722.100.1.1 1548088777 installed
<13>Mar  6 11:31:01 rpmi: gsettings-desktop-schemas-3.28.1-alt1 sisyphus.212587.100 1536082066 installed
<13>Mar  6 11:31:01 rpmi: libgstreamer1.0-1.14.4-alt1 sisyphus.214120.2200 1538778557 installed
<13>Mar  6 11:31:01 rpmi: libgst-plugins1.0-1.14.4-alt3 sisyphus+223362.100.1.1 1551499954 installed
<13>Mar  6 11:31:01 rpmi: libpolkit-0.115-alt5 sisyphus.219065.100 1547027030 installed
<13>Mar  6 11:31:01 rpmi: libpolkit-qt-core-1-0.112.0-alt1 1407931994 installed
<13>Mar  6 11:31:01 rpmi: gpgme-common-1.11.1-alt2 sisyphus+220199.100.1.1 1548802250 installed
<13>Mar  6 11:31:01 rpmi: libusb-1.0.22-alt1 1525452055 installed
<13>Mar  6 11:31:01 rpmi: libnpth-1.6-alt1_1 sisyphus.217989.100 1545066879 installed
<13>Mar  6 11:31:01 rpmi: gcc-c++-common-1.4.23-alt1 sisyphus+221902.2500.4.1 1550596716 installed
<13>Mar  6 11:31:02 rpmi: libstdc++8-devel-8.3.1-alt1 sisyphus+223348.100.1.1 1551470632 installed
<13>Mar  6 11:31:03 rpmi: gcc8-c++-8.3.1-alt1 sisyphus+223348.100.1.1 1551470632 installed
<13>Mar  6 11:31:03 rpmi: ed-1:0.2-alt10 1449768440 installed
<13>Mar  6 11:31:03 rpmi: rpm-utils-0.10-alt1 1481222510 installed
<13>Mar  6 11:31:03 rpmi: kde-common-devel-14.12.1-alt1 1422279175 installed
<13>Mar  6 11:31:03 rpmi: rpm-macros-cmake-3.13.4-alt1 sisyphus+220827.100.1.2 1549497636 installed
<13>Mar  6 11:31:03 rpmi: cmake-modules-3.13.4-alt1 sisyphus+220827.100.1.2 1549497610 installed
<13>Mar  6 11:31:03 rpmi: libuv-1.23.2-alt1 sisyphus+222662.100.1.1 1550983208 installed
<13>Mar  6 11:31:03 rpmi: librhash-1.3.5-alt2 1505156279 installed
<13>Mar  6 11:31:03 rpmi: libjsoncpp19-1.8.4-alt2.S1 1518769525 installed
<13>Mar  6 11:31:03 rpmi: publicsuffix-list-dafsa-20181106-alt1 sisyphus.216228.100 1541611754 installed
<13>Mar  6 11:31:03 rpmi: libpsl-0.20.2-alt2 sisyphus+222635.100.1.1 1550951841 installed
<13>Mar  6 11:31:03 rpmi: libnghttp2-1.34.0-alt1 sisyphus+222625.100.1.1 1550947259 installed
<13>Mar  6 11:31:03 rpmi: libbrotlicommon-1.0.7-alt1 sisyphus.215491.100 1540428597 installed
<13>Mar  6 11:31:03 rpmi: libbrotlidec-1.0.7-alt1 sisyphus.215491.100 1540428597 installed
<13>Mar  6 11:31:03 rpmi: libboost_context1.67.0-1:1.67.0-alt5 sisyphus+222775.100.1.3 1551154450 installed
<13>Mar  6 11:31:03 rpmi: libboost_fiber1.67.0-1:1.67.0-alt5 sisyphus+222775.100.1.3 1551154450 installed
<13>Mar  6 11:31:03 rpmi: libboost_stacktrace1.67.0-1:1.67.0-alt5 sisyphus+222775.100.1.3 1551154450 installed
<13>Mar  6 11:31:03 rpmi: libnumpy-py3-1:1.15.4-alt1 sisyphus.218638.200 1545948948 installed
<13>Mar  6 11:31:03 rpmi: libxblas-1.0.248-alt1.1 1496143682 installed
<13>Mar  6 11:31:03 rpmi: libquadmath0-8.3.1-alt1 sisyphus+223348.100.1.1 1551470632 installed
<13>Mar  6 11:31:03 rpmi: libgfortran5-8.3.1-alt1 sisyphus+223348.100.1.1 1551470632 installed
<13>Mar  6 11:31:03 rpmi: liblapack-1:3.8.0-alt3 sisyphus+221521.100.1.1 1550134903 installed
<13>Mar  6 11:31:03 rpmi: libnumpy-1:1.15.4-alt1 sisyphus.218638.200 1545948948 installed
<13>Mar  6 11:31:03 rpmi: python-modules-curses-2.7.15-alt1 sisyphus.217364.100 1544022423 installed
<13>Mar  6 11:31:03 rpmi: libverto-0.3.0-alt1_7 sisyphus+223221.100.1.1 1551348953 installed
<13>Mar  6 11:31:03 rpmi: libkeyutils-1.6-alt2 sisyphus.217337.100 1544003161 installed
<13>Mar  6 11:31:03 rpmi: libcom_err-1.44.5-alt1 sisyphus+221902.2000.4.1 1550595809 installed
<13>Mar  6 11:31:03 rpmi: libboost_python1.67.0-1:1.67.0-alt5 sisyphus+222775.100.1.3 1551154450 installed
<13>Mar  6 11:31:03 rpmi: libboost_test1.67.0-1:1.67.0-alt5 sisyphus+222775.100.1.3 1551154450 installed
<13>Mar  6 11:31:03 rpmi: libboost_serialization1.67.0-1:1.67.0-alt5 sisyphus+222775.100.1.3 1551154450 installed
<13>Mar  6 11:31:03 rpmi: libboost_iostreams1.67.0-1:1.67.0-alt5 sisyphus+222775.100.1.3 1551154450 installed
<13>Mar  6 11:31:03 rpmi: libboost_date_time1.67.0-1:1.67.0-alt5 sisyphus+222775.100.1.3 1551154450 installed
<13>Mar  6 11:31:03 rpmi: libboost_container1.67.0-1:1.67.0-alt5 sisyphus+222775.100.1.3 1551154450 installed
<13>Mar  6 11:31:03 rpmi: bc-1:1.07.1-alt1 sisyphus+221902.700.4.1 1550587857 installed
<13>Mar  6 11:31:03 rpmi: bash-builtin-lockf-0.3.1-alt1.qa1 1366318152 installed
<13>Mar  6 11:31:03 rpmi: altlinux-mime-defaults-0.433-alt1 sisyphus.216233.100 1541623461 installed
<13>Mar  6 11:31:03 rpmi: wm-common-freedesktop-1.3-alt1 1303402115 installed
<13>Mar  6 11:31:03 rpmi: altlinux-freedesktop-menu-common-0.66-alt1 sisyphus.213076.200 1537111008 installed
<13>Mar  6 11:31:03 rpmi: rpm-macros-alternatives-0.5.0-alt1 sisyphus+221902.300.4.1 1550587121 installed
<13>Mar  6 11:31:03 rpmi: alternatives-0.5.0-alt1 sisyphus+221902.300.4.1 1550587121 installed
<13>Mar  6 11:31:03 rpmi: ca-certificates-2019.02.01-alt1 sisyphus+220384.200.1.1 1549032756 installed
<13>Mar  6 11:31:03 rpmi: ca-trust-0.1.1-alt2 1515595785 installed
<13>Mar  6 11:31:03 rpmi: p11-kit-trust-0.23.9-alt5 1525798298 installed
<13>Mar  6 11:31:04 rpmi: libcrypto1.1-1.1.0j-alt2 sisyphus+223638.100.2.1 1551791072 installed
<13>Mar  6 11:31:04 rpmi: libssl1.1-1.1.0j-alt2 sisyphus+223638.100.2.1 1551791072 installed
<13>Mar  6 11:31:04 rpmi: libpython3-3.6.8-alt1 sisyphus+220164.200.3.1 1548842636 installed
<13>Mar  6 11:31:04 rpmi: python3-3.6.8-alt1 sisyphus+220164.200.3.1 1548842636 installed
<13>Mar  6 11:31:04 rpmi: python3-base-3.6.8-alt1 sisyphus+220164.200.3.1 1548842636 installed
<13>Mar  6 11:31:04 rpmi: libqt4-network-4.8.7-alt13.S1 1535591248 installed
<86>Mar  6 11:31:04 groupadd[110863]: group added to /etc/group: name=_keytab, GID=498
<86>Mar  6 11:31:04 groupadd[110863]: group added to /etc/gshadow: name=_keytab
<86>Mar  6 11:31:04 groupadd[110863]: new group: name=_keytab, GID=498
<13>Mar  6 11:31:05 rpmi: libkrb5-1.16.3-alt1 sisyphus+223678.100.1.1 1551746516 installed
<86>Mar  6 11:31:05 groupadd[111640]: group added to /etc/group: name=sasl, GID=497
<86>Mar  6 11:31:05 groupadd[111640]: group added to /etc/gshadow: name=sasl
<86>Mar  6 11:31:05 groupadd[111640]: new group: name=sasl, GID=497
<13>Mar  6 11:31:05 rpmi: libsasl2-3-2.1.27-alt1 sisyphus+222903.100.1.2 1551221734 installed
<13>Mar  6 11:31:05 rpmi: libldap-2.4.46-alt1.1 sisyphus+219907.4400.1.1 1548349979 installed
<13>Mar  6 11:31:05 rpmi: libcurl-7.64.0-alt1 sisyphus+220787.100.1.1 1549439379 installed
<13>Mar  6 11:31:05 rpmi: libqt4-qt3support-4.8.7-alt13.S1 1535591248 installed
<13>Mar  6 11:31:05 rpmi: libqt4-help-4.8.7-alt13.S1 1535591248 installed
<13>Mar  6 11:31:05 rpmi: python3-module-pkg_resources-1:40.8.0-alt1 sisyphus+221229.100.2.1 1550559950 installed
<13>Mar  6 11:31:05 rpmi: python3-module-six-1.12.0-alt1 sisyphus+219665.100.2.1 1548148570 installed
<13>Mar  6 11:31:05 rpmi: python3-module-more-itertools-5.0.0-alt1 sisyphus.218699.100 1545980609 installed
<13>Mar  6 11:31:05 rpmi: python3-module-nose-1:1.3.7-alt4.git20160316 sisyphus.213223.100 1537286725 installed
<13>Mar  6 11:31:05 rpmi: qt4-assistant-4.8.7-alt13.S1 1535591248 installed
<13>Mar  6 11:31:06 rpmi: cmake-3.13.4-alt1 sisyphus+220827.100.1.2 1549497636 installed
<13>Mar  6 11:31:06 rpmi: libkolabxml-1.0.3-alt1.qa1.1 1527863202 installed
<13>Mar  6 11:31:06 rpmi: gnupg2-2.2.10-alt4 sisyphus+223696.100.1.1 1551800056 installed
<13>Mar  6 11:31:06 rpmi: libgpgme11-1.11.1-alt2 sisyphus+220199.100.1.1 1548802250 installed
<13>Mar  6 11:31:06 rpmi: libgpgmexx4-4.14.11-alt9.S1 1524201573 installed
<13>Mar  6 11:31:06 rpmi: libgpgmexx4-pthread-4.14.11-alt9.S1 1524201573 installed
<13>Mar  6 11:31:06 rpmi: libqgpgme4-4.14.11-alt9.S1 1524201573 installed
<13>Mar  6 11:31:06 rpmi: libgpgmepp6-1.11.1-alt2 sisyphus+220199.100.1.1 1548802250 installed
<13>Mar  6 11:31:06 rpmi: libqgpgme7-1.11.1-alt2 sisyphus+220199.100.1.1 1548802250 installed
<13>Mar  6 11:31:06 rpmi: libgpgme-devel-1.11.1-alt2 sisyphus+220199.100.1.1 1548802250 installed
<13>Mar  6 11:31:06 rpmi: libtirpc-1.0.3-alt1 1532008017 installed
<13>Mar  6 11:31:06 rpmi: libnsl2-1.1.0-alt1_1 1511548749 installed
<13>Mar  6 11:31:06 rpmi: python-modules-compiler-2.7.15-alt1 sisyphus.217364.100 1544022423 installed
<13>Mar  6 11:31:06 rpmi: python-modules-email-2.7.15-alt1 sisyphus.217364.100 1544022423 installed
<13>Mar  6 11:31:06 rpmi: python-modules-unittest-2.7.15-alt1 sisyphus.217364.100 1544022423 installed
<13>Mar  6 11:31:06 rpmi: python-modules-nis-2.7.15-alt1 sisyphus.217364.100 1544022423 installed
<13>Mar  6 11:31:06 rpmi: python-modules-encodings-2.7.15-alt1 sisyphus.217364.100 1544022423 installed
<13>Mar  6 11:31:07 rpmi: python-modules-2.7.15-alt1 sisyphus.217364.100 1544022423 installed
<13>Mar  6 11:31:07 rpmi: python-module-six-1.12.0-alt1 sisyphus+219665.100.2.1 1548148570 installed
<13>Mar  6 11:31:07 rpmi: python-modules-ctypes-2.7.15-alt1 sisyphus.217364.100 1544022423 installed
<13>Mar  6 11:31:07 rpmi: python-modules-multiprocessing-2.7.15-alt1 sisyphus.217364.100 1544022423 installed
<13>Mar  6 11:31:07 rpmi: python-modules-logging-2.7.15-alt1 sisyphus.217364.100 1544022423 installed
<13>Mar  6 11:31:07 rpmi: python-module-more-itertools-5.0.0-alt1 sisyphus.218699.100 1545980609 installed
<13>Mar  6 11:31:07 rpmi: python-modules-xml-2.7.15-alt1 sisyphus.217364.100 1544022423 installed
<13>Mar  6 11:31:07 rpmi: python-modules-hotshot-2.7.15-alt1 sisyphus.217364.100 1544022423 installed
<13>Mar  6 11:31:07 rpmi: python-modules-bsddb-2.7.15-alt1 sisyphus.217364.100 1544022423 installed
<13>Mar  6 11:31:07 rpmi: python-2.7.15-alt1 sisyphus.217364.100 1544022423 installed
<13>Mar  6 11:31:07 rpmi: python-strict-2.7.15-alt1 sisyphus.217364.100 1544022396 installed
<13>Mar  6 11:31:07 rpmi: python-module-attrs-18.2.0-alt1 sisyphus.214354.100 1539088435 installed
<13>Mar  6 11:31:07 rpmi: python-modules-distutils-2.7.15-alt1 sisyphus.217364.100 1544022423 installed
<13>Mar  6 11:31:07 rpmi: python-module-py-1.7.0-alt1 sisyphus.214414.220 1539670883 installed
<13>Mar  6 11:31:07 rpmi: python-module-funcsigs-1.0.2-alt2 sisyphus+220258.100.1.1 1548882900 installed
<13>Mar  6 11:31:07 rpmi: python-module-scandir-1.9.0-alt1 1535455370 installed
<13>Mar  6 11:31:07 rpmi: python-module-pathlib2-2.3.3-alt1 sisyphus.218098.100 1545218863 installed
<13>Mar  6 11:31:07 rpmi: python-module-atomicwrites-1.3.0-alt1 sisyphus+221237.100.1.2 1549921064 installed
<13>Mar  6 11:31:07 rpmi: python-modules-json-2.7.15-alt1 sisyphus.217364.100 1544022423 installed
<13>Mar  6 11:31:07 rpmi: python-module-pkg_resources-1:40.8.0-alt1 sisyphus+221229.100.2.1 1550559950 installed
<13>Mar  6 11:31:07 rpmi: python-module-pluggy-0.8.1-alt1 sisyphus.219350.100 1547468434 installed
<13>Mar  6 11:31:07 rpmi: python-module-pytest-3.10.1-alt4 sisyphus+220988.200.2.1 1549800021 installed
<13>Mar  6 11:31:07 rpmi: python-module-numpy-1:1.15.4-alt1 sisyphus.218638.200 1545948948 installed
<13>Mar  6 11:31:07 rpmi: python-module-numpy-testing-1:1.15.4-alt1 sisyphus.218638.200 1545948948 installed
<13>Mar  6 11:31:07 rpmi: libboost_numpy1.67.0-1:1.67.0-alt5 sisyphus+222775.100.1.3 1551154450 installed
<13>Mar  6 11:31:07 rpmi: libqt4-xmlpatterns-4.8.7-alt13.S1 1535591248 installed
<13>Mar  6 11:31:08 rpmi: libqt4-declarative-4.8.7-alt13.S1 1535591248 installed
<13>Mar  6 11:31:09 rpmi: libqt4-webkit-1:2.3.4-alt6 sisyphus+222741.100.1.1 1551110841 installed
<13>Mar  6 11:31:09 rpmi: libqt4-4.8.7-alt13.S1 1535591089 installed
<13>Mar  6 11:31:09 rpmi: qt4-doc-examples-bin-4.8.7-alt13.S1 1535591248 installed
<13>Mar  6 11:31:09 rpmi: qt4-doc-examples-4.8.7-alt13.S1 1535591089 installed
<13>Mar  6 11:31:09 rpmi: qt4-doc-4.8.7-alt13.S1 1535591089 installed
<13>Mar  6 11:31:09 rpmi: libattica0.4-0.4.2-alt1 1375339023 installed
<13>Mar  6 11:31:09 rpmi: python3-module-atomicwrites-1.3.0-alt1 sisyphus+221237.100.1.2 1549921064 installed
<13>Mar  6 11:31:09 rpmi: python3-module-attrs-18.2.0-alt1 sisyphus.214354.100 1539088435 installed
<13>Mar  6 11:31:09 rpmi: python3-module-pluggy-0.8.1-alt1 sisyphus.219350.100 1547468434 installed
<13>Mar  6 11:31:09 rpmi: python3-module-py-1.7.0-alt1 sisyphus.214414.220 1539670883 installed
<13>Mar  6 11:31:09 rpmi: python3-module-pytest-3.10.1-alt4 sisyphus+220988.200.2.1 1549800021 installed
<13>Mar  6 11:31:09 rpmi: python3-module-numpy-testing-1:1.15.4-alt1 sisyphus.218638.200 1545948948 installed
<13>Mar  6 11:31:09 rpmi: python3-module-numpy-1:1.15.4-alt1 sisyphus.218638.200 1545948948 installed
<13>Mar  6 11:31:10 rpmi: glib2-devel-2.58.3-alt1 sisyphus+219722.100.1.1 1548088777 installed
<13>Mar  6 11:31:10 rpmi: libharfbuzz-devel-2.2.0-alt1 sisyphus.218134.500 1545261518 installed
<13>Mar  6 11:31:10 rpmi: libfreetype-devel-2.9.1-alt1.S1 1530781053 installed
<13>Mar  6 11:31:10 rpmi: fontconfig-devel-2.13.1-alt1 sisyphus.215917.100 1540973886 installed
<13>Mar  6 11:31:10 rpmi: libXft-devel-2.3.2-alt1 1409902660 installed
<13>Mar  6 11:31:10 rpmi: libboost_python3-1.67.0-1:1.67.0-alt5 sisyphus+222775.100.1.3 1551154450 installed
<13>Mar  6 11:31:10 rpmi: libboost_numpy3-1.67.0-1:1.67.0-alt5 sisyphus+222775.100.1.3 1551154450 installed
<13>Mar  6 11:31:11 rpmi: boost-devel-headers-1:1.67.0-alt5 sisyphus+222775.100.1.3 1551154333 installed
<13>Mar  6 11:31:11 rpmi: boost-devel-1:1.67.0-alt5 sisyphus+222775.100.1.3 1551154450 installed
<13>Mar  6 11:31:11 rpmi: libssl-devel-1.1.0j-alt2 sisyphus+223638.100.2.1 1551791072 installed
<13>Mar  6 11:31:11 rpmi: phonon-devel-4.8.3-alt1 1418134069 installed
<13>Mar  6 11:31:11 rpmi: libqt4-webkit-devel-1:2.3.4-alt6 sisyphus+222741.100.1.1 1551110841 installed
<13>Mar  6 11:31:12 rpmi: libqt4-devel-4.8.7-alt13.S1 1535591248 installed
<13>Mar  6 11:31:12 rpmi: qt4-designer-4.8.7-alt13.S1 1535591248 installed
<13>Mar  6 11:31:12 rpmi: libqca2-2.2.0-alt0.1.S1 1535533007 installed
<13>Mar  6 11:31:12 rpmi: altlinux-freedesktop-menu-shallow-menu-0.66-alt1 sisyphus.213076.200 1537111008 installed
<13>Mar  6 11:31:12 rpmi: altlinux-freedesktop-menu-generic-0.66-alt1 sisyphus.213076.200 1537111008 installed
<13>Mar  6 11:31:12 rpmi: altlinux-freedesktop-menu-kde4-0.66-alt1 sisyphus.213076.200 1537111008 installed
<13>Mar  6 11:31:13 rpmi: kde4libs-4.14.38-alt3 sisyphus.216623.100 1542711753 installed
<13>Mar  6 11:31:13 rpmi: libkmime4-4.14.11-alt9.S1 1524201573 installed
<13>Mar  6 11:31:13 rpmi: libkpimutils4-4.14.11-alt9.S1 1524201573 installed
<13>Mar  6 11:31:13 rpmi: libkcalcore4-4.14.11-alt9.S1 1524201573 installed
<13>Mar  6 11:31:13 rpmi: libmicroblog4-4.14.11-alt9.S1 1524201573 installed
<13>Mar  6 11:31:13 rpmi: libkpimtextedit4-4.14.11-alt9.S1 1524201573 installed
<13>Mar  6 11:31:13 rpmi: libkpimidentities4-4.14.11-alt9.S1 1524201573 installed
<13>Mar  6 11:31:13 rpmi: libkcalutils4-4.14.11-alt9.S1 1524201573 installed
<13>Mar  6 11:31:13 rpmi: libakonadi4-notes-4.14.11-alt9.S1 1524201573 installed
<13>Mar  6 11:31:13 rpmi: libkimap4-4.14.11-alt9.S1 1524201573 installed
<13>Mar  6 11:31:13 rpmi: libkmbox4-4.14.11-alt9.S1 1524201573 installed
<13>Mar  6 11:31:14 rpmi: kde4libs-devel-4.14.38-alt3 sisyphus.216623.100 1542711753 installed
<13>Mar  6 11:31:14 rpmi: libkresources4-4.14.11-alt9.S1 1524201573 installed
<13>Mar  6 11:31:14 rpmi: libkabc4-4.14.11-alt9.S1 1524201573 installed
<13>Mar  6 11:31:14 rpmi: libkcal4-4.14.11-alt9.S1 1524201573 installed
<13>Mar  6 11:31:14 rpmi: libktnef4-4.14.11-alt9.S1 1524201573 installed
<13>Mar  6 11:31:14 rpmi: libkabc4_file_core-4.14.11-alt9.S1 1524201573 installed
<13>Mar  6 11:31:14 rpmi: libkholidays4-4.14.11-alt9.S1 1524201573 installed
<13>Mar  6 11:31:14 rpmi: libkxmlrpcclient4-4.14.11-alt9.S1 1524201573 installed
<13>Mar  6 11:31:14 rpmi: libsyndication4-4.14.11-alt9.S1 1524201573 installed
<13>Mar  6 11:31:14 rpmi: libkblog4-4.14.11-alt9.S1 1524201573 installed
<13>Mar  6 11:31:14 rpmi: libkldap4-4.14.11-alt9.S1 1524201573 installed
<13>Mar  6 11:31:14 rpmi: libkontactinterface4-4.14.11-alt9.S1 1524201573 installed
<13>Mar  6 11:31:14 rpmi: akonadi-common-1.13.1-alt0.5.S1 1527858315 installed
<13>Mar  6 11:31:14 rpmi: libakonadiprotocolinternals-1.13.1-alt0.5.S1 1527858315 installed
<13>Mar  6 11:31:14 rpmi: libakonadi4-kde-4.14.11-alt9.S1 1524201573 installed
<13>Mar  6 11:31:14 rpmi: libakonadi4-xml-4.14.11-alt9.S1 1524201573 installed
<13>Mar  6 11:31:14 rpmi: libakonadi4-contact-4.14.11-alt9.S1 1524201573 installed
<13>Mar  6 11:31:14 rpmi: libakonadi4-kmime-4.14.11-alt9.S1 1524201573 installed
<13>Mar  6 11:31:14 rpmi: libmailtransport4-4.14.11-alt9.S1 1524201573 installed
<13>Mar  6 11:31:14 rpmi: libakonadi4-calendar-4.14.11-alt9.S1 1524201573 installed
<13>Mar  6 11:31:14 rpmi: libakonadi4-kcal-4.14.11-alt9.S1 1524201573 installed
<13>Mar  6 11:31:14 rpmi: libakonadi4-socialutils-4.14.11-alt9.S1 1524201573 installed
<13>Mar  6 11:31:14 rpmi: libkalarmcal4-4.14.11-alt9.S1 1524201573 installed
<13>Mar  6 11:31:14 rpmi: kde4pimlibs-4.14.11-alt9.S1 1524201573 installed
<13>Mar  6 11:31:14 rpmi: kde4pimlibs-devel-4.14.11-alt9.S1 1524201573 installed
<13>Mar  6 11:31:14 rpmi: qt4-devel-4.8.7-alt13.S1 1535591089 installed
<13>Mar  6 11:31:14 rpmi: boost-program_options-devel-1:1.67.0-alt5 sisyphus+222775.100.1.3 1551154450 installed
<13>Mar  6 11:31:14 rpmi: libkolabxml-devel-1.0.3-alt1.qa1.1 1527863202 installed
<13>Mar  6 11:31:14 rpmi: libcurl-devel-7.64.0-alt1 sisyphus+220787.100.1.1 1549439379 installed
<13>Mar  6 11:31:14 rpmi: gcc-c++-8-alt1 sisyphus+222164.100.1.1 1550685959 installed
<13>Mar  6 11:31:14 rpmi: swig-1:3.0.12-alt6 sisyphus+219804.100.1.1 1548164511 installed
<13>Mar  6 11:31:15 rpmi: libxerces-c-devel-3.2.2-alt1.qa1 sisyphus+222675.100.1.1 1550961366 installed
Building target platforms: i586
Building for target i586
Wrote: /usr/src/in/nosrpm/libkolab-0.5.3-alt1.qa1.nosrc.rpm
Installing libkolab-0.5.3-alt1.qa1.src.rpm
Building target platforms: i586
Building for target i586
Executing(%prep): /bin/sh -e /usr/src/tmp/rpm-tmp.90090
+ umask 022
+ /bin/mkdir -p /usr/src/RPM/BUILD
+ cd /usr/src/RPM/BUILD
+ cd /usr/src/RPM/BUILD
+ rm -rf libkolab-0.5.3
+ echo 'Source #0 (libkolab-0.5.3.tar.gz):'
Source #0 (libkolab-0.5.3.tar.gz):
+ /bin/gzip -dc /usr/src/RPM/SOURCES/libkolab-0.5.3.tar.gz
+ /bin/tar -xf -
+ cd libkolab-0.5.3
+ /bin/chmod -c -Rf u+rwX,go-w .
+ exit 0
Executing(%build): /bin/sh -e /usr/src/tmp/rpm-tmp.90090
+ umask 022
+ /bin/mkdir -p /usr/src/RPM/BUILD
+ cd /usr/src/RPM/BUILD
+ cd libkolab-0.5.3
+ cmake . -DCMAKE_SKIP_RPATH:BOOL=ON -DCMAKE_SKIP_INSTALL_RPATH:BOOL=yes '-DCMAKE_C_FLAGS:STRING=-pipe -frecord-gcc-switches -Wall -g -O2 -march=i586 -mtune=generic' '-DCMAKE_CXX_FLAGS:STRING=-pipe -frecord-gcc-switches -Wall -g -O2 -march=i586 -mtune=generic' '-DCMAKE_Fortran_FLAGS:STRING=-pipe -frecord-gcc-switches -Wall -g -O2 -march=i586 -mtune=generic' -DCMAKE_INSTALL_PREFIX=/usr -DINCLUDE_INSTALL_DIR:PATH=/usr/include -DLIB_INSTALL_DIR:PATH=/usr/lib -DSYSCONF_INSTALL_DIR:PATH=/etc -DSHARE_INSTALL_PREFIX:PATH=/usr/share -DLIB_SUFFIX= -DLIB_DESTINATION=lib -DINCLUDE_INSTALL_DIR=/usr/include -DUSE_LIBCALENDARING=OFF
-- The C compiler identification is GNU 8.3.1
-- The CXX compiler identification is GNU 8.3.1
-- Check for working C compiler: /usr/bin/cc
-- Check for working C compiler: /usr/bin/cc -- works
-- Detecting C compiler ABI info
-- Detecting C compiler ABI info - done
-- Detecting C compile features
-- Detecting C compile features - done
-- Check for working CXX compiler: /usr/bin/c++
-- Check for working CXX compiler: /usr/bin/c++ -- works
-- Detecting CXX compiler ABI info
-- Detecting CXX compiler ABI info - done
-- Detecting CXX compile features
-- Detecting CXX compile features - done
CMake Deprecation Warning at /usr/share/cmake/Modules/FeatureSummary.cmake:671 (message):
  SET_PACKAGE_INFO is deprecated.  Use SET_PACKAGE_PROPERTIES instead.
Call Stack (most recent call first):
  cmake/modules/MacroLogFeature.cmake:96 (SET_PACKAGE_INFO)
  CMakeLists.txt:59 (macro_log_feature)


-- Looking for Q_WS_X11
-- Looking for Q_WS_X11 - found
-- Looking for Q_WS_WIN
-- Looking for Q_WS_WIN - not found
-- Looking for Q_WS_QWS
-- Looking for Q_WS_QWS - not found
-- Looking for Q_WS_MAC
-- Looking for Q_WS_MAC - not found
-- Found Qt4: /usr/bin/qmake-qt4 (found suitable version "4.8.7", minimum required is "4.6.0") 
-- Found Qt-Version 4.8.7 (using /usr/bin/qmake-qt4)
-- Looking for XOpenDisplay in /usr/lib/libX11.so;/usr/lib/libXext.so;/usr/lib/libXft.so;/usr/lib/libXau.so;/usr/lib/libXdmcp.so;/usr/lib/libXpm.so
-- Looking for XOpenDisplay in /usr/lib/libX11.so;/usr/lib/libXext.so;/usr/lib/libXft.so;/usr/lib/libXau.so;/usr/lib/libXdmcp.so;/usr/lib/libXpm.so - found
-- Looking for gethostbyname
-- Looking for gethostbyname - found
-- Looking for connect
-- Looking for connect - found
-- Looking for remove
-- Looking for remove - found
-- Looking for shmat
-- Looking for shmat - found
-- Looking for IceConnectionNumber in ICE
-- Looking for IceConnectionNumber in ICE - found
-- Found X11: /usr/lib/libX11.so
-- Looking for pthread.h
-- Looking for pthread.h - found
-- Looking for pthread_create
-- Looking for pthread_create - not found
-- Looking for pthread_create in pthreads
-- Looking for pthread_create in pthreads - not found
-- Looking for pthread_create in pthread
-- Looking for pthread_create in pthread - found
-- Found Threads: TRUE  
-- Found OpenSSL: /usr/lib/libcrypto.so (found version "1.1.0j")  
-- Looking for _POSIX_TIMERS
-- Looking for _POSIX_TIMERS - found
-- Found Automoc4: /usr/bin/automoc4  
-- Found Perl: /usr/bin/perl (found version "5.28.1") 
-- Found Phonon: /usr/include/kde4 (Required is at least version "4.3.80") 
-- Performing Test _OFFT_IS_64BIT
-- Performing Test _OFFT_IS_64BIT - Failed
-- Performing Test HAVE_FPIE_SUPPORT
-- Performing Test HAVE_FPIE_SUPPORT - Success
-- Performing Test __KDE_HAVE_W_OVERLOADED_VIRTUAL
-- Performing Test __KDE_HAVE_W_OVERLOADED_VIRTUAL - Success
-- Performing Test __KDE_HAVE_GCC_VISIBILITY
-- Performing Test __KDE_HAVE_GCC_VISIBILITY - Success
-- Found KDE 4.12 include dir: /usr/include/kde4
-- Found KDE 4.12 library dir: /usr/lib/kde4/devel
-- Found the KDE4 kconfig_compiler4 preprocessor: /usr/lib/kde4/bin/kconfig_compiler4
-- Found automoc4: /usr/bin/automoc4
-- Found KdepimLibs: /usr/lib/cmake/KdepimLibs/KdepimLibsConfig.cmake (Required is at least version "4.8") 
-- Found SWIG: /usr/bin/swig  

-----------------------------------------------------------------------------
-- The following external packages were located on your system.
-- This installation will have the extra features provided by these packages.
-----------------------------------------------------------------------------
   * Libkolabxml - Kolab XML Format 3 serializing library

-----------------------------------------------------------------------------
-- Congratulations! All external packages have been found.
-----------------------------------------------------------------------------

-- Boost version: 1.67.0
-- Boost version: 1.67.0
-- Found the following Boost libraries:
--   program_options
-- Configuring done
-- Generating done
CMake Warning:
  Manually-specified variables were not used by the project:

    CMAKE_Fortran_FLAGS
    CMAKE_SKIP_INSTALL_RPATH
    LIB_DESTINATION


-- Build files have been written to: /usr/src/RPM/BUILD/libkolab-0.5.3
+ make -j8
make[2]: Entering directory '/usr/src/RPM/BUILD/libkolab-0.5.3'
[  1%] Generating calendaring/moc_event.cxx
/usr/src/RPM/BUILD/libkolab-0.5.3/calendaring/event.h:0: Note: No relevant classes found. No output generated.
make[2]: Leaving directory '/usr/src/RPM/BUILD/libkolab-0.5.3'
make[2]: Entering directory '/usr/src/RPM/BUILD/libkolab-0.5.3'
[  2%] Generating calendaring/moc_event.cxx
/usr/src/RPM/BUILD/libkolab-0.5.3/calendaring/event.h:0: Note: No relevant classes found. No output generated.
make[2]: Leaving directory '/usr/src/RPM/BUILD/libkolab-0.5.3'
make[2]: Entering directory '/usr/src/RPM/BUILD/libkolab-0.5.3'
Scanning dependencies of target kolab_static
make[2]: Leaving directory '/usr/src/RPM/BUILD/libkolab-0.5.3'
make[2]: Entering directory '/usr/src/RPM/BUILD/libkolab-0.5.3'
Scanning dependencies of target kolab
make[2]: Leaving directory '/usr/src/RPM/BUILD/libkolab-0.5.3'
make[2]: Entering directory '/usr/src/RPM/BUILD/libkolab-0.5.3'
[  5%] Building CXX object CMakeFiles/kolab_static.dir/kolabformat/formathelpers.cpp.o
make[2]: Leaving directory '/usr/src/RPM/BUILD/libkolab-0.5.3'
make[2]: Entering directory '/usr/src/RPM/BUILD/libkolab-0.5.3'
[  6%] Building CXX object CMakeFiles/kolab_static.dir/kolabformat/errorhandler.cpp.o
make[2]: Leaving directory '/usr/src/RPM/BUILD/libkolab-0.5.3'
make[2]: Entering directory '/usr/src/RPM/BUILD/libkolab-0.5.3'
[  8%] Building CXX object CMakeFiles/kolab_static.dir/mime/mimeutils.cpp.o
make[2]: Leaving directory '/usr/src/RPM/BUILD/libkolab-0.5.3'
make[2]: Entering directory '/usr/src/RPM/BUILD/libkolab-0.5.3'
[  9%] Building CXX object CMakeFiles/kolab_static.dir/kolabformat/mimeobject.cpp.o
make[2]: Leaving directory '/usr/src/RPM/BUILD/libkolab-0.5.3'
make[2]: Entering directory '/usr/src/RPM/BUILD/libkolab-0.5.3'
[  7%] Building CXX object CMakeFiles/kolab_static.dir/kolabformat/v2helpers.cpp.o
make[2]: Leaving directory '/usr/src/RPM/BUILD/libkolab-0.5.3'
make[2]: Entering directory '/usr/src/RPM/BUILD/libkolab-0.5.3'
[  4%] Building CXX object CMakeFiles/kolab_static.dir/kolabformat/xmlobject.cpp.o
make[2]: Leaving directory '/usr/src/RPM/BUILD/libkolab-0.5.3'
make[2]: Entering directory '/usr/src/RPM/BUILD/libkolab-0.5.3'
[ 15%] Building CXX object CMakeFiles/kolab_static.dir/conversion/timezoneconverter.cpp.o
make[2]: Leaving directory '/usr/src/RPM/BUILD/libkolab-0.5.3'
make[2]: Entering directory '/usr/src/RPM/BUILD/libkolab-0.5.3'
[ 13%] Building CXX object CMakeFiles/kolab_static.dir/conversion/commonconversion.cpp.o
make[2]: Leaving directory '/usr/src/RPM/BUILD/libkolab-0.5.3'
make[2]: Entering directory '/usr/src/RPM/BUILD/libkolab-0.5.3'
[ 14%] Building CXX object CMakeFiles/kolab_static.dir/conversion/kolabconversion.cpp.o
make[2]: Leaving directory '/usr/src/RPM/BUILD/libkolab-0.5.3'
make[2]: Entering directory '/usr/src/RPM/BUILD/libkolab-0.5.3'
[ 16%] Building CXX object CMakeFiles/kolab_static.dir/kolabformatV2/kolabbase.cpp.o
make[2]: Leaving directory '/usr/src/RPM/BUILD/libkolab-0.5.3'
make[2]: Entering directory '/usr/src/RPM/BUILD/libkolab-0.5.3'
[ 10%] Building CXX object CMakeFiles/kolab.dir/kolabformat/kolabobject.cpp.o
/usr/src/RPM/BUILD/libkolab-0.5.3/kolabformat/kolabobject.cpp: In member function 'Kolab::ObjectType Kolab::KolabObjectReader::parseMimeMessage(const Ptr&)':
/usr/src/RPM/BUILD/libkolab-0.5.3/kolabformat/kolabobject.cpp:359:90: warning: 'virtual KMime::Headers::Base* KMime::Message::getHeaderByType(const char*)' is deprecated [-Wdeprecated-declarations]
         if (KMime::Headers::Base *xKolabHeader = msg->getHeaderByType(X_KOLAB_TYPE_HEADER)) {
                                                                                          ^
In file included from /usr/src/RPM/BUILD/libkolab-0.5.3/kolabformat/kolabobject.h:29,
                 from /usr/src/RPM/BUILD/libkolab-0.5.3/kolabformat/kolabobject.cpp:19:
/usr/include/kde4/kmime/kmime_message.h:111:52: note: declared here
     virtual KMIME_DEPRECATED KMime::Headers::Base *getHeaderByType( const char *type );
                                                    ^~~~~~~~~~~~~~~
/usr/src/RPM/BUILD/libkolab-0.5.3/kolabformat/kolabobject.cpp:376:95: warning: 'virtual KMime::Headers::Base* KMime::Message::getHeaderByType(const char*)' is deprecated [-Wdeprecated-declarations]
         KMime::Headers::Base *xKolabVersion = msg->getHeaderByType(X_KOLAB_MIME_VERSION_HEADER);
                                                                                               ^
In file included from /usr/src/RPM/BUILD/libkolab-0.5.3/kolabformat/kolabobject.h:29,
                 from /usr/src/RPM/BUILD/libkolab-0.5.3/kolabformat/kolabobject.cpp:19:
/usr/include/kde4/kmime/kmime_message.h:111:52: note: declared here
     virtual KMIME_DEPRECATED KMime::Headers::Base *getHeaderByType( const char *type );
                                                    ^~~~~~~~~~~~~~~
/usr/src/RPM/BUILD/libkolab-0.5.3/kolabformat/kolabobject.cpp:379:84: warning: 'virtual KMime::Headers::Base* KMime::Message::getHeaderByType(const char*)' is deprecated [-Wdeprecated-declarations]
             xKolabVersion = msg->getHeaderByType(X_KOLAB_MIME_VERSION_HEADER_COMPAT);
                                                                                    ^
In file included from /usr/src/RPM/BUILD/libkolab-0.5.3/kolabformat/kolabobject.h:29,
                 from /usr/src/RPM/BUILD/libkolab-0.5.3/kolabformat/kolabobject.cpp:19:
/usr/include/kde4/kmime/kmime_message.h:111:52: note: declared here
     virtual KMIME_DEPRECATED KMime::Headers::Base *getHeaderByType( const char *type );
                                                    ^~~~~~~~~~~~~~~
make[2]: Leaving directory '/usr/src/RPM/BUILD/libkolab-0.5.3'
make[2]: Entering directory '/usr/src/RPM/BUILD/libkolab-0.5.3'
[  3%] Building CXX object CMakeFiles/kolab_static.dir/kolabformat/kolabobject.cpp.o
/usr/src/RPM/BUILD/libkolab-0.5.3/kolabformat/kolabobject.cpp: In member function 'Kolab::ObjectType Kolab::KolabObjectReader::parseMimeMessage(const Ptr&)':
/usr/src/RPM/BUILD/libkolab-0.5.3/kolabformat/kolabobject.cpp:359:90: warning: 'virtual KMime::Headers::Base* KMime::Message::getHeaderByType(const char*)' is deprecated [-Wdeprecated-declarations]
         if (KMime::Headers::Base *xKolabHeader = msg->getHeaderByType(X_KOLAB_TYPE_HEADER)) {
                                                                                          ^
In file included from /usr/src/RPM/BUILD/libkolab-0.5.3/kolabformat/kolabobject.h:29,
                 from /usr/src/RPM/BUILD/libkolab-0.5.3/kolabformat/kolabobject.cpp:19:
/usr/include/kde4/kmime/kmime_message.h:111:52: note: declared here
     virtual KMIME_DEPRECATED KMime::Headers::Base *getHeaderByType( const char *type );
                                                    ^~~~~~~~~~~~~~~
/usr/src/RPM/BUILD/libkolab-0.5.3/kolabformat/kolabobject.cpp:376:95: warning: 'virtual KMime::Headers::Base* KMime::Message::getHeaderByType(const char*)' is deprecated [-Wdeprecated-declarations]
         KMime::Headers::Base *xKolabVersion = msg->getHeaderByType(X_KOLAB_MIME_VERSION_HEADER);
                                                                                               ^
In file included from /usr/src/RPM/BUILD/libkolab-0.5.3/kolabformat/kolabobject.h:29,
                 from /usr/src/RPM/BUILD/libkolab-0.5.3/kolabformat/kolabobject.cpp:19:
/usr/include/kde4/kmime/kmime_message.h:111:52: note: declared here
     virtual KMIME_DEPRECATED KMime::Headers::Base *getHeaderByType( const char *type );
                                                    ^~~~~~~~~~~~~~~
/usr/src/RPM/BUILD/libkolab-0.5.3/kolabformat/kolabobject.cpp:379:84: warning: 'virtual KMime::Headers::Base* KMime::Message::getHeaderByType(const char*)' is deprecated [-Wdeprecated-declarations]
             xKolabVersion = msg->getHeaderByType(X_KOLAB_MIME_VERSION_HEADER_COMPAT);
                                                                                    ^
In file included from /usr/src/RPM/BUILD/libkolab-0.5.3/kolabformat/kolabobject.h:29,
                 from /usr/src/RPM/BUILD/libkolab-0.5.3/kolabformat/kolabobject.cpp:19:
/usr/include/kde4/kmime/kmime_message.h:111:52: note: declared here
     virtual KMIME_DEPRECATED KMime::Headers::Base *getHeaderByType( const char *type );
                                                    ^~~~~~~~~~~~~~~
make[2]: Leaving directory '/usr/src/RPM/BUILD/libkolab-0.5.3'
make[2]: Entering directory '/usr/src/RPM/BUILD/libkolab-0.5.3'
[ 18%] Building CXX object CMakeFiles/kolab_static.dir/kolabformatV2/distributionlist.cpp.o
make[2]: Leaving directory '/usr/src/RPM/BUILD/libkolab-0.5.3'
make[2]: Entering directory '/usr/src/RPM/BUILD/libkolab-0.5.3'
[ 20%] Building CXX object CMakeFiles/kolab_static.dir/kolabformatV2/task.cpp.o
/usr/src/RPM/BUILD/libkolab-0.5.3/kolabformatV2/task.cpp: In member function 'void KolabV2::Task::saveTo(const Ptr&)':
/usr/src/RPM/BUILD/libkolab-0.5.3/kolabformatV2/task.cpp:338:41: warning: 'void KCalCore::Todo::setHasStartDate(bool)' is deprecated [-Wdeprecated-declarations]
   task->setHasStartDate( hasStartDate() );
                                         ^
In file included from /usr/src/RPM/BUILD/libkolab-0.5.3/kolabformatV2/task.h:39,
                 from /usr/src/RPM/BUILD/libkolab-0.5.3/kolabformatV2/task.cpp:34:
/usr/include/kde4/kcalcore/todo.h:143:30: note: declared here
     KCALCORE_DEPRECATED void setHasStartDate(bool hasStartDate);
                              ^~~~~~~~~~~~~~~
/usr/src/RPM/BUILD/libkolab-0.5.3/kolabformatV2/task.cpp:339:37: warning: 'void KCalCore::Todo::setHasDueDate(bool)' is deprecated [-Wdeprecated-declarations]
   task->setHasDueDate( hasDueDate() );
                                     ^
In file included from /usr/src/RPM/BUILD/libkolab-0.5.3/kolabformatV2/task.h:39,
                 from /usr/src/RPM/BUILD/libkolab-0.5.3/kolabformatV2/task.cpp:34:
/usr/include/kde4/kcalcore/todo.h:130:30: note: declared here
     KCALCORE_DEPRECATED void setHasDueDate(bool hasDueDate);
                              ^~~~~~~~~~~~~
make[2]: Leaving directory '/usr/src/RPM/BUILD/libkolab-0.5.3'
make[2]: Entering directory '/usr/src/RPM/BUILD/libkolab-0.5.3'
[ 19%] Building CXX object CMakeFiles/kolab_static.dir/kolabformatV2/event.cpp.o
/usr/src/RPM/BUILD/libkolab-0.5.3/kolabformatV2/event.cpp: In member function 'void KolabV2::Event::saveTo(const Ptr&)':
/usr/src/RPM/BUILD/libkolab-0.5.3/kolabformatV2/event.cpp:212:37: warning: 'void KCalCore::Event::setHasEndDate(bool)' is deprecated [-Wdeprecated-declarations]
   event->setHasEndDate( mHasEndDate );
                                     ^
In file included from /usr/src/RPM/BUILD/libkolab-0.5.3/kolabformatV2/event.h:39,
                 from /usr/src/RPM/BUILD/libkolab-0.5.3/kolabformatV2/event.cpp:34:
/usr/include/kde4/kcalcore/event.h:142:30: note: declared here
     KCALCORE_DEPRECATED void setHasEndDate(bool b);
                              ^~~~~~~~~~~~~
make[2]: Leaving directory '/usr/src/RPM/BUILD/libkolab-0.5.3'
make[2]: Entering directory '/usr/src/RPM/BUILD/libkolab-0.5.3'
[ 22%] Building CXX object CMakeFiles/kolab_static.dir/kolabformatV2/journal.cpp.o
make[2]: Leaving directory '/usr/src/RPM/BUILD/libkolab-0.5.3'
make[2]: Entering directory '/usr/src/RPM/BUILD/libkolab-0.5.3'
[ 25%] Building CXX object CMakeFiles/kolab_static.dir/calendaring/calendaring.cpp.o
make[2]: Leaving directory '/usr/src/RPM/BUILD/libkolab-0.5.3'
make[2]: Entering directory '/usr/src/RPM/BUILD/libkolab-0.5.3'
[ 24%] Building CXX object CMakeFiles/kolab_static.dir/kolabformatV2/note.cpp.o
make[2]: Leaving directory '/usr/src/RPM/BUILD/libkolab-0.5.3'
make[2]: Entering directory '/usr/src/RPM/BUILD/libkolab-0.5.3'
[ 27%] Building CXX object CMakeFiles/kolab_static.dir/calendaring/datetimeutils.cpp.o
make[2]: Leaving directory '/usr/src/RPM/BUILD/libkolab-0.5.3'
make[2]: Entering directory '/usr/src/RPM/BUILD/libkolab-0.5.3'
[ 21%] Building CXX object CMakeFiles/kolab.dir/kolabformat/xmlobject.cpp.o
make[2]: Leaving directory '/usr/src/RPM/BUILD/libkolab-0.5.3'
make[2]: Entering directory '/usr/src/RPM/BUILD/libkolab-0.5.3'
[ 26%] Building CXX object CMakeFiles/kolab_static.dir/calendaring/event.cpp.o
make[2]: Leaving directory '/usr/src/RPM/BUILD/libkolab-0.5.3'
make[2]: Entering directory '/usr/src/RPM/BUILD/libkolab-0.5.3'
[ 31%] Building CXX object CMakeFiles/kolab_static.dir/calendaring/moc_event.cxx.o
make[2]: Leaving directory '/usr/src/RPM/BUILD/libkolab-0.5.3'
make[2]: Entering directory '/usr/src/RPM/BUILD/libkolab-0.5.3'
[ 30%] Building CXX object CMakeFiles/kolab.dir/kolabformat/formathelpers.cpp.o
make[2]: Leaving directory '/usr/src/RPM/BUILD/libkolab-0.5.3'
make[2]: Entering directory '/usr/src/RPM/BUILD/libkolab-0.5.3'
[ 28%] Building CXX object CMakeFiles/kolab_static.dir/icalendar/icalendar.cpp.o
make[2]: Leaving directory '/usr/src/RPM/BUILD/libkolab-0.5.3'
make[2]: Entering directory '/usr/src/RPM/BUILD/libkolab-0.5.3'
[ 29%] Building CXX object CMakeFiles/kolab_static.dir/icalendar/imip.cpp.o
make[2]: Leaving directory '/usr/src/RPM/BUILD/libkolab-0.5.3'
make[2]: Entering directory '/usr/src/RPM/BUILD/libkolab-0.5.3'
[ 17%] Building CXX object CMakeFiles/kolab_static.dir/kolabformatV2/contact.cpp.o
/usr/src/RPM/BUILD/libkolab-0.5.3/kolabformatV2/contact.cpp: In member function 'virtual bool KolabV2::Contact::loadAttribute(QDomElement&)':
/usr/src/RPM/BUILD/libkolab-0.5.3/kolabformatV2/contact.cpp:642:5: warning: this statement may fall through [-Wimplicit-fallthrough=]
     if ( tagName == "manager-name" ) {
     ^~
/usr/src/RPM/BUILD/libkolab-0.5.3/kolabformatV2/contact.cpp:646:3: note: here
   case 'n':
   ^~~~
make[2]: Leaving directory '/usr/src/RPM/BUILD/libkolab-0.5.3'
make[2]: Entering directory '/usr/src/RPM/BUILD/libkolab-0.5.3'
[ 33%] Building CXX object CMakeFiles/kolab.dir/kolabformat/errorhandler.cpp.o
make[2]: Leaving directory '/usr/src/RPM/BUILD/libkolab-0.5.3'
make[2]: Entering directory '/usr/src/RPM/BUILD/libkolab-0.5.3'
[ 12%] Building CXX object CMakeFiles/kolab_static.dir/conversion/kabcconversion.cpp.o
/usr/src/RPM/BUILD/libkolab-0.5.3/conversion/kabcconversion.cpp: In function 'const char* Kolab::Conversion::cryptoMessageFormatToString(Kolab::Conversion::CryptoMessageFormat)':
/usr/src/RPM/BUILD/libkolab-0.5.3/conversion/kabcconversion.cpp:86:13: warning: this 'for' clause does not guard... [-Wmisleading-indentation]
             for ( unsigned int i = 0 ; i < numCryptoMessageFormats ; ++i )
             ^~~
/usr/src/RPM/BUILD/libkolab-0.5.3/conversion/kabcconversion.cpp:89:17: note: ...this statement, but the latter is misleadingly indented as if it were guarded by the 'for'
                 return 0;
                 ^~~~~~
/usr/src/RPM/BUILD/libkolab-0.5.3/conversion/kabcconversion.cpp: In function 'QStringList Kolab::Conversion::cryptoMessageFormatsToStringList(unsigned int)':
/usr/src/RPM/BUILD/libkolab-0.5.3/conversion/kabcconversion.cpp:94:13: warning: this 'for' clause does not guard... [-Wmisleading-indentation]
             for ( unsigned int i = 0 ; i < numCryptoMessageFormats ; ++i )
             ^~~
/usr/src/RPM/BUILD/libkolab-0.5.3/conversion/kabcconversion.cpp:97:17: note: ...this statement, but the latter is misleadingly indented as if it were guarded by the 'for'
                 return result;
                 ^~~~~~
/usr/src/RPM/BUILD/libkolab-0.5.3/conversion/kabcconversion.cpp: In function 'Kolab::Conversion::CryptoMessageFormat Kolab::Conversion::stringToCryptoMessageFormat(const QString&)':
/usr/src/RPM/BUILD/libkolab-0.5.3/conversion/kabcconversion.cpp:103:13: warning: this 'for' clause does not guard... [-Wmisleading-indentation]
             for ( unsigned int i = 0 ; i < numCryptoMessageFormats ; ++i )
             ^~~
/usr/src/RPM/BUILD/libkolab-0.5.3/conversion/kabcconversion.cpp:106:17: note: ...this statement, but the latter is misleadingly indented as if it were guarded by the 'for'
                 return AutoFormat;
                 ^~~~~~
make[2]: Leaving directory '/usr/src/RPM/BUILD/libkolab-0.5.3'
make[2]: Entering directory '/usr/src/RPM/BUILD/libkolab-0.5.3'
[ 23%] Building CXX object CMakeFiles/kolab_static.dir/kolabformatV2/incidence.cpp.o
make[2]: Leaving directory '/usr/src/RPM/BUILD/libkolab-0.5.3'
make[2]: Entering directory '/usr/src/RPM/BUILD/libkolab-0.5.3'
[ 32%] Building CXX object CMakeFiles/kolab_static.dir/freebusy/freebusy.cpp.o
make[2]: Leaving directory '/usr/src/RPM/BUILD/libkolab-0.5.3'
make[2]: Entering directory '/usr/src/RPM/BUILD/libkolab-0.5.3'
[ 34%] Building CXX object CMakeFiles/kolab.dir/kolabformat/v2helpers.cpp.o
make[2]: Leaving directory '/usr/src/RPM/BUILD/libkolab-0.5.3'
make[2]: Entering directory '/usr/src/RPM/BUILD/libkolab-0.5.3'
[ 35%] Building CXX object CMakeFiles/kolab.dir/kolabformat/mimeobject.cpp.o
make[2]: Leaving directory '/usr/src/RPM/BUILD/libkolab-0.5.3'
make[2]: Entering directory '/usr/src/RPM/BUILD/libkolab-0.5.3'
[ 39%] Building CXX object CMakeFiles/kolab.dir/conversion/commonconversion.cpp.o
make[2]: Leaving directory '/usr/src/RPM/BUILD/libkolab-0.5.3'
make[2]: Entering directory '/usr/src/RPM/BUILD/libkolab-0.5.3'
[ 36%] Building CXX object CMakeFiles/kolab.dir/mime/mimeutils.cpp.o
make[2]: Leaving directory '/usr/src/RPM/BUILD/libkolab-0.5.3'
make[2]: Entering directory '/usr/src/RPM/BUILD/libkolab-0.5.3'
[ 41%] Building CXX object CMakeFiles/kolab.dir/conversion/timezoneconverter.cpp.o
make[2]: Leaving directory '/usr/src/RPM/BUILD/libkolab-0.5.3'
make[2]: Entering directory '/usr/src/RPM/BUILD/libkolab-0.5.3'
[ 40%] Building CXX object CMakeFiles/kolab.dir/conversion/kolabconversion.cpp.o
make[2]: Leaving directory '/usr/src/RPM/BUILD/libkolab-0.5.3'
make[2]: Entering directory '/usr/src/RPM/BUILD/libkolab-0.5.3'
[ 11%] Building CXX object CMakeFiles/kolab_static.dir/conversion/kcalconversion.cpp.o
/usr/src/RPM/BUILD/libkolab-0.5.3/conversion/kcalconversion.cpp: In function 'void Kolab::Conversion::setIncidence(KCalCore::Incidence&, const T&)':
/usr/src/RPM/BUILD/libkolab-0.5.3/conversion/kcalconversion.cpp:309:25: warning: logical not is only applied to the left hand side of comparison [-Wlogical-not-parentheses]
         if (!a.cutype() != CutypeIndividual) {
                         ^~
/usr/src/RPM/BUILD/libkolab-0.5.3/conversion/kcalconversion.cpp:309:13: note: add parentheses around left hand side expression to silence this warning
         if (!a.cutype() != CutypeIndividual) {
             ^~~~~~~~~~~
             (          )
/usr/src/RPM/BUILD/libkolab-0.5.3/conversion/kcalconversion.cpp: In instantiation of 'void Kolab::Conversion::setIncidence(KCalCore::Incidence&, const T&) [with T = Kolab::Event]':
/usr/src/RPM/BUILD/libkolab-0.5.3/conversion/kcalconversion.cpp:769:27:   required from here
/usr/src/RPM/BUILD/libkolab-0.5.3/conversion/kcalconversion.cpp:309:25: warning: comparison of constant '2' with boolean expression is always true [-Wbool-compare]
         if (!a.cutype() != CutypeIndividual) {
             ~~~~~~~~~~~~^~~~~~~~~~~~~~~~~~~
/usr/src/RPM/BUILD/libkolab-0.5.3/conversion/kcalconversion.cpp: In instantiation of 'void Kolab::Conversion::setIncidence(KCalCore::Incidence&, const T&) [with T = Kolab::Todo]':
/usr/src/RPM/BUILD/libkolab-0.5.3/conversion/kcalconversion.cpp:808:26:   required from here
/usr/src/RPM/BUILD/libkolab-0.5.3/conversion/kcalconversion.cpp:309:25: warning: comparison of constant '2' with boolean expression is always true [-Wbool-compare]
/usr/src/RPM/BUILD/libkolab-0.5.3/conversion/kcalconversion.cpp: In instantiation of 'void Kolab::Conversion::setIncidence(KCalCore::Incidence&, const T&) [with T = Kolab::Journal]':
/usr/src/RPM/BUILD/libkolab-0.5.3/conversion/kcalconversion.cpp:842:29:   required from here
/usr/src/RPM/BUILD/libkolab-0.5.3/conversion/kcalconversion.cpp:309:25: warning: comparison of constant '2' with boolean expression is always true [-Wbool-compare]
make[2]: Leaving directory '/usr/src/RPM/BUILD/libkolab-0.5.3'
make[2]: Entering directory '/usr/src/RPM/BUILD/libkolab-0.5.3'
[ 47%] Linking CXX static library lib/libkolab_static.a
make[2]: Leaving directory '/usr/src/RPM/BUILD/libkolab-0.5.3'
make[1]: Entering directory '/usr/src/RPM/BUILD/libkolab-0.5.3'
[ 47%] Built target kolab_static
make[1]: Leaving directory '/usr/src/RPM/BUILD/libkolab-0.5.3'
make[2]: Entering directory '/usr/src/RPM/BUILD/libkolab-0.5.3'
[ 48%] Generating calendaringtest.moc
make[2]: Leaving directory '/usr/src/RPM/BUILD/libkolab-0.5.3'
make[2]: Entering directory '/usr/src/RPM/BUILD/libkolab-0.5.3'
[ 45%] Building CXX object CMakeFiles/kolab.dir/kolabformatV2/event.cpp.o
/usr/src/RPM/BUILD/libkolab-0.5.3/kolabformatV2/event.cpp: In member function 'void KolabV2::Event::saveTo(const Ptr&)':
/usr/src/RPM/BUILD/libkolab-0.5.3/kolabformatV2/event.cpp:212:37: warning: 'void KCalCore::Event::setHasEndDate(bool)' is deprecated [-Wdeprecated-declarations]
   event->setHasEndDate( mHasEndDate );
                                     ^
In file included from /usr/src/RPM/BUILD/libkolab-0.5.3/kolabformatV2/event.h:39,
                 from /usr/src/RPM/BUILD/libkolab-0.5.3/kolabformatV2/event.cpp:34:
/usr/include/kde4/kcalcore/event.h:142:30: note: declared here
     KCALCORE_DEPRECATED void setHasEndDate(bool b);
                              ^~~~~~~~~~~~~
make[2]: Leaving directory '/usr/src/RPM/BUILD/libkolab-0.5.3'
make[2]: Entering directory '/usr/src/RPM/BUILD/libkolab-0.5.3'
Scanning dependencies of target calendaringtest
make[2]: Leaving directory '/usr/src/RPM/BUILD/libkolab-0.5.3'
make[2]: Entering directory '/usr/src/RPM/BUILD/libkolab-0.5.3'
[ 44%] Building CXX object CMakeFiles/kolab.dir/kolabformatV2/distributionlist.cpp.o
make[2]: Leaving directory '/usr/src/RPM/BUILD/libkolab-0.5.3'
make[2]: Entering directory '/usr/src/RPM/BUILD/libkolab-0.5.3'
[ 42%] Building CXX object CMakeFiles/kolab.dir/kolabformatV2/kolabbase.cpp.o
make[2]: Leaving directory '/usr/src/RPM/BUILD/libkolab-0.5.3'
make[2]: Entering directory '/usr/src/RPM/BUILD/libkolab-0.5.3'
[ 46%] Building CXX object CMakeFiles/kolab.dir/kolabformatV2/task.cpp.o
/usr/src/RPM/BUILD/libkolab-0.5.3/kolabformatV2/task.cpp: In member function 'void KolabV2::Task::saveTo(const Ptr&)':
/usr/src/RPM/BUILD/libkolab-0.5.3/kolabformatV2/task.cpp:338:41: warning: 'void KCalCore::Todo::setHasStartDate(bool)' is deprecated [-Wdeprecated-declarations]
   task->setHasStartDate( hasStartDate() );
                                         ^
In file included from /usr/src/RPM/BUILD/libkolab-0.5.3/kolabformatV2/task.h:39,
                 from /usr/src/RPM/BUILD/libkolab-0.5.3/kolabformatV2/task.cpp:34:
/usr/include/kde4/kcalcore/todo.h:143:30: note: declared here
     KCALCORE_DEPRECATED void setHasStartDate(bool hasStartDate);
                              ^~~~~~~~~~~~~~~
/usr/src/RPM/BUILD/libkolab-0.5.3/kolabformatV2/task.cpp:339:37: warning: 'void KCalCore::Todo::setHasDueDate(bool)' is deprecated [-Wdeprecated-declarations]
   task->setHasDueDate( hasDueDate() );
                                     ^
In file included from /usr/src/RPM/BUILD/libkolab-0.5.3/kolabformatV2/task.h:39,
                 from /usr/src/RPM/BUILD/libkolab-0.5.3/kolabformatV2/task.cpp:34:
/usr/include/kde4/kcalcore/todo.h:130:30: note: declared here
     KCALCORE_DEPRECATED void setHasDueDate(bool hasDueDate);
                              ^~~~~~~~~~~~~
make[2]: Leaving directory '/usr/src/RPM/BUILD/libkolab-0.5.3'
make[2]: Entering directory '/usr/src/RPM/BUILD/libkolab-0.5.3'
[ 52%] Building CXX object CMakeFiles/kolab.dir/kolabformatV2/note.cpp.o
make[2]: Leaving directory '/usr/src/RPM/BUILD/libkolab-0.5.3'
make[2]: Entering directory '/usr/src/RPM/BUILD/libkolab-0.5.3'
[ 49%] Building CXX object CMakeFiles/kolab.dir/kolabformatV2/journal.cpp.o
make[2]: Leaving directory '/usr/src/RPM/BUILD/libkolab-0.5.3'
make[2]: Entering directory '/usr/src/RPM/BUILD/libkolab-0.5.3'
[ 55%] Building CXX object CMakeFiles/kolab.dir/calendaring/datetimeutils.cpp.o
make[2]: Leaving directory '/usr/src/RPM/BUILD/libkolab-0.5.3'
make[2]: Entering directory '/usr/src/RPM/BUILD/libkolab-0.5.3'
[ 53%] Building CXX object CMakeFiles/kolab.dir/calendaring/calendaring.cpp.o
make[2]: Leaving directory '/usr/src/RPM/BUILD/libkolab-0.5.3'
make[2]: Entering directory '/usr/src/RPM/BUILD/libkolab-0.5.3'
[ 56%] Building CXX object CMakeFiles/kolab.dir/icalendar/icalendar.cpp.o
make[2]: Leaving directory '/usr/src/RPM/BUILD/libkolab-0.5.3'
make[2]: Entering directory '/usr/src/RPM/BUILD/libkolab-0.5.3'
[ 58%] Building CXX object CMakeFiles/kolab.dir/calendaring/moc_event.cxx.o
make[2]: Leaving directory '/usr/src/RPM/BUILD/libkolab-0.5.3'
make[2]: Entering directory '/usr/src/RPM/BUILD/libkolab-0.5.3'
[ 43%] Building CXX object CMakeFiles/kolab.dir/kolabformatV2/contact.cpp.o
/usr/src/RPM/BUILD/libkolab-0.5.3/kolabformatV2/contact.cpp: In member function 'virtual bool KolabV2::Contact::loadAttribute(QDomElement&)':
/usr/src/RPM/BUILD/libkolab-0.5.3/kolabformatV2/contact.cpp:642:5: warning: this statement may fall through [-Wimplicit-fallthrough=]
     if ( tagName == "manager-name" ) {
     ^~
/usr/src/RPM/BUILD/libkolab-0.5.3/kolabformatV2/contact.cpp:646:3: note: here
   case 'n':
   ^~~~
make[2]: Leaving directory '/usr/src/RPM/BUILD/libkolab-0.5.3'
make[2]: Entering directory '/usr/src/RPM/BUILD/libkolab-0.5.3'
[ 60%] Generating upgradetest.moc
make[2]: Leaving directory '/usr/src/RPM/BUILD/libkolab-0.5.3'
make[2]: Entering directory '/usr/src/RPM/BUILD/libkolab-0.5.3'
Scanning dependencies of target upgradetest
make[2]: Leaving directory '/usr/src/RPM/BUILD/libkolab-0.5.3'
make[2]: Entering directory '/usr/src/RPM/BUILD/libkolab-0.5.3'
[ 54%] Building CXX object CMakeFiles/kolab.dir/calendaring/event.cpp.o
make[2]: Leaving directory '/usr/src/RPM/BUILD/libkolab-0.5.3'
make[2]: Entering directory '/usr/src/RPM/BUILD/libkolab-0.5.3'
[ 57%] Building CXX object CMakeFiles/kolab.dir/icalendar/imip.cpp.o
make[2]: Leaving directory '/usr/src/RPM/BUILD/libkolab-0.5.3'
make[2]: Entering directory '/usr/src/RPM/BUILD/libkolab-0.5.3'
[ 62%] Generating freebusytest.moc
make[2]: Leaving directory '/usr/src/RPM/BUILD/libkolab-0.5.3'
make[2]: Entering directory '/usr/src/RPM/BUILD/libkolab-0.5.3'
Scanning dependencies of target freebusytest
make[2]: Leaving directory '/usr/src/RPM/BUILD/libkolab-0.5.3'
make[2]: Entering directory '/usr/src/RPM/BUILD/libkolab-0.5.3'
[ 63%] Generating benchmark.moc
make[2]: Leaving directory '/usr/src/RPM/BUILD/libkolab-0.5.3'
make[2]: Entering directory '/usr/src/RPM/BUILD/libkolab-0.5.3'
Scanning dependencies of target benchmarktest
make[2]: Leaving directory '/usr/src/RPM/BUILD/libkolab-0.5.3'
make[2]: Entering directory '/usr/src/RPM/BUILD/libkolab-0.5.3'
[ 37%] Building CXX object CMakeFiles/kolab.dir/conversion/kcalconversion.cpp.o
/usr/src/RPM/BUILD/libkolab-0.5.3/conversion/kcalconversion.cpp: In function 'void Kolab::Conversion::setIncidence(KCalCore::Incidence&, const T&)':
/usr/src/RPM/BUILD/libkolab-0.5.3/conversion/kcalconversion.cpp:309:25: warning: logical not is only applied to the left hand side of comparison [-Wlogical-not-parentheses]
         if (!a.cutype() != CutypeIndividual) {
                         ^~
/usr/src/RPM/BUILD/libkolab-0.5.3/conversion/kcalconversion.cpp:309:13: note: add parentheses around left hand side expression to silence this warning
         if (!a.cutype() != CutypeIndividual) {
             ^~~~~~~~~~~
             (          )
/usr/src/RPM/BUILD/libkolab-0.5.3/conversion/kcalconversion.cpp: In instantiation of 'void Kolab::Conversion::setIncidence(KCalCore::Incidence&, const T&) [with T = Kolab::Event]':
/usr/src/RPM/BUILD/libkolab-0.5.3/conversion/kcalconversion.cpp:769:27:   required from here
/usr/src/RPM/BUILD/libkolab-0.5.3/conversion/kcalconversion.cpp:309:25: warning: comparison of constant '2' with boolean expression is always true [-Wbool-compare]
         if (!a.cutype() != CutypeIndividual) {
             ~~~~~~~~~~~~^~~~~~~~~~~~~~~~~~~
/usr/src/RPM/BUILD/libkolab-0.5.3/conversion/kcalconversion.cpp: In instantiation of 'void Kolab::Conversion::setIncidence(KCalCore::Incidence&, const T&) [with T = Kolab::Todo]':
/usr/src/RPM/BUILD/libkolab-0.5.3/conversion/kcalconversion.cpp:808:26:   required from here
/usr/src/RPM/BUILD/libkolab-0.5.3/conversion/kcalconversion.cpp:309:25: warning: comparison of constant '2' with boolean expression is always true [-Wbool-compare]
/usr/src/RPM/BUILD/libkolab-0.5.3/conversion/kcalconversion.cpp: In instantiation of 'void Kolab::Conversion::setIncidence(KCalCore::Incidence&, const T&) [with T = Kolab::Journal]':
/usr/src/RPM/BUILD/libkolab-0.5.3/conversion/kcalconversion.cpp:842:29:   required from here
/usr/src/RPM/BUILD/libkolab-0.5.3/conversion/kcalconversion.cpp:309:25: warning: comparison of constant '2' with boolean expression is always true [-Wbool-compare]
make[2]: Leaving directory '/usr/src/RPM/BUILD/libkolab-0.5.3'
make[2]: Entering directory '/usr/src/RPM/BUILD/libkolab-0.5.3'
[ 66%] Generating formattest.moc
make[2]: Leaving directory '/usr/src/RPM/BUILD/libkolab-0.5.3'
make[2]: Entering directory '/usr/src/RPM/BUILD/libkolab-0.5.3'
Scanning dependencies of target formattest
make[2]: Leaving directory '/usr/src/RPM/BUILD/libkolab-0.5.3'
make[2]: Entering directory '/usr/src/RPM/BUILD/libkolab-0.5.3'
[ 59%] Building CXX object CMakeFiles/kolab.dir/freebusy/freebusy.cpp.o
make[2]: Leaving directory '/usr/src/RPM/BUILD/libkolab-0.5.3'
make[2]: Entering directory '/usr/src/RPM/BUILD/libkolab-0.5.3'
[ 68%] Generating timezonetest.moc
make[2]: Leaving directory '/usr/src/RPM/BUILD/libkolab-0.5.3'
make[2]: Entering directory '/usr/src/RPM/BUILD/libkolab-0.5.3'
Scanning dependencies of target timezonetest
make[2]: Leaving directory '/usr/src/RPM/BUILD/libkolab-0.5.3'
make[2]: Entering directory '/usr/src/RPM/BUILD/libkolab-0.5.3'
[ 50%] Building CXX object CMakeFiles/kolab.dir/kolabformatV2/incidence.cpp.o
make[2]: Leaving directory '/usr/src/RPM/BUILD/libkolab-0.5.3'
make[2]: Entering directory '/usr/src/RPM/BUILD/libkolab-0.5.3'
[ 70%] Generating debugstreamtest.moc
make[2]: Leaving directory '/usr/src/RPM/BUILD/libkolab-0.5.3'
make[2]: Entering directory '/usr/src/RPM/BUILD/libkolab-0.5.3'
Scanning dependencies of target debugstreamtest
make[2]: Leaving directory '/usr/src/RPM/BUILD/libkolab-0.5.3'
make[2]: Entering directory '/usr/src/RPM/BUILD/libkolab-0.5.3'
[ 38%] Building CXX object CMakeFiles/kolab.dir/conversion/kabcconversion.cpp.o
/usr/src/RPM/BUILD/libkolab-0.5.3/conversion/kabcconversion.cpp: In function 'const char* Kolab::Conversion::cryptoMessageFormatToString(Kolab::Conversion::CryptoMessageFormat)':
/usr/src/RPM/BUILD/libkolab-0.5.3/conversion/kabcconversion.cpp:86:13: warning: this 'for' clause does not guard... [-Wmisleading-indentation]
             for ( unsigned int i = 0 ; i < numCryptoMessageFormats ; ++i )
             ^~~
/usr/src/RPM/BUILD/libkolab-0.5.3/conversion/kabcconversion.cpp:89:17: note: ...this statement, but the latter is misleadingly indented as if it were guarded by the 'for'
                 return 0;
                 ^~~~~~
/usr/src/RPM/BUILD/libkolab-0.5.3/conversion/kabcconversion.cpp: In function 'QStringList Kolab::Conversion::cryptoMessageFormatsToStringList(unsigned int)':
/usr/src/RPM/BUILD/libkolab-0.5.3/conversion/kabcconversion.cpp:94:13: warning: this 'for' clause does not guard... [-Wmisleading-indentation]
             for ( unsigned int i = 0 ; i < numCryptoMessageFormats ; ++i )
             ^~~
/usr/src/RPM/BUILD/libkolab-0.5.3/conversion/kabcconversion.cpp:97:17: note: ...this statement, but the latter is misleadingly indented as if it were guarded by the 'for'
                 return result;
                 ^~~~~~
/usr/src/RPM/BUILD/libkolab-0.5.3/conversion/kabcconversion.cpp: In function 'Kolab::Conversion::CryptoMessageFormat Kolab::Conversion::stringToCryptoMessageFormat(const QString&)':
/usr/src/RPM/BUILD/libkolab-0.5.3/conversion/kabcconversion.cpp:103:13: warning: this 'for' clause does not guard... [-Wmisleading-indentation]
             for ( unsigned int i = 0 ; i < numCryptoMessageFormats ; ++i )
             ^~~
/usr/src/RPM/BUILD/libkolab-0.5.3/conversion/kabcconversion.cpp:106:17: note: ...this statement, but the latter is misleadingly indented as if it were guarded by the 'for'
                 return AutoFormat;
                 ^~~~~~
make[2]: Leaving directory '/usr/src/RPM/BUILD/libkolab-0.5.3'
make[2]: Entering directory '/usr/src/RPM/BUILD/libkolab-0.5.3'
[ 72%] Linking CXX shared library lib/libkolab.so
make[2]: Leaving directory '/usr/src/RPM/BUILD/libkolab-0.5.3'
make[1]: Entering directory '/usr/src/RPM/BUILD/libkolab-0.5.3'
[ 72%] Built target kolab
make[1]: Leaving directory '/usr/src/RPM/BUILD/libkolab-0.5.3'
make[2]: Entering directory '/usr/src/RPM/BUILD/libkolab-0.5.3'
[ 73%] Generating legacyformattest.moc
make[2]: Leaving directory '/usr/src/RPM/BUILD/libkolab-0.5.3'
make[2]: Entering directory '/usr/src/RPM/BUILD/libkolab-0.5.3'
Scanning dependencies of target legacyformattest
make[2]: Leaving directory '/usr/src/RPM/BUILD/libkolab-0.5.3'
make[2]: Entering directory '/usr/src/RPM/BUILD/libkolab-0.5.3'
[ 71%] Building CXX object tests/CMakeFiles/debugstreamtest.dir/debugstreamtest.cpp.o
make[2]: Leaving directory '/usr/src/RPM/BUILD/libkolab-0.5.3'
make[2]: Entering directory '/usr/src/RPM/BUILD/libkolab-0.5.3'
[ 75%] Linking CXX executable debugstreamtest
make[2]: Leaving directory '/usr/src/RPM/BUILD/libkolab-0.5.3'
make[1]: Entering directory '/usr/src/RPM/BUILD/libkolab-0.5.3'
[ 75%] Built target debugstreamtest
make[1]: Leaving directory '/usr/src/RPM/BUILD/libkolab-0.5.3'
make[2]: Entering directory '/usr/src/RPM/BUILD/libkolab-0.5.3'
[ 76%] Generating kolabobjecttest.moc
make[2]: Leaving directory '/usr/src/RPM/BUILD/libkolab-0.5.3'
make[2]: Entering directory '/usr/src/RPM/BUILD/libkolab-0.5.3'
Scanning dependencies of target kolabobjecttest
make[2]: Leaving directory '/usr/src/RPM/BUILD/libkolab-0.5.3'
make[2]: Entering directory '/usr/src/RPM/BUILD/libkolab-0.5.3'
[ 61%] Building CXX object tests/CMakeFiles/upgradetest.dir/upgradetest.cpp.o
make[2]: Leaving directory '/usr/src/RPM/BUILD/libkolab-0.5.3'
make[2]: Entering directory '/usr/src/RPM/BUILD/libkolab-0.5.3'
[ 65%] Building CXX object tests/CMakeFiles/benchmarktest.dir/benchmark.cpp.o
make[2]: Leaving directory '/usr/src/RPM/BUILD/libkolab-0.5.3'
make[2]: Entering directory '/usr/src/RPM/BUILD/libkolab-0.5.3'
[ 69%] Building CXX object tests/CMakeFiles/timezonetest.dir/timezonetest.cpp.o
make[2]: Leaving directory '/usr/src/RPM/BUILD/libkolab-0.5.3'
make[2]: Entering directory '/usr/src/RPM/BUILD/libkolab-0.5.3'
[ 77%] Building CXX object tests/CMakeFiles/kolabobjecttest.dir/kolabobjecttest.cpp.o
make[2]: Leaving directory '/usr/src/RPM/BUILD/libkolab-0.5.3'
make[2]: Entering directory '/usr/src/RPM/BUILD/libkolab-0.5.3'
[ 51%] Building CXX object tests/CMakeFiles/calendaringtest.dir/calendaringtest.cpp.o
make[2]: Leaving directory '/usr/src/RPM/BUILD/libkolab-0.5.3'
make[2]: Entering directory '/usr/src/RPM/BUILD/libkolab-0.5.3'
[ 64%] Building CXX object tests/CMakeFiles/freebusytest.dir/freebusytest.cpp.o
make[2]: Leaving directory '/usr/src/RPM/BUILD/libkolab-0.5.3'
make[2]: Entering directory '/usr/src/RPM/BUILD/libkolab-0.5.3'
[ 78%] Linking CXX executable upgradetest
make[2]: Leaving directory '/usr/src/RPM/BUILD/libkolab-0.5.3'
make[1]: Entering directory '/usr/src/RPM/BUILD/libkolab-0.5.3'
[ 83%] Built target upgradetest
make[1]: Leaving directory '/usr/src/RPM/BUILD/libkolab-0.5.3'
make[2]: Entering directory '/usr/src/RPM/BUILD/libkolab-0.5.3'
[ 84%] Generating icalendartest.moc
make[2]: Leaving directory '/usr/src/RPM/BUILD/libkolab-0.5.3'
make[2]: Entering directory '/usr/src/RPM/BUILD/libkolab-0.5.3'
Scanning dependencies of target icalendartest
make[2]: Leaving directory '/usr/src/RPM/BUILD/libkolab-0.5.3'
make[2]: Entering directory '/usr/src/RPM/BUILD/libkolab-0.5.3'
[ 81%] Linking CXX executable kolabobjecttest
make[2]: Leaving directory '/usr/src/RPM/BUILD/libkolab-0.5.3'
make[1]: Entering directory '/usr/src/RPM/BUILD/libkolab-0.5.3'
[ 85%] Built target kolabobjecttest
make[1]: Leaving directory '/usr/src/RPM/BUILD/libkolab-0.5.3'
make[2]: Entering directory '/usr/src/RPM/BUILD/libkolab-0.5.3'
[ 86%] Generating mimeobjecttest.moc
make[2]: Leaving directory '/usr/src/RPM/BUILD/libkolab-0.5.3'
make[2]: Entering directory '/usr/src/RPM/BUILD/libkolab-0.5.3'
[ 79%] Linking CXX executable benchmarktest
make[2]: Leaving directory '/usr/src/RPM/BUILD/libkolab-0.5.3'
make[1]: Entering directory '/usr/src/RPM/BUILD/libkolab-0.5.3'
[ 86%] Built target benchmarktest
make[1]: Leaving directory '/usr/src/RPM/BUILD/libkolab-0.5.3'
make[2]: Entering directory '/usr/src/RPM/BUILD/libkolab-0.5.3'
[ 83%] Linking CXX executable freebusytest
make[2]: Leaving directory '/usr/src/RPM/BUILD/libkolab-0.5.3'
make[1]: Entering directory '/usr/src/RPM/BUILD/libkolab-0.5.3'
[ 86%] Built target freebusytest
make[1]: Leaving directory '/usr/src/RPM/BUILD/libkolab-0.5.3'
make[2]: Entering directory '/usr/src/RPM/BUILD/libkolab-0.5.3'
Scanning dependencies of target mimeobjecttest
make[2]: Leaving directory '/usr/src/RPM/BUILD/libkolab-0.5.3'
make[2]: Entering directory '/usr/src/RPM/BUILD/libkolab-0.5.3'
[ 88%] Generating xmlobjecttest.moc
make[2]: Leaving directory '/usr/src/RPM/BUILD/libkolab-0.5.3'
make[2]: Entering directory '/usr/src/RPM/BUILD/libkolab-0.5.3'
Scanning dependencies of target xmlobjecttest
make[2]: Leaving directory '/usr/src/RPM/BUILD/libkolab-0.5.3'
make[2]: Entering directory '/usr/src/RPM/BUILD/libkolab-0.5.3'
[ 87%] Generating kcalconversiontest.moc
make[2]: Leaving directory '/usr/src/RPM/BUILD/libkolab-0.5.3'
make[2]: Entering directory '/usr/src/RPM/BUILD/libkolab-0.5.3'
Scanning dependencies of target kcalconversiontest
make[2]: Leaving directory '/usr/src/RPM/BUILD/libkolab-0.5.3'
make[2]: Entering directory '/usr/src/RPM/BUILD/libkolab-0.5.3'
[ 80%] Linking CXX executable timezonetest
make[2]: Leaving directory '/usr/src/RPM/BUILD/libkolab-0.5.3'
make[1]: Entering directory '/usr/src/RPM/BUILD/libkolab-0.5.3'
[ 91%] Built target timezonetest
make[1]: Leaving directory '/usr/src/RPM/BUILD/libkolab-0.5.3'
make[2]: Entering directory '/usr/src/RPM/BUILD/libkolab-0.5.3'
[ 82%] Linking CXX executable calendaringtest
make[2]: Leaving directory '/usr/src/RPM/BUILD/libkolab-0.5.3'
make[1]: Entering directory '/usr/src/RPM/BUILD/libkolab-0.5.3'
[ 91%] Built target calendaringtest
make[1]: Leaving directory '/usr/src/RPM/BUILD/libkolab-0.5.3'
make[2]: Entering directory '/usr/src/RPM/BUILD/libkolab-0.5.3'
Scanning dependencies of target kolabformatchecker
make[2]: Leaving directory '/usr/src/RPM/BUILD/libkolab-0.5.3'
make[2]: Entering directory '/usr/src/RPM/BUILD/libkolab-0.5.3'
[ 74%] Building CXX object tests/CMakeFiles/legacyformattest.dir/legacyformattest.cpp.o
make[2]: Leaving directory '/usr/src/RPM/BUILD/libkolab-0.5.3'
make[2]: Entering directory '/usr/src/RPM/BUILD/libkolab-0.5.3'
[ 67%] Building CXX object tests/CMakeFiles/formattest.dir/formattest.cpp.o
make[2]: Leaving directory '/usr/src/RPM/BUILD/libkolab-0.5.3'
make[2]: Entering directory '/usr/src/RPM/BUILD/libkolab-0.5.3'
[ 90%] Building CXX object tests/CMakeFiles/xmlobjecttest.dir/xmlobjecttest.cpp.o
make[2]: Leaving directory '/usr/src/RPM/BUILD/libkolab-0.5.3'
make[2]: Entering directory '/usr/src/RPM/BUILD/libkolab-0.5.3'
[ 93%] Linking CXX executable legacyformattest
make[2]: Leaving directory '/usr/src/RPM/BUILD/libkolab-0.5.3'
make[1]: Entering directory '/usr/src/RPM/BUILD/libkolab-0.5.3'
[ 95%] Built target legacyformattest
make[1]: Leaving directory '/usr/src/RPM/BUILD/libkolab-0.5.3'
make[2]: Entering directory '/usr/src/RPM/BUILD/libkolab-0.5.3'
[ 94%] Linking CXX executable formattest
make[2]: Leaving directory '/usr/src/RPM/BUILD/libkolab-0.5.3'
make[1]: Entering directory '/usr/src/RPM/BUILD/libkolab-0.5.3'
[ 95%] Built target formattest
make[1]: Leaving directory '/usr/src/RPM/BUILD/libkolab-0.5.3'
make[2]: Entering directory '/usr/src/RPM/BUILD/libkolab-0.5.3'
[ 95%] Linking CXX executable xmlobjecttest
make[2]: Leaving directory '/usr/src/RPM/BUILD/libkolab-0.5.3'
make[1]: Entering directory '/usr/src/RPM/BUILD/libkolab-0.5.3'
[ 95%] Built target xmlobjecttest
make[1]: Leaving directory '/usr/src/RPM/BUILD/libkolab-0.5.3'
make[2]: Entering directory '/usr/src/RPM/BUILD/libkolab-0.5.3'
[ 85%] Building CXX object tests/CMakeFiles/icalendartest.dir/icalendartest.cpp.o
make[2]: Leaving directory '/usr/src/RPM/BUILD/libkolab-0.5.3'
make[2]: Entering directory '/usr/src/RPM/BUILD/libkolab-0.5.3'
[ 89%] Building CXX object tests/CMakeFiles/mimeobjecttest.dir/mimeobjecttest.cpp.o
make[2]: Leaving directory '/usr/src/RPM/BUILD/libkolab-0.5.3'
make[2]: Entering directory '/usr/src/RPM/BUILD/libkolab-0.5.3'
[ 96%] Linking CXX executable icalendartest
make[2]: Leaving directory '/usr/src/RPM/BUILD/libkolab-0.5.3'
make[1]: Entering directory '/usr/src/RPM/BUILD/libkolab-0.5.3'
[ 97%] Built target icalendartest
make[1]: Leaving directory '/usr/src/RPM/BUILD/libkolab-0.5.3'
make[2]: Entering directory '/usr/src/RPM/BUILD/libkolab-0.5.3'
[ 97%] Linking CXX executable mimeobjecttest
make[2]: Leaving directory '/usr/src/RPM/BUILD/libkolab-0.5.3'
make[1]: Entering directory '/usr/src/RPM/BUILD/libkolab-0.5.3'
[ 97%] Built target mimeobjecttest
make[1]: Leaving directory '/usr/src/RPM/BUILD/libkolab-0.5.3'
make[2]: Entering directory '/usr/src/RPM/BUILD/libkolab-0.5.3'
[ 92%] Building CXX object utils/CMakeFiles/kolabformatchecker.dir/kolabformatchecker.cpp.o
make[2]: Leaving directory '/usr/src/RPM/BUILD/libkolab-0.5.3'
make[2]: Entering directory '/usr/src/RPM/BUILD/libkolab-0.5.3'
[ 98%] Linking CXX executable kolabformatchecker
make[2]: Leaving directory '/usr/src/RPM/BUILD/libkolab-0.5.3'
make[1]: Entering directory '/usr/src/RPM/BUILD/libkolab-0.5.3'
[ 98%] Built target kolabformatchecker
make[1]: Leaving directory '/usr/src/RPM/BUILD/libkolab-0.5.3'
make[2]: Entering directory '/usr/src/RPM/BUILD/libkolab-0.5.3'
[ 91%] Building CXX object tests/CMakeFiles/kcalconversiontest.dir/kcalconversiontest.cpp.o
In file included from /usr/src/RPM/BUILD/libkolab-0.5.3/tests/kcalconversiontest.cpp:29:
/usr/src/RPM/BUILD/libkolab-0.5.3/conversion/kcalconversion.cpp: In function 'void Kolab::Conversion::setIncidence(KCalCore::Incidence&, const T&)':
/usr/src/RPM/BUILD/libkolab-0.5.3/conversion/kcalconversion.cpp:309:25: warning: logical not is only applied to the left hand side of comparison [-Wlogical-not-parentheses]
         if (!a.cutype() != CutypeIndividual) {
                         ^~
/usr/src/RPM/BUILD/libkolab-0.5.3/conversion/kcalconversion.cpp:309:13: note: add parentheses around left hand side expression to silence this warning
         if (!a.cutype() != CutypeIndividual) {
             ^~~~~~~~~~~
             (          )
/usr/src/RPM/BUILD/libkolab-0.5.3/conversion/kcalconversion.cpp: In instantiation of 'void Kolab::Conversion::setIncidence(KCalCore::Incidence&, const T&) [with T = Kolab::Event]':
/usr/src/RPM/BUILD/libkolab-0.5.3/conversion/kcalconversion.cpp:769:27:   required from here
/usr/src/RPM/BUILD/libkolab-0.5.3/conversion/kcalconversion.cpp:309:25: warning: comparison of constant '2' with boolean expression is always true [-Wbool-compare]
         if (!a.cutype() != CutypeIndividual) {
             ~~~~~~~~~~~~^~~~~~~~~~~~~~~~~~~
/usr/src/RPM/BUILD/libkolab-0.5.3/conversion/kcalconversion.cpp: In instantiation of 'void Kolab::Conversion::setIncidence(KCalCore::Incidence&, const T&) [with T = Kolab::Todo]':
/usr/src/RPM/BUILD/libkolab-0.5.3/conversion/kcalconversion.cpp:808:26:   required from here
/usr/src/RPM/BUILD/libkolab-0.5.3/conversion/kcalconversion.cpp:309:25: warning: comparison of constant '2' with boolean expression is always true [-Wbool-compare]
/usr/src/RPM/BUILD/libkolab-0.5.3/conversion/kcalconversion.cpp: In instantiation of 'void Kolab::Conversion::setIncidence(KCalCore::Incidence&, const T&) [with T = Kolab::Journal]':
/usr/src/RPM/BUILD/libkolab-0.5.3/conversion/kcalconversion.cpp:842:29:   required from here
/usr/src/RPM/BUILD/libkolab-0.5.3/conversion/kcalconversion.cpp:309:25: warning: comparison of constant '2' with boolean expression is always true [-Wbool-compare]
make[2]: Leaving directory '/usr/src/RPM/BUILD/libkolab-0.5.3'
make[2]: Entering directory '/usr/src/RPM/BUILD/libkolab-0.5.3'
[100%] Linking CXX executable kcalconversiontest
make[2]: Leaving directory '/usr/src/RPM/BUILD/libkolab-0.5.3'
make[1]: Entering directory '/usr/src/RPM/BUILD/libkolab-0.5.3'
[100%] Built target kcalconversiontest
make[1]: Leaving directory '/usr/src/RPM/BUILD/libkolab-0.5.3'
+ exit 0
Executing(%install): /bin/sh -e /usr/src/tmp/rpm-tmp.40246
+ umask 022
+ /bin/mkdir -p /usr/src/RPM/BUILD
+ cd /usr/src/RPM/BUILD
+ /bin/chmod -Rf u+rwX -- /usr/src/tmp/libkolab-buildroot
+ :
+ /bin/rm -rf -- /usr/src/tmp/libkolab-buildroot
+ cd libkolab-0.5.3
+ make 'INSTALL=/bin/install -p' install DESTDIR=/usr/src/tmp/libkolab-buildroot
make: Entering directory '/usr/src/RPM/BUILD/libkolab-0.5.3'
make[1]: Entering directory '/usr/src/RPM/BUILD/libkolab-0.5.3'
make[2]: Entering directory '/usr/src/RPM/BUILD/libkolab-0.5.3'
make[2]: Leaving directory '/usr/src/RPM/BUILD/libkolab-0.5.3'
[ 29%] Built target kolab_static
make[2]: Entering directory '/usr/src/RPM/BUILD/libkolab-0.5.3'
make[2]: Leaving directory '/usr/src/RPM/BUILD/libkolab-0.5.3'
[ 58%] Built target kolab
make[2]: Entering directory '/usr/src/RPM/BUILD/libkolab-0.5.3'
make[2]: Leaving directory '/usr/src/RPM/BUILD/libkolab-0.5.3'
[ 60%] Built target kolabformatchecker
make[2]: Entering directory '/usr/src/RPM/BUILD/libkolab-0.5.3'
make[2]: Leaving directory '/usr/src/RPM/BUILD/libkolab-0.5.3'
[ 63%] Built target calendaringtest
make[2]: Entering directory '/usr/src/RPM/BUILD/libkolab-0.5.3'
make[2]: Leaving directory '/usr/src/RPM/BUILD/libkolab-0.5.3'
[ 66%] Built target upgradetest
make[2]: Entering directory '/usr/src/RPM/BUILD/libkolab-0.5.3'
make[2]: Leaving directory '/usr/src/RPM/BUILD/libkolab-0.5.3'
[ 69%] Built target freebusytest
make[2]: Entering directory '/usr/src/RPM/BUILD/libkolab-0.5.3'
make[2]: Leaving directory '/usr/src/RPM/BUILD/libkolab-0.5.3'
[ 72%] Built target benchmarktest
make[2]: Entering directory '/usr/src/RPM/BUILD/libkolab-0.5.3'
make[2]: Leaving directory '/usr/src/RPM/BUILD/libkolab-0.5.3'
[ 75%] Built target formattest
make[2]: Entering directory '/usr/src/RPM/BUILD/libkolab-0.5.3'
make[2]: Leaving directory '/usr/src/RPM/BUILD/libkolab-0.5.3'
[ 78%] Built target timezonetest
make[2]: Entering directory '/usr/src/RPM/BUILD/libkolab-0.5.3'
make[2]: Leaving directory '/usr/src/RPM/BUILD/libkolab-0.5.3'
[ 81%] Built target debugstreamtest
make[2]: Entering directory '/usr/src/RPM/BUILD/libkolab-0.5.3'
make[2]: Leaving directory '/usr/src/RPM/BUILD/libkolab-0.5.3'
[ 84%] Built target legacyformattest
make[2]: Entering directory '/usr/src/RPM/BUILD/libkolab-0.5.3'
make[2]: Leaving directory '/usr/src/RPM/BUILD/libkolab-0.5.3'
[ 87%] Built target kolabobjecttest
make[2]: Entering directory '/usr/src/RPM/BUILD/libkolab-0.5.3'
make[2]: Leaving directory '/usr/src/RPM/BUILD/libkolab-0.5.3'
[ 90%] Built target icalendartest
make[2]: Entering directory '/usr/src/RPM/BUILD/libkolab-0.5.3'
make[2]: Leaving directory '/usr/src/RPM/BUILD/libkolab-0.5.3'
[ 93%] Built target mimeobjecttest
make[2]: Entering directory '/usr/src/RPM/BUILD/libkolab-0.5.3'
make[2]: Leaving directory '/usr/src/RPM/BUILD/libkolab-0.5.3'
[ 96%] Built target kcalconversiontest
make[2]: Entering directory '/usr/src/RPM/BUILD/libkolab-0.5.3'
make[2]: Leaving directory '/usr/src/RPM/BUILD/libkolab-0.5.3'
[100%] Built target xmlobjecttest
make[1]: Leaving directory '/usr/src/RPM/BUILD/libkolab-0.5.3'
Install the project...
-- Install configuration: "RelWithDebInfo"
-- Installing: /usr/src/tmp/libkolab-buildroot/usr/lib/libkolab.so.0.5.3
-- Installing: /usr/src/tmp/libkolab-buildroot/usr/lib/libkolab.so.0
-- Installing: /usr/src/tmp/libkolab-buildroot/usr/lib/libkolab.so
-- Installing: /usr/src/tmp/libkolab-buildroot/usr/include/kolab/kolab_export.h
-- Installing: /usr/src/tmp/libkolab-buildroot/usr/include/kolab/kolabdefinitions.h
-- Installing: /usr/src/tmp/libkolab-buildroot/usr/include/kolab/formathelpers.h
-- Installing: /usr/src/tmp/libkolab-buildroot/usr/include/kolab/kolabobject.h
-- Installing: /usr/src/tmp/libkolab-buildroot/usr/include/kolab/errorhandler.h
-- Installing: /usr/src/tmp/libkolab-buildroot/usr/include/kolab/xmlobject.h
-- Installing: /usr/src/tmp/libkolab-buildroot/usr/include/kolab/mimeobject.h
-- Installing: /usr/src/tmp/libkolab-buildroot/usr/include/kolab/kcalconversion.h
-- Installing: /usr/src/tmp/libkolab-buildroot/usr/include/kolab/kabcconversion.h
-- Installing: /usr/src/tmp/libkolab-buildroot/usr/include/kolab/commonconversion.h
-- Installing: /usr/src/tmp/libkolab-buildroot/usr/include/kolab/freebusy.h
-- Installing: /usr/src/tmp/libkolab-buildroot/usr/lib/cmake/Libkolab/LibkolabTargets.cmake
-- Installing: /usr/src/tmp/libkolab-buildroot/usr/lib/cmake/Libkolab/LibkolabTargets-relwithdebinfo.cmake
-- Installing: /usr/src/tmp/libkolab-buildroot/usr/lib/cmake/Libkolab/LibkolabConfig.cmake
-- Installing: /usr/src/tmp/libkolab-buildroot/usr/lib/cmake/Libkolab/LibkolabConfigVersion.cmake
make: Leaving directory '/usr/src/RPM/BUILD/libkolab-0.5.3'
+ /usr/lib/rpm/brp-alt
Cleaning files in /usr/src/tmp/libkolab-buildroot (auto)
mode of './usr/lib/libkolab.so.0.5.3' changed from 0755 (rwxr-xr-x) to 0644 (rw-r--r--)
Verifying and fixing files in /usr/src/tmp/libkolab-buildroot (binconfig,pkgconfig,libtool,desktop)
Checking contents of files in /usr/src/tmp/libkolab-buildroot/ (default)
Compressing files in /usr/src/tmp/libkolab-buildroot (auto)
Adjusting library links in /usr/src/tmp/libkolab-buildroot
./usr/lib:
	libkolab.so.0 -> libkolab.so.0.5.3
Verifying ELF objects in /usr/src/tmp/libkolab-buildroot (arch=normal,fhs=normal,lfs=relaxed,lint=relaxed,rpath=normal,stack=normal,textrel=normal,unresolved=normal)
Hardlinking identical .pyc and .pyo files
Executing(%check): /bin/sh -e /usr/src/tmp/rpm-tmp.36276
+ umask 022
+ /bin/mkdir -p /usr/src/RPM/BUILD
+ cd /usr/src/RPM/BUILD
+ cd libkolab-0.5.3
+ pushd tests
~/RPM/BUILD/libkolab-0.5.3/tests ~/RPM/BUILD/libkolab-0.5.3
+ ./benchmarktest
benchmarktest: cannot connect to X server 
+ :
+ ./calendaringtest
calendaringtest: cannot connect to X server 
+ :
+ ./formattest
formattest: cannot connect to X server 
+ :
+ ./freebusytest
freebusytest: cannot connect to X server 
+ :
+ ./icalendartest
icalendartest: cannot connect to X server 
+ :
+ ./kcalconversiontest
kcalconversiontest: cannot connect to X server 
+ :
+ ./upgradetest
upgradetest: cannot connect to X server 
+ :
+ popd
~/RPM/BUILD/libkolab-0.5.3
+ exit 0
Processing files: libkolab-0.5.3-alt1.qa1
Finding Provides (using /usr/lib/rpm/find-provides)
Executing: /bin/sh -e /usr/src/tmp/rpm-tmp.3cqr6H
find-provides: running scripts (alternatives,debuginfo,gir,lib,pam,perl,pkgconfig,python,shell,typelib)
lib.prov: /usr/src/tmp/libkolab-buildroot/usr/lib/libkolab.so.0: 152 symbols, 18 bpp
Finding Requires (using /usr/lib/rpm/find-requires)
Executing: /bin/sh -e /usr/src/tmp/rpm-tmp.W6uNAX
find-requires: running scripts (cpp,debuginfo,files,gir-js,gir-python,gir,lib,pam,perl,pkgconfig,pkgconfiglib,python,rpmlib,shebang,shell,static,symlinks,typelib)
Provides: libkolab.so.0 = set:ldMmWT0Pkm66bQUzrXUCFDQy1QEgZ0oMJpYsHoJvFp5HFCzhbVzJJZaOS2Ew2m1otwfXa3WI0lnTHRomHTWZAiSw2ptD0ur2U1MF99Z3mesWNGkZHJ1hZDQEYeZFRHZyPZgWgYV4mZgcloe8FxTnaEtrWQla9U0qiyFT9j4Vtd20leFk0vOChBbEUD057OiPA9Js5v0e4gFzEcv0um5rshCAtngqHpaBRQBIRhwkZfHHMO6rBIHd0Zv9vMv0yfJ7N0YPCzx8ayHVjvSkBpP1Zxc1JsHhs7G9N5PFFnXxGthAMHQgHXgJQmETNm6D9
Requires: libQtCore.so.4 >= set:phiBxZmk4xk6IOE3fdjwt5IXz3UDfFPxKmgX1PcdZ2q14uV9DHZdh8Uff5xtxWsd9PTqFSaBTzhHNk8IXkg76o3ZC2iXbRFaE9ZHF6fVhxZcNC8yXRUVqG6MFsq12pu9gyK3JEPZA274bsl0iybureR4xJfiyO1uE9v80UZnj9hWS4wCRoLViXQxpubNnQf3udcwZHN0y3Ah2oSUHHwCA7pDtWtgbqtujx6ZKxVVdXXXpk22xJIiv57ryS1A0hfllHTa0AbMwAxpFkEFh0QGqZHHtJeQxslgBSlBepYFSLFjsvHYkol8yuX28LvFj0izKcvUBMeX5NUVKRS4g3GMk4NeQkyKHsVDiXuXotx78MZfPASQxLonBtwsOoa4aZ3Ls0j6WWDbrSLtSZC2Ld92XwjRG0TGmXH8yf663, libQtGui.so.4 >= set:rnGUavpfjOC2gaIoCXXRUbqDEqmyGVQWrJkZ0QOxapNpB8lMbDh61, libQtXml.so.4 >= set:mhT6MCCCfxyMAZeyGiZ7ceRfjP21PEnGfK9ObEZjEGlNicYcP3ag5sUkVk7IiSYhb4t0B70L8gHHZL8yX4, libakonadi-notes.so.4 >= set:je4TMImsRDqCrfyZFMOkRgNNbi5Y6kSiICBOsjAsEpp2XEF4E6X34JsBZ0HPdS, libc.so.6(GLIBC_2.0), libc.so.6(GLIBC_2.1.3), libc.so.6(GLIBC_2.4), libgcc_s.so.1(GCC_3.0), libkabc.so.4 >= set:og6d0aR0odTmHvd1uzOh0WlxPvIcakyRNBnk90XrGVrMAENIFLpTDTA3LZbah1OzwZmfOEFDMLD7hlz0Kx7GBgRrTfez6BmqNb34yw17km7sHij7pZgZwCCPHkWozdwAMIvbQqvWfn5mLrZJ0OH4Z4mSUEZkQPGYJaxtE5IexSGLtyK0JX0C6SXm8UUDo1Mt1Aviv5GX8jmtCn5Q1JCZIxnMZz4jIiq5Ha0c6MyFGjXBuVwJnK7xuPU2uSMDJPSk4X50CWntsspmWCUAXmmtRITQ6YtyDwVzDd9ghUzpWZ9AIB0iJoX5086Kg895TGEAbRopCiYgJR8sNuHwcxJAu2C0j7LXLFV1, libkcalcore.so.4 >= set:ogeINBDUSiCUYtVlvWIKLI9ZnmEbARItp0rb06RdQ4heHsZx2uNWnVDhhZiorWIGxhcQZyHz8ZlDiF9MopLw6dBNxgpum9LhLua8803mCuwvmOwCAemWVqgpKJQky2Jrf2ClnChiwcYo1xTcdyCJKdWdHx0pcyZB0n3fzALSyQMaZmRCSJOZ1ZwODAvY9sPEr4oXrOxjaKA8OyAtn11BomtszPs8xlIZwviFxQpyiTph1WoU8KKMxCsjoskyYECbqVocGNLx7eh25V8W9ZuzU9IGwCHiRmZLVEQnGstW6y5EQt3J6Rbi8ZxccQcRZ0hVqaYKUoyPMxXOoI9yJGE83Z3kIvV6BaYuqQcRZKt0Y7BkXZ2qh1eeygZoIroj7Xr3WNwn0UaZ274otqCpXS6zwAQoc4FTbmN43EShCJ9r23cR5nOYJncNRvGCn9YZryEfPg6kUZFz9fUXncowoxCL9TmKwaPNicCOimjDnXGhm5bzOa96Zk7uAclgsRBMpf9RK0jZ2gi4o8DDLQ1n5aXNqkrVCvMUNw4B2zuQpY0aaxRZvQZF7io0t1woJWcHUad5bfoJRxJNggnDe2, libkcalutils.so.4 >= set:lkLO5, libkdecore.so.5 >= set:qkKoVKZhHRvEAOZjiBdo15jabLuJ3sLscrZGQQsabZpIZ0zZcbcR5ogmj2OxmnHBJ9kQoA6tyUi8ZwTRDaggZvrZpaDkhZ6jyiyDxQYo0ALEgtVJ5Wzh5CXn20JphcPBVsgWt1egAe0CyvGztjvKL7SJSecqw1mo, libkmime.so.4 >= set:oif6KQ49sDiXFfW1JqbRhhIpPCztrGV25xOgND9Bp9adMjCygg6Ck89NP33EiZ5uH9PZoYcWiNZLudYP01FOyArNbmJP3wITuxrCxaM0Z4Efta, libkolabxml.so.1 >= set:rikBs3zNxizJgTpddW9cUxk10uy8u2CZ7V7qFSqT2mhc4r36ZqZqarePE3DnZqvhDGrg3cw5w9nxKOiy9sai82Yq0rVMAZpDug0JNdkSrV0WjAdAm3LgD6ZyJlmgV3QDeiROZdTs2oWuEC9yaYUEVV3YkSSZfqdwENuRd5XC3JgFnlQqoZmiavNhouGW0ow7FelnDoQoAoSr3SszpzDt20vyFQsNEshS4oqb8SO1sx4FVWZKVjYwSQaR2XKRZsZrl2Tnv07Y0iUNzu2eCJUlsIWTkZEspxy9A84NaoZe7jQ7OT2w5jXiFJmzYs2xiHYhnRVvO79LRQYeZzgsE2gR98A9EzIjKerIxz7gMCJSuRNF7UC7kIUVHq9hXpzliDFtHEFZy7twkc06TNFbntfnM0VqNZiGeXyx7HtPsBZqjsCOmYh09b9laQ0ZeRslnglHSXvvIPRVXppm04i2B3iVZvYk6Jc7yIZu3C5eZAOltJkhcrrj8Z3zOfke2IiksnzAvn3mWb4Hj0AZEVjK4XkDC6aMZKZvs4qBeLQZp9AEAyDuqErGhOfZHmPFna3C0vesJ9TEW5jxyu0nYjts4OwPHb2nydGTTponfeWj5yIYSFv07UPjPPpihNvHez0ItxAe4EbkirWVj1aLZbZtKQGm4VS2VZ7r9BsQFMWjhJI3bWhZEZE6JG5hGCyqcVW4eABCAyngapl2ZkPR0fZHiwoeFYj6M0yN4KfGTtBVecXtaAZ9d0JYZoNxbwCKLmmG0ahMiw3NmhUbaCpPRIurAzU3ZIz7QMqDNhSEt838JAJ8m4ta0NgMrY5klV2snTUho3yDxq5sJxSZziIX83GRH8Oqc5N6k9KNYSsCVk1e7mDCwtIUqpZ6u4x5j364iI1CYZ8xFZJsZuYngsmUGsimzDoJru9ZmLc340u4sF2aS3AlouO4IkeeqXLUBgLVuZJqEfGFgrLqjdLLh3nwfIhISlW8gZBjUhJOaladUPzZxBPFoiRL3WeW49xZ0oUfUptytv90ZnUSj8GW1lMI, libkpimutils.so.4 >= set:kiyZ1ozv0, libstdc++.so.6(CXXABI_1.3), libstdc++.so.6(GLIBCXX_3.4), libstdc++.so.6(GLIBCXX_3.4.11), libstdc++.so.6(GLIBCXX_3.4.20), libstdc++.so.6(GLIBCXX_3.4.21), libstdc++.so.6(GLIBCXX_3.4.9), rtld(GNU_HASH), rtld(GNU_UNIQUE)
Requires(rpmlib): rpmlib(SetVersions)
Finding debuginfo files (using /usr/lib/rpm/find-debuginfo-files)
Executing: /bin/sh -e /usr/src/tmp/rpm-tmp.G81xk3
Creating libkolab-debuginfo package
Processing files: libkolab-devel-0.5.3-alt1.qa1
Finding Provides (using /usr/lib/rpm/find-provides)
Executing: /bin/sh -e /usr/src/tmp/rpm-tmp.M6SY9F
find-provides: running scripts (alternatives,debuginfo,gir,lib,pam,perl,pkgconfig,python,shell,typelib)
Finding Requires (using /usr/lib/rpm/find-requires)
Executing: /bin/sh -e /usr/src/tmp/rpm-tmp.UQnuNP
find-requires: running scripts (cpp,debuginfo,files,gir-js,gir-python,gir,lib,pam,perl,pkgconfig,pkgconfiglib,python,rpmlib,shebang,shell,static,symlinks,typelib)
/usr/src/tmp/libkolab-buildroot/usr/include/kolab/freebusy.h:23:10: fatal error: kolabevent.h: No such file or directory
 #include <kolabevent.h>
          ^~~~~~~~~~~~~~
compilation terminated.
cpp.req: /usr/src/tmp/libkolab-buildroot/usr/include/kolab/freebusy.h: cpp failed, trying c++ mode
/usr/src/tmp/libkolab-buildroot/usr/include/kolab/freebusy.h:23:10: fatal error: kolabevent.h: No such file or directory
 #include <kolabevent.h>
          ^~~~~~~~~~~~~~
compilation terminated.
cpp.req: WARNING: /usr/src/tmp/libkolab-buildroot/usr/include/kolab/freebusy.h: cpp failed
/usr/src/tmp/libkolab-buildroot/usr/include/kolab/xmlobject.h:28:10: fatal error: kolabformat.h: No such file or directory
 #include <kolabformat.h>
          ^~~~~~~~~~~~~~~
compilation terminated.
cpp.req: /usr/src/tmp/libkolab-buildroot/usr/include/kolab/xmlobject.h: cpp failed, trying c++ mode
/usr/src/tmp/libkolab-buildroot/usr/include/kolab/xmlobject.h:28:10: fatal error: kolabformat.h: No such file or directory
 #include <kolabformat.h>
          ^~~~~~~~~~~~~~~
compilation terminated.
cpp.req: WARNING: /usr/src/tmp/libkolab-buildroot/usr/include/kolab/xmlobject.h: cpp failed
/usr/src/tmp/libkolab-buildroot/usr/include/kolab/mimeobject.h:28:10: fatal error: kolabformat.h: No such file or directory
 #include <kolabformat.h>
          ^~~~~~~~~~~~~~~
compilation terminated.
cpp.req: /usr/src/tmp/libkolab-buildroot/usr/include/kolab/mimeobject.h: cpp failed, trying c++ mode
/usr/src/tmp/libkolab-buildroot/usr/include/kolab/mimeobject.h:28:10: fatal error: kolabformat.h: No such file or directory
 #include <kolabformat.h>
          ^~~~~~~~~~~~~~~
compilation terminated.
cpp.req: WARNING: /usr/src/tmp/libkolab-buildroot/usr/include/kolab/mimeobject.h: cpp failed
/usr/src/tmp/libkolab-buildroot/usr/include/kolab/kolabobject.h:23:10: fatal error: kabc/addressee.h: No such file or directory
 #include <kabc/addressee.h>
          ^~~~~~~~~~~~~~~~~~
compilation terminated.
cpp.req: /usr/src/tmp/libkolab-buildroot/usr/include/kolab/kolabobject.h: cpp failed, trying c++ mode
/usr/src/tmp/libkolab-buildroot/usr/include/kolab/kolabobject.h:23:10: fatal error: kabc/addressee.h: No such file or directory
 #include <kabc/addressee.h>
          ^~~~~~~~~~~~~~~~~~
compilation terminated.
cpp.req: WARNING: /usr/src/tmp/libkolab-buildroot/usr/include/kolab/kolabobject.h: cpp failed
/usr/src/tmp/libkolab-buildroot/usr/include/kolab/errorhandler.h:24:10: fatal error: QString: No such file or directory
 #include <QString>
          ^~~~~~~~~
compilation terminated.
cpp.req: /usr/src/tmp/libkolab-buildroot/usr/include/kolab/errorhandler.h: cpp failed, trying c++ mode
/usr/src/tmp/libkolab-buildroot/usr/include/kolab/errorhandler.h:24:10: fatal error: QString: No such file or directory
 #include <QString>
          ^~~~~~~~~
compilation terminated.
cpp.req: WARNING: /usr/src/tmp/libkolab-buildroot/usr/include/kolab/errorhandler.h: cpp failed
/usr/src/tmp/libkolab-buildroot/usr/include/kolab/formathelpers.h:6:10: fatal error: string: No such file or directory
 #include <string>
          ^~~~~~~~
compilation terminated.
cpp.req: /usr/src/tmp/libkolab-buildroot/usr/include/kolab/formathelpers.h: cpp failed, trying c++ mode
/usr/src/tmp/libkolab-buildroot/usr/include/kolab/kabcconversion.h:23:10: fatal error: kolabcontact.h: No such file or directory
 #include <kolabcontact.h>
          ^~~~~~~~~~~~~~~~
compilation terminated.
cpp.req: WARNING: /usr/src/tmp/libkolab-buildroot/usr/include/kolab/kabcconversion.h: cpp failed
/usr/src/tmp/libkolab-buildroot/usr/include/kolab/kcalconversion.h:23:10: fatal error: kolabevent.h: No such file or directory
 #include <kolabevent.h>
          ^~~~~~~~~~~~~~
compilation terminated.
cpp.req: WARNING: /usr/src/tmp/libkolab-buildroot/usr/include/kolab/kcalconversion.h: cpp failed
/usr/src/tmp/libkolab-buildroot/usr/include/kolab/commonconversion.h:23:10: fatal error: kdatetime.h: No such file or directory
 #include <kdatetime.h>
          ^~~~~~~~~~~~~
compilation terminated.
cpp.req: WARNING: /usr/src/tmp/libkolab-buildroot/usr/include/kolab/commonconversion.h: cpp failed
Requires: libkolab = 0.5.3-alt1.qa1, libkolabxml-devel >= 0.8, /usr/lib/libkolab.so.0
Finding debuginfo files (using /usr/lib/rpm/find-debuginfo-files)
Executing: /bin/sh -e /usr/src/tmp/rpm-tmp.ik5MPM
Processing files: libkolab-debuginfo-0.5.3-alt1.qa1
Finding Provides (using /usr/lib/rpm/find-provides)
Executing: /bin/sh -e /usr/src/tmp/rpm-tmp.8KBI0x
find-provides: running scripts (debuginfo)
Finding Requires (using /usr/lib/rpm/find-requires)
Executing: /bin/sh -e /usr/src/tmp/rpm-tmp.4lbiPU
find-requires: running scripts (debuginfo)
Provides: debug(libkolab.so.0)
Requires: libkolab = 0.5.3-alt1.qa1, debug(libQtCore.so.4), debug(libQtGui.so.4), debug(libQtXml.so.4), debug(libakonadi-notes.so.4), debug(libc.so.6), debug(libgcc_s.so.1), debug(libkabc.so.4), debug(libkcalcore.so.4), debug(libkcalutils.so.4), debug(libkdecore.so.5), debug(libkmime.so.4), debug(libkolabxml.so.1), debug(libkpimutils.so.4), debug(libstdc++.so.6)
Removing 1 extra deps from libkolab-devel due to dependency on libkolab
Wrote: /usr/src/RPM/RPMS/i586/libkolab-0.5.3-alt1.qa1.i586.rpm
Wrote: /usr/src/RPM/RPMS/i586/libkolab-devel-0.5.3-alt1.qa1.i586.rpm
Wrote: /usr/src/RPM/RPMS/i586/libkolab-debuginfo-0.5.3-alt1.qa1.i586.rpm
194.67user 13.26system 2:34.33elapsed 134%CPU (0avgtext+0avgdata 326280maxresident)k
0inputs+0outputs (0major+4343325minor)pagefaults 0swaps
237.69user 30.84system 3:53.65elapsed 114%CPU (0avgtext+0avgdata 326280maxresident)k
362128inputs+0outputs (0major+5459799minor)pagefaults 0swaps
--- libkolab-0.5.3-alt1.qa1.i586.rpm.repo	2016-04-08 12:54:34.000000000 +0000
+++ libkolab-0.5.3-alt1.qa1.i586.rpm.hasher	2019-03-06 11:34:01.958034025 +0000
@@ -16,3 +16,3 @@
 Requires: libkmime.so.4 >= set:oif6KQ49sDiXFfW1JqbRhhIpPCztrGV25xOgND9Bp9adMjCygg6Ck89NP33EiZ5uH9PZoYcWiNZLudYP01FOyArNbmJP3wITuxrCxaM0Z4Efta
-Requires: libkolabxml.so.1 >= set:qhorOSHNMosEkTkSwBY2hW4wIN8ABeiMEDsHcytWFFLX2k10uyEm4RZfV871EtZEZwJWAq6xJ5IXrdx4BkIYuuL2qn9gY9urulSePE3DzdoZJekQFe1xw04ow5wBHgnpVp6A1jI42E8x8yYGdpLk4tRyFghf0KUnts4O0PHXsZ3FvuW1rEUsNGh2vDh9ELQCzZkUfgFU8LtW7w1ZsFVVcFsBgr8llbPtIu5zM7ZyJbboZgQDewGBZJTe1cXzpsldj4X4qrZuEVE7s6ZD7epZkxSXQZGR02cSbfOWWTnqJ5hh0XQG4pcZivbFscenlQqoYCArRwxg2it1VaxG385IorrgIDbmEsIdH3NbAG5xkd5i1wa2tty3pRAQXr8oPcCJbWAIa1van3VxBHez482eFY93o0NMYy4OOA6LRutBFZ3W92YeBenH7ZnF6JB1ayVGnw3n0EFXROG2EjHnqKKmgw3j5XjYEcZsnkcPCYs9R2b9OAbiGn4vkyCrBEcN7QoJP6Vj07u09nw4J39wQdmED8jYZ3jNF0yxM53PanglBbMI9kEIjTmZblhVwU5G0nmExiaxv4yo5IuZEMy8fWDq1bNKh6sy1ri5yICMZqbBSB46kpzMwDjEXl5zgG59GhcO1PaZAZkOrddLVv03qZJz9THIz5nbzTY4xBF13ETFaHrLRkYAXNwFZBAIjlu83O6139V52OYZLCr4bDiMjIqLsYmTzAWUw7UmfQOcg0UtHe5fvFmbUNYHYJsdmVqkeg62ShEfsNAQvtQ1iNMFrb77JZfUBwuP98nTCg7sfpEqaM67aogKmkMyXLUGqXrsU2bKlBq9mXZFAjysslsBuW4DyqZ09C6VaHimuPvNzWAI4Eix6ETRsXKjCzGmZ4Lj7AW8AlrFevebj1g29JkZtTtiphGZvFgeB1bPNiMUEyZ1cbsS9VEKml4rrr2FZzt7umTxaJicA0UfsX94ea0fawetC6p
+Requires: libkolabxml.so.1 >= set:rikBs3zNxizJgTpddW9cUxk10uy8u2CZ7V7qFSqT2mhc4r36ZqZqarePE3DnZqvhDGrg3cw5w9nxKOiy9sai82Yq0rVMAZpDug0JNdkSrV0WjAdAm3LgD6ZyJlmgV3QDeiROZdTs2oWuEC9yaYUEVV3YkSSZfqdwENuRd5XC3JgFnlQqoZmiavNhouGW0ow7FelnDoQoAoSr3SszpzDt20vyFQsNEshS4oqb8SO1sx4FVWZKVjYwSQaR2XKRZsZrl2Tnv07Y0iUNzu2eCJUlsIWTkZEspxy9A84NaoZe7jQ7OT2w5jXiFJmzYs2xiHYhnRVvO79LRQYeZzgsE2gR98A9EzIjKerIxz7gMCJSuRNF7UC7kIUVHq9hXpzliDFtHEFZy7twkc06TNFbntfnM0VqNZiGeXyx7HtPsBZqjsCOmYh09b9laQ0ZeRslnglHSXvvIPRVXppm04i2B3iVZvYk6Jc7yIZu3C5eZAOltJkhcrrj8Z3zOfke2IiksnzAvn3mWb4Hj0AZEVjK4XkDC6aMZKZvs4qBeLQZp9AEAyDuqErGhOfZHmPFna3C0vesJ9TEW5jxyu0nYjts4OwPHb2nydGTTponfeWj5yIYSFv07UPjPPpihNvHez0ItxAe4EbkirWVj1aLZbZtKQGm4VS2VZ7r9BsQFMWjhJI3bWhZEZE6JG5hGCyqcVW4eABCAyngapl2ZkPR0fZHiwoeFYj6M0yN4KfGTtBVecXtaAZ9d0JYZoNxbwCKLmmG0ahMiw3NmhUbaCpPRIurAzU3ZIz7QMqDNhSEt838JAJ8m4ta0NgMrY5klV2snTUho3yDxq5sJxSZziIX83GRH8Oqc5N6k9KNYSsCVk1e7mDCwtIUqpZ6u4x5j364iI1CYZ8xFZJsZuYngsmUGsimzDoJru9ZmLc340u4sF2aS3AlouO4IkeeqXLUBgLVuZJqEfGFgrLqjdLLh3nwfIhISlW8gZBjUhJOaladUPzZxBPFoiRL3WeW49xZ0oUfUptytv90ZnUSj8GW1lMI
 Requires: libkpimutils.so.4 >= set:kiyZ1ozv0
@@ -27,3 +27,3 @@
 Requires: rpmlib(PayloadIsLzma)  
-Provides: libkolab.so.0 = set:ldMmWT0QvdmEN7TSNdjfF53EhxW1cUScuKlISLQIyRkPNEBYNSSulSm05kMa0H3YpnpE79I1kttLmzpJuHZz9p3aARt2UJ9w70DCU1VMF7HiZfS64ZfhzOXYDRHZyPZgWgYV4mZgcloe8FxTnaEtrWQla9U0qiyFT9j4Vt1KtiF0ZkScGs15ZAwy3pFpOAmKyf0MaAEcv0um5rshCAtngqHpitiOm71iRZHK2brIlOKS0UZFY1ZxwUjXhc0ZICzx8X7bFRYFfrGOIVwZwCwmKR8K3RAUyVQQHZchB7jhAMHQgHXgJQmETNm6D9
+Provides: libkolab.so.0 = set:ldMmWT0Pkm66bQUzrXUCFDQy1QEgZ0oMJpYsHoJvFp5HFCzhbVzJJZaOS2Ew2m1otwfXa3WI0lnTHRomHTWZAiSw2ptD0ur2U1MF99Z3mesWNGkZHJ1hZDQEYeZFRHZyPZgWgYV4mZgcloe8FxTnaEtrWQla9U0qiyFT9j4Vtd20leFk0vOChBbEUD057OiPA9Js5v0e4gFzEcv0um5rshCAtngqHpaBRQBIRhwkZfHHMO6rBIHd0Zv9vMv0yfJ7N0YPCzx8ayHVjvSkBpP1Zxc1JsHhs7G9N5PFFnXxGthAMHQgHXgJQmETNm6D9
 Provides: libkolab = 0.5.3-alt1.qa1