<86>Jan 30 08:50:31 userdel[116387]: delete user 'rooter'
<86>Jan 30 08:50:31 userdel[116387]: removed group 'rooter' owned by 'rooter'
<86>Jan 30 08:50:31 userdel[116387]: removed shadow group 'rooter' owned by 'rooter'
<86>Jan 30 08:50:31 groupadd[116396]: group added to /etc/group: name=rooter, GID=597
<86>Jan 30 08:50:31 groupadd[116396]: group added to /etc/gshadow: name=rooter
<86>Jan 30 08:50:31 groupadd[116396]: new group: name=rooter, GID=597
<86>Jan 30 08:50:31 useradd[116401]: new user: name=rooter, UID=597, GID=597, home=/root, shell=/bin/bash
<86>Jan 30 08:50:31 userdel[116422]: delete user 'builder'
<86>Jan 30 08:50:31 userdel[116422]: removed group 'builder' owned by 'builder'
<86>Jan 30 08:50:31 userdel[116422]: removed shadow group 'builder' owned by 'builder'
<86>Jan 30 08:50:31 groupadd[116436]: group added to /etc/group: name=builder, GID=598
<86>Jan 30 08:50:31 groupadd[116436]: group added to /etc/gshadow: name=builder
<86>Jan 30 08:50:31 groupadd[116436]: new group: name=builder, GID=598
<86>Jan 30 08:50:31 useradd[116442]: new user: name=builder, UID=598, GID=598, home=/usr/src, shell=/bin/bash
<13>Jan 30 08:50:34 rpmi: strace-4.26-alt1 sisyphus.218650.100 1545875033 installed
<13>Jan 30 08:50:34 rpmi: rpm-macros-ubt-0.2-alt2 1488208885 installed
<13>Jan 30 08:50:34 rpmi: ed-1:0.2-alt10 1449768440 installed
<13>Jan 30 08:50:34 rpmi: rpm-utils-0.10-alt1 1481222510 installed
<13>Jan 30 08:50:34 rpmi: rpm-build-ubt-0.3.1-alt3 sisyphus.213781.100 1538147677 installed
warning: Macro %_qt4dir not found
warning: Macro %cmake not found
warning: Macro %cmake_build not found
<13>Jan 30 08:50:38 rpmi: xorg-proto-devel-2018.4-alt3 1527685079 installed
<13>Jan 30 08:50:38 rpmi: libjpeg-2:1.5.1-alt1 1498218318 installed
<13>Jan 30 08:50:38 rpmi: libpng16-1.6.36-alt1 sisyphus+219478.100.1.1 1547633314 installed
<13>Jan 30 08:50:38 rpmi: libexpat-2.2.4-alt1 1503305345 installed
<13>Jan 30 08:50:38 rpmi: libICE-1.0.9-alt1 1409902721 installed
<13>Jan 30 08:50:38 rpmi: libglvnd-7:1.1.0-alt3 sisyphus.215982.100 1541498632 installed
<13>Jan 30 08:50:38 rpmi: sgml-common-0.6.3-alt15 1423664786 installed
<13>Jan 30 08:50:38 rpmi: libsqlite3-3.26.0-alt1 sisyphus.219274.100 1547430858 installed
<13>Jan 30 08:50:38 rpmi: libSM-1.2.3-alt1 sisyphus.215747.100 1540812795 installed
<13>Jan 30 08:50:38 rpmi: libtiff5-4.0.3-alt1 1348347501 installed
<13>Jan 30 08:50:38 rpmi: libogg-1.3.3-alt1 sisyphus.217914.100 1545006091 installed
<13>Jan 30 08:50:38 rpmi: zlib-devel-1.2.11-alt1 sisyphus.217171.100 1543710737 installed
<13>Jan 30 08:50:38 rpmi: libwayland-client-1.16.0-alt1 1535614871 installed
<13>Jan 30 08:50:38 rpmi: libnspr-1:4.20-alt1 sisyphus.216395.100 1542113039 installed
<13>Jan 30 08:50:38 rpmi: xml-utils-1:2.9.4.0.12.e905-alt1.1 1525115767 installed
<13>Jan 30 08:50:38 rpmi: docbook-dtds-4.5-alt1 1223476557 installed
<13>Jan 30 08:50:38 rpmi: rpm-build-gir-0.7.2-alt4 1534675014 installed
<13>Jan 30 08:50:38 rpmi: libpng-devel-1.6.36-alt1 sisyphus+219478.100.1.1 1547633314 installed
<13>Jan 30 08:50:38 rpmi: libICE-devel-1.0.9-alt1 1409902721 installed
<13>Jan 30 08:50:38 rpmi: libSM-devel-1.2.3-alt1 sisyphus.215747.100 1540812795 installed
<13>Jan 30 08:50:38 rpmi: qt4-common-4.8.7-alt13.S1 1535591248 installed
<13>Jan 30 08:50:38 rpmi: libqt4-core-4.8.7-alt13.S1 1535591248 installed
<13>Jan 30 08:50:38 rpmi: libqt4-sql-4.8.7-alt13.S1 1535591248 installed
<13>Jan 30 08:50:38 rpmi: liblcms2-2.9-alt1 1516411892 installed
<13>Jan 30 08:50:38 rpmi: libXau-1.0.8-alt1 1369565808 installed
<13>Jan 30 08:50:38 rpmi: libwayland-server-1.16.0-alt1 1535614871 installed
<13>Jan 30 08:50:38 rpmi: libgdbm-1.8.3-alt10 1454943334 installed
<13>Jan 30 08:50:39 rpmi: libicu63-1:6.3.1-alt1 sisyphus.215328.100 1540049988 installed
<13>Jan 30 08:50:39 rpmi: libgraphite2-1.3.13-alt1 sisyphus.218545.100 1545686511 installed
<13>Jan 30 08:50:39 rpmi: libharfbuzz-2.2.0-alt1 sisyphus.218134.500 1545261518 installed
<13>Jan 30 08:50:39 rpmi: libfreetype-2.9.1-alt1.S1 1530781053 installed
<13>Jan 30 08:50:39 rpmi: fontconfig-2.13.1-alt1 sisyphus.215917.100 1540973886 installed
Updating fonts cache: <29>Jan 30 08:50:40 fontconfig: Updating fonts cache: succeeded
[ DONE ]
<13>Jan 30 08:50:40 rpmi: libidn2-2.1.0-alt2 sisyphus+219831.100.1.1 1548176663 installed
<13>Jan 30 08:50:40 rpmi: libharfbuzz-icu-2.2.0-alt1 sisyphus.218134.500 1545261518 installed
<13>Jan 30 08:50:40 rpmi: libgraphite2-devel-1.3.13-alt1 sisyphus.218545.100 1545686511 installed
<13>Jan 30 08:50:40 rpmi: icu-utils-1:6.3.1-alt1 sisyphus.215328.100 1540049988 installed
<13>Jan 30 08:50:40 rpmi: libicu-devel-1:6.3.1-alt1 sisyphus.215328.100 1540049988 installed
<13>Jan 30 08:50:40 rpmi: libXau-devel-1.0.8-alt1 1369565808 installed
<13>Jan 30 08:50:40 rpmi: libmng-2.0.3-alt2 sisyphus.215736.100 1540804101 installed
<13>Jan 30 08:50:40 rpmi: libqt4-sql-sqlite-4.8.7-alt13.S1 1535591248 installed
<13>Jan 30 08:50:40 rpmi: libqt4-xml-4.8.7-alt13.S1 1535591248 installed
<13>Jan 30 08:50:41 rpmi: libqt4-clucene-4.8.7-alt13.S1 1535591248 installed
<13>Jan 30 08:50:41 rpmi: libqt4-test-4.8.7-alt13.S1 1535591248 installed
<13>Jan 30 08:50:41 rpmi: rpm-macros-qt4-4.8.7-alt13.S1 1535591089 installed
<13>Jan 30 08:50:41 rpmi: docbook-style-xsl-1.79.1-alt2 sisyphus.213665.100 1537949315 installed
<13>Jan 30 08:50:41 rpmi: libnspr-devel-1:4.20-alt1 sisyphus.216395.100 1542113039 installed
<13>Jan 30 08:50:41 rpmi: libwayland-egl-4:18.1.0-alt1 1535614871 installed
<13>Jan 30 08:50:41 rpmi: libflac8-1.3.2-alt1 1507623955 installed
<13>Jan 30 08:50:41 rpmi: libvorbis-1.3.6-alt2 sisyphus+220072.200.2.2 1548744475 installed
<13>Jan 30 08:50:41 rpmi: libOpenGL-7:1.1.0-alt3 sisyphus.215982.100 1541498632 installed
<13>Jan 30 08:50:41 rpmi: libGLES-7:1.1.0-alt3 sisyphus.215982.100 1541498632 installed
<13>Jan 30 08:50:41 rpmi: libjasper-2.0.14-alt1 1530105217 installed
<13>Jan 30 08:50:41 rpmi: libwebp7-1.0.2-alt1 sisyphus+219651.100.1.2 1548057725 installed
<13>Jan 30 08:50:41 rpmi: libalsa-1:1.1.8-alt1 sisyphus+219888.100.4.1 1548752826 installed
<13>Jan 30 08:50:41 rpmi: libopenjpeg2.0-2.3.0-alt2 sisyphus.216213.100 1541598437 installed
<13>Jan 30 08:50:41 rpmi: libltdl7-2.4.2-alt7 sisyphus.216946.100 1543650637 installed
<13>Jan 30 08:50:41 rpmi: libunixODBC2-2.3.4-alt2 1487857381 installed
<13>Jan 30 08:50:41 rpmi: libunixODBC-devel-compat-2.3.4-alt2 1487857381 installed
<13>Jan 30 08:50:41 rpmi: libunixODBC-devel-2.3.4-alt2 1487857381 installed
<13>Jan 30 08:50:41 rpmi: libgtk+2-locales-2.24.32-alt2 1518699309 installed
<13>Jan 30 08:50:41 rpmi: liborc-0.4.28-alt1 1511201506 installed
<13>Jan 30 08:50:41 rpmi: libgudev-1:232-alt3 1523738518 installed
<13>Jan 30 08:50:41 rpmi: libgsm-1.0.17-alt1 1523356165 installed
<13>Jan 30 08:50:41 rpmi: libsndfile-1.0.28-alt2 sisyphus.212728.100 1536333068 installed
<13>Jan 30 08:50:41 rpmi: libfribidi-1.0.5-alt1 1532424345 installed
<13>Jan 30 08:50:41 rpmi: libdatrie-0.2.9-alt1_6 1511686676 installed
<13>Jan 30 08:50:41 rpmi: libthai-0.1.28-alt1_1 sisyphus.214516.100 1539257851 installed
<13>Jan 30 08:50:41 rpmi: libpixman-3:0.36.0-alt1 sisyphus+219464.100.1.1 1547627399 installed
<13>Jan 30 08:50:41 rpmi: liblz4-1:1.8.3-alt2 sisyphus.217095.200 1547082375 installed
<13>Jan 30 08:50:41 rpmi: libatk-locales-2.30.0-alt1 sisyphus.212779.100 1536768328 installed
<13>Jan 30 08:50:41 rpmi: libatk-2.30.0-alt1 sisyphus.212779.100 1536768334 installed
<13>Jan 30 08:50:41 rpmi: libasyncns-0.8-alt2.qa1 1365949820 installed
<13>Jan 30 08:50:41 rpmi: libxshmfence-1.2-alt2 1518613552 installed
<13>Jan 30 08:50:41 rpmi: libX11-locales-3:1.6.7-alt1 sisyphus.214413.200 1539171080 installed
<13>Jan 30 08:50:41 rpmi: libXdmcp-1.1.1-alt1 1334617701 installed
<13>Jan 30 08:50:41 rpmi: libxcb-1.13.1-alt1 sisyphus.214413.100 1539170896 installed
<13>Jan 30 08:50:41 rpmi: libX11-3:1.6.7-alt1 sisyphus.214413.200 1539171143 installed
<13>Jan 30 08:50:41 rpmi: libXext-1.3.3-alt1 1409902959 installed
<13>Jan 30 08:50:41 rpmi: libXrender-0.9.8-alt1 1371312112 installed
<13>Jan 30 08:50:41 rpmi: libXfixes-5.0.3-alt1 sisyphus.216396.300 1542022162 installed
<13>Jan 30 08:50:41 rpmi: libXcursor-1.1.15-alt1.S1 1512373366 installed
<13>Jan 30 08:50:41 rpmi: libXrandr-1.5.0-alt1 1431936189 installed
<13>Jan 30 08:50:41 rpmi: libXi-1.7.9-alt1.S1 1515755342 installed
<13>Jan 30 08:50:41 rpmi: libXinerama-1.1.3-alt2 1527671619 installed
<13>Jan 30 08:50:42 rpmi: libqt4-gui-4.8.7-alt13.S1 1535591248 installed
<13>Jan 30 08:50:42 rpmi: libXft-2.3.2-alt1 1409902660 installed
<13>Jan 30 08:50:42 rpmi: libXdamage-1.1.3-alt4 1297162593 installed
<13>Jan 30 08:50:43 rpmi: libxcb-devel-1.13.1-alt1 sisyphus.214413.100 1539170896 installed
<13>Jan 30 08:50:43 rpmi: libX11-devel-3:1.6.7-alt1 sisyphus.214413.200 1539171143 installed
<13>Jan 30 08:50:43 rpmi: libXext-devel-1.3.3-alt1 1409902959 installed
<13>Jan 30 08:50:43 rpmi: libXrender-devel-0.9.8-alt1 1371312112 installed
<13>Jan 30 08:50:43 rpmi: libXfixes-devel-5.0.3-alt1 sisyphus.216396.300 1542022162 installed
<13>Jan 30 08:50:43 rpmi: libXi-devel-1.7.9-alt1.S1 1515755342 installed
<13>Jan 30 08:50:43 rpmi: libXrandr-devel-1.5.0-alt1 1431936189 installed
<13>Jan 30 08:50:43 rpmi: libXcursor-devel-1.1.15-alt1.S1 1512373366 installed
<13>Jan 30 08:50:43 rpmi: libXinerama-devel-1.1.3-alt2 1527671619 installed
<13>Jan 30 08:50:43 rpmi: libqt4-svg-4.8.7-alt13.S1 1535591248 installed
<13>Jan 30 08:50:43 rpmi: libqt4-uitools-4.8.7-alt13.S1 1535591248 installed
<13>Jan 30 08:50:43 rpmi: libqt4-multimedia-4.8.7-alt13.S1 1535591248 installed
<13>Jan 30 08:50:43 rpmi: libXxf86vm-1.1.4-alt2 1527672187 installed
<13>Jan 30 08:50:43 rpmi: libXtst-1.2.2-alt1 1369984893 installed
<13>Jan 30 08:50:43 rpmi: libXtst-devel-1.2.2-alt1 1369984893 installed
<13>Jan 30 08:50:43 rpmi: libXv-1.0.11-alt1 1527685499 installed
<13>Jan 30 08:50:43 rpmi: libXv-devel-1.0.11-alt1 1527685499 installed
<13>Jan 30 08:50:43 rpmi: libXcomposite-0.4.3-alt3 1297306936 installed
<13>Jan 30 08:50:43 rpmi: libXt-1.1.4-alt1 1369984722 installed
<13>Jan 30 08:50:43 rpmi: libpciaccess-1:0.14-alt1 1528969252 installed
<13>Jan 30 08:50:43 rpmi: libdrm-1:2.4.96-alt1 sisyphus.215486.100 1540374027 installed
<13>Jan 30 08:50:43 rpmi: libGLX-mesa-4:18.3.2-alt1 sisyphus+219595.100.1.1 1547814036 installed
<13>Jan 30 08:50:43 rpmi: libgbm-4:18.3.2-alt1 sisyphus+219595.100.1.1 1547814036 installed
<13>Jan 30 08:50:43 rpmi: libEGL-mesa-4:18.3.2-alt1 sisyphus+219595.100.1.1 1547814036 installed
<13>Jan 30 08:50:43 rpmi: libEGL-7:1.1.0-alt3 sisyphus.215982.100 1541498632 installed
<13>Jan 30 08:50:43 rpmi: libGLX-7:1.1.0-alt3 sisyphus.215982.100 1541498632 installed
<13>Jan 30 08:50:44 rpmi: libGL-7:1.1.0-alt3 sisyphus.215982.100 1541498632 installed
<13>Jan 30 08:50:44 rpmi: libcairo-1:1.16.0-alt1 sisyphus.215566.100 1540457683 installed
<13>Jan 30 08:50:44 rpmi: libpango-1.42.4-alt1 1534787259 installed
<13>Jan 30 08:50:44 rpmi: libglvnd-devel-7:1.1.0-alt3 sisyphus.215982.100 1541498632 installed
<13>Jan 30 08:50:44 rpmi: libEGL-devel-4:18.3.2-alt1 sisyphus+219595.100.1.1 1547814036 installed
<13>Jan 30 08:50:44 rpmi: libGL-devel-4:18.3.2-alt1 sisyphus+219595.100.1.1 1547814036 installed
<13>Jan 30 08:50:44 rpmi: libqt4-opengl-4.8.7-alt13.S1 1535591248 installed
<13>Jan 30 08:50:44 rpmi: libcairo-gobject-1:1.16.0-alt1 sisyphus.215566.100 1540457683 installed
<13>Jan 30 08:50:44 rpmi: libGLU-4:9.0.0-alt1 1347643784 installed
<13>Jan 30 08:50:44 rpmi: libGLU-devel-4:9.0.0-alt1 1347643784 installed
<13>Jan 30 08:50:44 rpmi: icon-theme-hicolor-0.17-alt1 1505715846 installed
<13>Jan 30 08:50:44 rpmi: libgdk-pixbuf-locales-2.38.0-alt4 sisyphus.219229.400 1547220196 installed
<13>Jan 30 08:50:44 rpmi: libOpenSP-1.5.2-alt3.qa1 1365943435 installed
<13>Jan 30 08:50:44 rpmi: openjade-1.3.2-alt15 sisyphus+219815.100.1.1 1548167857 installed
<13>Jan 30 08:50:44 rpmi: docbook-style-dsssl-1.79-alt3 1324062818 installed
<13>Jan 30 08:50:44 rpmi: highlight-3.38-alt1 1499785557 installed
<13>Jan 30 08:50:44 rpmi: python-modules-curses-2.7.15-alt1 sisyphus.217364.100 1544022423 installed
<13>Jan 30 08:50:44 rpmi: libxapian-1.4.5-alt3 sisyphus.215025.100 1539610704 installed
<13>Jan 30 08:50:44 rpmi: python-sphinx-objects.inv-1:2.3.8.20190127-alt1 sisyphus+220063.100.1.2 1548744416 installed
<13>Jan 30 08:50:44 rpmi: libgpg-error-1.31-alt1.S1 1529015802 installed
<13>Jan 30 08:50:44 rpmi: libgcrypt20-1.8.3-alt4 sisyphus.218050.200 1545223289 installed
<13>Jan 30 08:50:44 rpmi: libxslt-1.1.32-alt2 1517429984 installed
<13>Jan 30 08:50:45 rpmi: libsystemd-1:240-alt4 sisyphus.219244.100 1547241502 installed
<13>Jan 30 08:50:45 rpmi: libdbus-1.12.12-alt1 sisyphus.217336.100 1544000923 installed
<13>Jan 30 08:50:45 rpmi: libqt4-dbus-4.8.7-alt13.S1 1535591248 installed
<13>Jan 30 08:50:45 rpmi: libqt4-script-4.8.7-alt13.S1 1535591248 installed
<13>Jan 30 08:50:45 rpmi: libqt4-designer-4.8.7-alt13.S1 1535591248 installed
<13>Jan 30 08:50:45 rpmi: libqt4-scripttools-4.8.7-alt13.S1 1535591248 installed
<13>Jan 30 08:50:45 rpmi: libavahi-0.6.32-alt1 1500485702 installed
<13>Jan 30 08:50:45 rpmi: libdbus-devel-1.12.12-alt1 sisyphus.217336.100 1544000923 installed
<13>Jan 30 08:50:45 rpmi: libpulseaudio-12.2-alt1 1535623585 installed
<13>Jan 30 08:50:45 rpmi: libphonon-4.8.3-alt1 1418134069 installed
<13>Jan 30 08:50:45 rpmi: libphononexperimental-4.8.3-alt1 1418134069 installed
<13>Jan 30 08:50:45 rpmi: xsltproc-1.1.32-alt2 1517429984 installed
<13>Jan 30 08:50:45 rpmi: libffi-devel-1:3.2.1-alt2 1528881777 installed
<13>Jan 30 08:50:45 rpmi: shared-mime-info-1.12-alt1 sisyphus+219597.100.2.2 1548057005 installed
<13>Jan 30 08:50:45 rpmi: gsettings-desktop-schemas-data-3.28.1-alt1 sisyphus.212587.100 1536082062 installed
<13>Jan 30 08:50:45 rpmi: libgio-2.58.3-alt1 sisyphus+219722.100.1.1 1548088777 installed
<13>Jan 30 08:50:45 rpmi: gsettings-desktop-schemas-3.28.1-alt1 sisyphus.212587.100 1536082066 installed
<13>Jan 30 08:50:45 rpmi: gobject-introspection-1.58.3-alt1 sisyphus.218857.100 1546259916 installed
<13>Jan 30 08:50:46 rpmi: libgdk-pixbuf-2.38.0-alt4 sisyphus.219229.400 1547220208 installed
<13>Jan 30 08:50:46 rpmi: gobject-introspection-x11-1.58.3-alt1 sisyphus.218857.100 1546259916 installed
<13>Jan 30 08:50:46 rpmi: libpango-gir-1.42.4-alt1 1534787259 installed
<13>Jan 30 08:50:46 rpmi: libgdk-pixbuf-gir-2.38.0-alt4 sisyphus.219229.400 1547220208 installed
<13>Jan 30 08:50:46 rpmi: libatk-gir-2.30.0-alt1 sisyphus.212779.100 1536768334 installed
<13>Jan 30 08:50:46 rpmi: libgstreamer1.0-1.14.4-alt1 sisyphus.214120.2200 1538778557 installed
<13>Jan 30 08:50:46 rpmi: libgst-plugins1.0-1.14.4-alt3 sisyphus.216849.100 1543144442 installed
<13>Jan 30 08:50:46 rpmi: gtk-update-icon-cache-3.24.4-alt1 sisyphus+219722.200.2.2 1548107296 installed
<13>Jan 30 08:50:46 rpmi: libgdk-pixbuf-xlib-2.38.0-alt4 sisyphus.219229.400 1547220208 installed
<13>Jan 30 08:50:46 rpmi: gcc-c++-common-1.4.23-alt1 sisyphus.218115.200 1545282875 installed
<13>Jan 30 08:50:46 rpmi: libstdc++8-devel-8.2.1-alt3 sisyphus.219333.200 1547468342 installed
<13>Jan 30 08:50:47 rpmi: gcc8-c++-8.2.1-alt3 sisyphus.219333.200 1547468342 installed
<13>Jan 30 08:50:47 rpmi: libuv-1.23.2-alt1 sisyphus.217108.100 1543612230 installed
<13>Jan 30 08:50:47 rpmi: librhash-1.3.5-alt2 1505156279 installed
<13>Jan 30 08:50:47 rpmi: libjsoncpp19-1.8.4-alt2.S1 1518769525 installed
<13>Jan 30 08:50:47 rpmi: publicsuffix-list-dafsa-20181106-alt1 sisyphus.216228.100 1541611754 installed
<13>Jan 30 08:50:47 rpmi: libpsl-0.20.2-alt2 sisyphus.216228.200 1541611889 installed
<13>Jan 30 08:50:47 rpmi: libnghttp2-1.34.0-alt1 sisyphus.214524.100 1539249634 installed
<13>Jan 30 08:50:47 rpmi: libverto-0.3.0-alt1_5 1525957714 installed
<13>Jan 30 08:50:47 rpmi: libkeyutils-1.6-alt2 sisyphus.217337.100 1544003161 installed
<13>Jan 30 08:50:47 rpmi: libcom_err-1.44.5-alt1 sisyphus.218838.100 1546206118 installed
<13>Jan 30 08:50:47 rpmi: libbrotlicommon-1.0.7-alt1 sisyphus.215491.100 1540428597 installed
<13>Jan 30 08:50:47 rpmi: libbrotlidec-1.0.7-alt1 sisyphus.215491.100 1540428597 installed
<13>Jan 30 08:50:47 rpmi: libnettle6-3.4.1-alt1 sisyphus.217427.100 1544107917 installed
<13>Jan 30 08:50:47 rpmi: libarchive13-3.3.1-alt2 sisyphus.219343.100 1547461970 installed
<13>Jan 30 08:50:47 rpmi: rpm-macros-cmake-3.13.1-alt1 sisyphus.217317.100 1544006298 installed
<13>Jan 30 08:50:47 rpmi: cmake-modules-3.13.1-alt1 sisyphus.217317.100 1544006285 installed
<13>Jan 30 08:50:47 rpmi: libtasn1-4.13-alt2 1521133850 installed
<13>Jan 30 08:50:47 rpmi: libp11-kit-0.23.9-alt5 1525798298 installed
<13>Jan 30 08:50:47 rpmi: bc-1:1.07.1-alt1 sisyphus.218158.200 1545308145 installed
<13>Jan 30 08:50:47 rpmi: rpm-macros-alternatives-0.5.0-alt1 sisyphus.219012.300 1546745004 installed
<13>Jan 30 08:50:47 rpmi: alternatives-0.5.0-alt1 sisyphus.219012.300 1546745004 installed
<13>Jan 30 08:50:47 rpmi: libnss-3.40.1-alt1 sisyphus.218259.100 1545764952 installed
<13>Jan 30 08:50:47 rpmi: ca-certificates-2018.11.12-alt1 sisyphus.216395.300 1542114035 installed
<13>Jan 30 08:50:47 rpmi: ca-trust-0.1.1-alt2 1515595785 installed
<13>Jan 30 08:50:47 rpmi: p11-kit-trust-0.23.9-alt5 1525798298 installed
<13>Jan 30 08:50:47 rpmi: libcrypto1.1-1.1.0j-alt1 sisyphus.216647.100 1542743878 installed
<13>Jan 30 08:50:47 rpmi: libssl1.1-1.1.0j-alt1 sisyphus.216647.100 1542743878 installed
<13>Jan 30 08:50:47 rpmi: libpython3-3.6.5-alt1.1 1535734576 installed
<13>Jan 30 08:50:47 rpmi: rpm-build-python3-0.1.13.1-alt2 1535450458 installed
<13>Jan 30 08:50:47 rpmi: tests-for-installed-python3-pkgs-0.1.13.1-alt2 1535450458 installed
<13>Jan 30 08:50:47 rpmi: python3-3.6.5-alt1.1 1535734576 installed
<13>Jan 30 08:50:48 rpmi: python3-base-3.6.5-alt1.1 1535734576 installed
<13>Jan 30 08:50:48 rpmi: python3-module-pkg_resources-1:40.6.3-alt1 sisyphus+219164.200.2.1 1548188195 installed
<13>Jan 30 08:50:48 rpmi: python3-module-six-1.12.0-alt1 sisyphus+219665.100.2.1 1548148570 installed
<13>Jan 30 08:50:48 rpmi: glib2-devel-2.58.3-alt1 sisyphus+219722.100.1.1 1548088777 installed
<86>Jan 30 08:50:48 groupadd[36518]: group added to /etc/group: name=_keytab, GID=499
<86>Jan 30 08:50:48 groupadd[36518]: group added to /etc/gshadow: name=_keytab
<86>Jan 30 08:50:48 groupadd[36518]: new group: name=_keytab, GID=499
<13>Jan 30 08:50:48 rpmi: libkrb5-1.16.3-alt1 sisyphus.219042.100 1547045815 installed
<13>Jan 30 08:50:48 rpmi: libqt4-network-4.8.7-alt13.S1 1535591248 installed
<13>Jan 30 08:50:48 rpmi: libgio-devel-2.58.3-alt1 sisyphus+219722.100.1.1 1548088777 installed
<13>Jan 30 08:50:48 rpmi: libgdk-pixbuf-devel-2.38.0-alt4 sisyphus.219229.400 1547220208 installed
<13>Jan 30 08:50:48 rpmi: libatk-devel-2.30.0-alt1 sisyphus.212779.100 1536768334 installed
<13>Jan 30 08:50:48 rpmi: python3-module-idna-2.7-alt1 1530720902 installed
<13>Jan 30 08:50:48 rpmi: libqt4-qt3support-4.8.7-alt13.S1 1535591248 installed
<13>Jan 30 08:50:48 rpmi: libqt4-help-4.8.7-alt13.S1 1535591248 installed
<13>Jan 30 08:50:48 rpmi: libqt4-xmlpatterns-4.8.7-alt13.S1 1535591248 installed
<13>Jan 30 08:50:49 rpmi: libqt4-declarative-4.8.7-alt13.S1 1535591248 installed
<13>Jan 30 08:50:49 rpmi: libqt4-4.8.7-alt13.S1 1535591089 installed
<13>Jan 30 08:50:49 rpmi: libqt4-webkit-1:2.3.4-alt6 sisyphus.215264.100 1540024276 installed
<86>Jan 30 08:50:49 groupadd[39173]: group added to /etc/group: name=sasl, GID=498
<86>Jan 30 08:50:49 groupadd[39173]: group added to /etc/gshadow: name=sasl
<86>Jan 30 08:50:49 groupadd[39173]: new group: name=sasl, GID=498
<13>Jan 30 08:50:49 rpmi: libsasl2-3-2.1.27-alt1 sisyphus.218476.200 1545647755 installed
<13>Jan 30 08:50:50 rpmi: libldap-2.4.46-alt1.1 sisyphus+219907.4400.1.1 1548349979 installed
<13>Jan 30 08:50:50 rpmi: libcurl-7.63.0-alt1 sisyphus.217831.100 1544762811 installed
<13>Jan 30 08:50:50 rpmi: libtirpc-1.0.3-alt1 1532008017 installed
<13>Jan 30 08:50:50 rpmi: libnsl2-1.1.0-alt1_1 1511548749 installed
<13>Jan 30 08:50:50 rpmi: python-modules-encodings-2.7.15-alt1 sisyphus.217364.100 1544022423 installed
<13>Jan 30 08:50:50 rpmi: python-modules-compiler-2.7.15-alt1 sisyphus.217364.100 1544022423 installed
<13>Jan 30 08:50:50 rpmi: python-modules-email-2.7.15-alt1 sisyphus.217364.100 1544022423 installed
<13>Jan 30 08:50:50 rpmi: python-modules-unittest-2.7.15-alt1 sisyphus.217364.100 1544022423 installed
<13>Jan 30 08:50:50 rpmi: python-modules-nis-2.7.15-alt1 sisyphus.217364.100 1544022423 installed
<13>Jan 30 08:50:50 rpmi: python-modules-2.7.15-alt1 sisyphus.217364.100 1544022423 installed
<13>Jan 30 08:50:50 rpmi: python-modules-xml-2.7.15-alt1 sisyphus.217364.100 1544022423 installed
<13>Jan 30 08:50:50 rpmi: gtk-builder-convert-2.24.32-alt2 1518699309 installed
<13>Jan 30 08:50:50 rpmi: python-modules-hotshot-2.7.15-alt1 sisyphus.217364.100 1544022423 installed
<13>Jan 30 08:50:50 rpmi: python-modules-bsddb-2.7.15-alt1 sisyphus.217364.100 1544022423 installed
<13>Jan 30 08:50:50 rpmi: python-modules-ctypes-2.7.15-alt1 sisyphus.217364.100 1544022423 installed
<13>Jan 30 08:50:50 rpmi: python-modules-multiprocessing-2.7.15-alt1 sisyphus.217364.100 1544022423 installed
<13>Jan 30 08:50:50 rpmi: python-modules-logging-2.7.15-alt1 sisyphus.217364.100 1544022423 installed
<13>Jan 30 08:50:50 rpmi: python-2.7.15-alt1 sisyphus.217364.100 1544022423 installed
<13>Jan 30 08:50:50 rpmi: libcups-2.2.6-alt1 1510070343 installed
<13>Jan 30 08:50:50 rpmi: libgtk+2-2.24.32-alt2 1518699309 installed
<13>Jan 30 08:50:50 rpmi: libgtk+2-gir-2.24.32-alt2 1518699309 installed
<13>Jan 30 08:50:50 rpmi: libharfbuzz-devel-2.2.0-alt1 sisyphus.218134.500 1545261518 installed
<13>Jan 30 08:50:50 rpmi: libfreetype-devel-2.9.1-alt1.S1 1530781053 installed
<13>Jan 30 08:50:50 rpmi: fontconfig-devel-2.13.1-alt1 sisyphus.215917.100 1540973886 installed
<13>Jan 30 08:50:50 rpmi: libcairo-devel-1:1.16.0-alt1 sisyphus.215566.100 1540457683 installed
<13>Jan 30 08:50:50 rpmi: libXft-devel-2.3.2-alt1 1409902660 installed
<13>Jan 30 08:50:50 rpmi: libpango-devel-1.42.4-alt1 1534787259 installed
<13>Jan 30 08:50:50 rpmi: libgtk+2-devel-2.24.32-alt2 1518699309 installed
<13>Jan 30 08:50:50 rpmi: python3-module-more-itertools-5.0.0-alt1 sisyphus.218699.100 1545980609 installed
<13>Jan 30 08:50:50 rpmi: python3-module-anytree-2.4.3-alt1 1521929586 installed
<13>Jan 30 08:50:51 rpmi: python3-module-ntlm-1.1.0-alt1.1.1.1 1460405346 installed
<13>Jan 30 08:50:51 rpmi: python3-module-pycparser-2.19-alt1 sisyphus.216095.100 1541345023 installed
<13>Jan 30 08:50:51 rpmi: python3-module-cffi-1.10.0-alt1.1 1525117736 installed
<13>Jan 30 08:50:51 rpmi: python3-module-asn1crypto-0.24.0-alt1 1521037480 installed
<13>Jan 30 08:50:51 rpmi: python3-module-cryptography-2.4.2-alt1 sisyphus.216799.200 1543487260 installed
<13>Jan 30 08:50:51 rpmi: python3-module-OpenSSL-18.0.0-alt1 1532996168 installed
<13>Jan 30 08:50:51 rpmi: python3-module-nss-1.0.1-alt2.S1.1 1525119671 installed
<13>Jan 30 08:50:51 rpmi: python3-module-beaker-1.9.0-alt1 1521467136 installed
<13>Jan 30 08:50:51 rpmi: python3-module-pytz-1:2016.10-alt1 1484291011 installed
<13>Jan 30 08:50:51 rpmi: python3-module-babel-1:2.4.0-alt1.1 1517644530 installed
<13>Jan 30 08:50:51 rpmi: python3-module-zope.interface-4.5.0-alt1.qa1 sisyphus.214938.100 1539939473 installed
<13>Jan 30 08:50:51 rpmi: python3-module-chameleon.core-3.1-alt1.2 1527237057 installed
<13>Jan 30 08:50:51 rpmi: python3-module-polib-1.0.5-alt1.1.2 1526977584 installed
<13>Jan 30 08:50:51 rpmi: python3-module-lingua-4.13-alt1.1 1517783822 installed
<13>Jan 30 08:50:51 rpmi: python3-module-genshi-0.7-alt1.1.1.1 1460400448 installed
<13>Jan 30 08:50:51 rpmi: python3-module-webencodings-0.5.1-alt1.1 1517943573 installed
<13>Jan 30 08:50:51 rpmi: python3-module-cssselect-0.9.1-alt1.2 1526980827 installed
<13>Jan 30 08:50:51 rpmi: python3-module-html5lib-1:0.999999999-alt4.qa1 sisyphus.214868.100 1539741045 installed
<13>Jan 30 08:50:51 rpmi: python3-module-lxml-4.3.0-alt1 sisyphus.219015.100 1546759265 installed
<13>Jan 30 08:50:51 rpmi: python3-module-docutils-0.14-alt2 1535729778 installed
<13>Jan 30 08:50:51 rpmi: python3-module-chardet-3.0.4-alt1 1506613818 installed
<13>Jan 30 08:50:51 rpmi: python3-module-ndg-0.4.2-alt1.qa1 1531457735 installed
<13>Jan 30 08:50:51 rpmi: python3-module-ndg-httpsclient-0.4.2-alt1.qa1 1531457735 installed
<13>Jan 30 08:50:52 rpmi: python3-module-urllib3-2:1.24.1-alt2 sisyphus.218529.100 1545673498 installed
<13>Jan 30 08:50:52 rpmi: python3-module-requests-2.21.0-alt1 sisyphus.218511.200 1545669878 installed
<13>Jan 30 08:50:52 rpmi: python3-module-imagesize-0.7.1-alt1 1461387704 installed
<13>Jan 30 08:50:52 rpmi: python3-module-markupsafe-0.23-alt1.2.1.1 1525118834 installed
<13>Jan 30 08:50:52 rpmi: python3-module-jinja2-2.10-alt1 1521724576 installed
<13>Jan 30 08:50:52 rpmi: python3-module-atomicwrites-1.2.1-alt1 sisyphus.214347.100 1539076636 installed
<13>Jan 30 08:50:52 rpmi: python3-module-attrs-18.2.0-alt1 sisyphus.214354.100 1539088435 installed
<13>Jan 30 08:50:52 rpmi: python3-module-pluggy-0.8.1-alt1 sisyphus.219350.100 1547468434 installed
<13>Jan 30 08:50:52 rpmi: python3-module-py-1.7.0-alt1 sisyphus.214414.220 1539670883 installed
<13>Jan 30 08:50:52 rpmi: python3-module-pytest-3.10.1-alt3 sisyphus+219849.1200.10.1 1548275625 installed
<13>Jan 30 08:50:52 rpmi: python3-module-snowballstemmer-1.2.0-alt2.1 1457859319 installed
<13>Jan 30 08:50:52 rpmi: python3-module-whoosh-2.7.4-alt1 1527698183 installed
<13>Jan 30 08:50:52 rpmi: python3-module-xapian-1.4.5-alt2.qa1 1531484078 installed
<13>Jan 30 08:50:52 rpmi: python3-module-markdown-2.6.7-alt1.1 1517789319 installed
<13>Jan 30 08:50:52 rpmi: python3-modules-sqlite3-3.6.5-alt1.1 1535734576 installed
<13>Jan 30 08:50:52 rpmi: python3-module-SQLAlchemy-1.2.15-alt1 sisyphus.219175.100 1547139402 installed
<13>Jan 30 08:50:52 rpmi: python3-module-sphinxcontrib-websupport-1.0.1-alt3.qa1 sisyphus.214922.100 1539851266 installed
<13>Jan 30 08:50:52 rpmi: python3-module-alabaster-0.7.6-alt3 1526385201 installed
<13>Jan 30 08:50:52 rpmi: python3-module-Pygments-2.2.0-alt2 1526455576 installed
<13>Jan 30 08:50:52 rpmi: python3-module-sphinx-1:1.6.5-alt3 sisyphus.213215.100 1537280252 installed
<13>Jan 30 08:50:52 rpmi: python3-module-mako-1.0.1-alt1.1.1.1 1460400692 installed
<13>Jan 30 08:50:52 rpmi: gobject-introspection-devel-1.58.3-alt1 sisyphus.218857.100 1546259916 installed
<13>Jan 30 08:50:52 rpmi: libatk-gir-devel-2.30.0-alt1 sisyphus.212779.100 1536768328 installed
<13>Jan 30 08:50:52 rpmi: libgdk-pixbuf-gir-devel-2.38.0-alt4 sisyphus.219229.400 1547220196 installed
<13>Jan 30 08:50:53 rpmi: libpango-gir-devel-1.42.4-alt1 1534787249 installed
<13>Jan 30 08:50:53 rpmi: libssl-devel-1.1.0j-alt1 sisyphus.216647.100 1542743878 installed
<13>Jan 30 08:50:53 rpmi: phonon-devel-4.8.3-alt1 1418134069 installed
<13>Jan 30 08:50:53 rpmi: libqt4-devel-4.8.7-alt13.S1 1535591248 installed
<13>Jan 30 08:50:53 rpmi: libqt4-webkit-devel-1:2.3.4-alt6 sisyphus.215264.100 1540024276 installed
<13>Jan 30 08:50:53 rpmi: libgtk+2-gir-devel-2.24.32-alt2 1518699309 installed
<13>Jan 30 08:50:53 rpmi: gtk-doc-1.29-alt2 sisyphus.217088.100 1543518451 installed
<13>Jan 30 08:50:53 rpmi: libcairo-gobject-devel-1:1.16.0-alt1 sisyphus.215566.100 1540457683 installed
<13>Jan 30 08:50:53 rpmi: cmake-3.13.1-alt1 sisyphus.217317.100 1544006298 installed
<13>Jan 30 08:50:54 rpmi: libcurl-devel-7.63.0-alt1 sisyphus.217831.100 1544762811 installed
<13>Jan 30 08:50:54 rpmi: libnss-devel-3.40.1-alt1 sisyphus.218259.100 1545764952 installed
<13>Jan 30 08:50:54 rpmi: gcc-c++-8-alt1 sisyphus.214000.40 1542664775 installed
<13>Jan 30 08:50:54 rpmi: libXt-devel-1.1.4-alt1 1369984722 installed
<13>Jan 30 08:50:54 rpmi: libopenjpeg2.0-devel-2.3.0-alt2 sisyphus.216213.100 1541598437 installed
<13>Jan 30 08:50:54 rpmi: liblcms2-devel-2.9-alt1 1516411892 installed
<13>Jan 30 08:50:54 rpmi: libtiff-devel-4.0.3-alt1 1348347501 installed
<13>Jan 30 08:50:54 rpmi: libjpeg-devel-2:1.5.1-alt1 1498218318 installed
<13>Jan 30 08:50:54 rpmi: poppler-data-0.4.9-alt1 sisyphus.216033.100 1541141723 installed
<13>Jan 30 08:50:54 rpmi: libxml2-devel-1:2.9.4.0.12.e905-alt1.1 1525115767 installed
Building target platforms: i586
Building for target i586
Wrote: /usr/src/in/nosrpm/poppler72-0.61.1-alt3.nosrc.rpm
Installing poppler72-0.61.1-alt3.S1.src.rpm
Building target platforms: i586
Building for target i586
Executing(%prep): /bin/sh -e /usr/src/tmp/rpm-tmp.77805
+ umask 022
+ /bin/mkdir -p /usr/src/RPM/BUILD
+ cd /usr/src/RPM/BUILD
+ cd /usr/src/RPM/BUILD
+ rm -rf poppler-0.61.1
+ echo 'Source #0 (poppler-0.61.1.tar):'
Source #0 (poppler-0.61.1.tar):
+ /bin/tar -xf /usr/src/RPM/SOURCES/poppler-0.61.1.tar
+ cd poppler-0.61.1
+ /bin/chmod -c -Rf u+rwX,go-w .
+ exit 0
Executing(%build): /bin/sh -e /usr/src/tmp/rpm-tmp.83810
+ umask 022
+ /bin/mkdir -p /usr/src/RPM/BUILD
+ cd /usr/src/RPM/BUILD
+ cd poppler-0.61.1
+ export QT4DIR=/usr/lib/qt4
+ QT4DIR=/usr/lib/qt4
+ mkdir -p BUILD
+ __cmake -DSHARE_INSTALL_DIR=/usr/share -DBUILD_SHARED_LIBS=ON -DENABLE_LIBCURL=ON -DENABLE_ZLIB=OFF -DENABLE_CMS=lcms2 -DENABLE_DCTDECODER=libjpeg -DENABLE_LIBOPENJPEG=openjpeg2 -DENABLE_XPDF_HEADERS=OFF -DENABLE_UTILS=OFF -DENABLE_CPP=OFF -DENABLE_GLIB=OFF -DENABLE_QT4=ON -DENABLE_QT5=OFF
+ pushd BUILD
~/RPM/BUILD/poppler-0.61.1/BUILD ~/RPM/BUILD/poppler-0.61.1
+ cmake .. -DCMAKE_SKIP_RPATH:BOOL=ON -DCMAKE_SKIP_INSTALL_RPATH:BOOL=yes '-DCMAKE_C_FLAGS:STRING=-pipe -frecord-gcc-switches -Wall -g -O2 -march=i586 -mtune=generic' '-DCMAKE_CXX_FLAGS:STRING=-pipe -frecord-gcc-switches -Wall -g -O2 -march=i586 -mtune=generic' '-DCMAKE_Fortran_FLAGS:STRING=-pipe -frecord-gcc-switches -Wall -g -O2 -march=i586 -mtune=generic' -DCMAKE_INSTALL_PREFIX=/usr -DINCLUDE_INSTALL_DIR:PATH=/usr/include -DLIB_INSTALL_DIR:PATH=/usr/lib -DSYSCONF_INSTALL_DIR:PATH=/etc -DSHARE_INSTALL_PREFIX:PATH=/usr/share -DLIB_DESTINATION=lib -DLIB_SUFFIX= -DSHARE_INSTALL_DIR=/usr/share -DBUILD_SHARED_LIBS=ON -DENABLE_LIBCURL=ON -DENABLE_ZLIB=OFF -DENABLE_CMS=lcms2 -DENABLE_DCTDECODER=libjpeg -DENABLE_LIBOPENJPEG=openjpeg2 -DENABLE_XPDF_HEADERS=OFF -DENABLE_UTILS=OFF -DENABLE_CPP=OFF -DENABLE_GLIB=OFF -DENABLE_QT4=ON -DENABLE_QT5=OFF
-- The C compiler identification is GNU 8.2.1
-- The CXX compiler identification is GNU 8.2.1
-- Check for working C compiler: /usr/bin/cc
-- Check for working C compiler: /usr/bin/cc -- works
-- Detecting C compiler ABI info
-- Detecting C compiler ABI info - done
-- Detecting C compile features
-- Detecting C compile features - done
-- Check for working CXX compiler: /usr/bin/c++
-- Check for working CXX compiler: /usr/bin/c++ -- works
-- Detecting CXX compiler ABI info
-- Detecting CXX compiler ABI info - done
-- Detecting CXX compile features
-- Detecting CXX compile features - done
CMake Deprecation Warning at cmake/modules/PopplerDefaults.cmake:12 (cmake_policy):
  The OLD behavior for policy CMP0002 will be removed from a future version
  of CMake.

  The cmake-policies(7) manual explains that the OLD behaviors of all
  policies are deprecated and that a policy should be set to OLD only under
  specific short-term circumstances.  Projects should be ported to the NEW
  behavior and not rely on setting a policy to OLD.
Call Stack (most recent call first):
  CMakeLists.txt:7 (include)


CMake Deprecation Warning at cmake/modules/PopplerDefaults.cmake:15 (cmake_policy):
  The OLD behavior for policy CMP0011 will be removed from a future version
  of CMake.

  The cmake-policies(7) manual explains that the OLD behaviors of all
  policies are deprecated and that a policy should be set to OLD only under
  specific short-term circumstances.  Projects should be ported to the NEW
  behavior and not rely on setting a policy to OLD.
Call Stack (most recent call first):
  CMakeLists.txt:7 (include)


-- Performing Test GCC_HAS_AS_NEEDED
-- Performing Test GCC_HAS_AS_NEEDED - Success
-- Found PkgConfig: /usr/bin/pkg-config (found version "0.29.2") 
-- Looking for pthread.h
-- Looking for pthread.h - found
-- Looking for pthread_create
-- Looking for pthread_create - not found
-- Check if compiler accepts -pthread
-- Check if compiler accepts -pthread - yes
-- Found Threads: TRUE  
-- Check if the system is big endian
-- Searching 16 bit integer
-- Looking for sys/types.h
-- Looking for sys/types.h - found
-- Looking for stdint.h
-- Looking for stdint.h - found
-- Looking for stddef.h
-- Looking for stddef.h - found
-- Check size of unsigned short
-- Check size of unsigned short - done
-- Using unsigned short
-- Check if the system is big endian - little endian
-- Checking _FILE_OFFSET_BITS for large files
-- Checking _FILE_OFFSET_BITS for large files - needed
CMake Warning at CMakeLists.txt:74 (message):
  

   No test data found in $testdatadir.
   You will not be able to run 'make test' successfully.

  

   The test data is not included in the source packages
   and is also not part of the main git repository. Instead,
   you can checkout the test data from its own git
   repository with:

  

     git clone git://git.freedesktop.org/git/poppler/test

  

   You should checkout the test data as a sibling of your
   poppler source folder or specify the location of your
   checkout with -DTESTDATADIR=/path/to/checkoutdir/test.
    


-- Found Freetype: /usr/lib/libfreetype.so (found version "2.9.1") 
-- Checking for module 'fontconfig'
--   Found fontconfig, version 2.13.1
Package libpcre was not found in the pkg-config search path.
Perhaps you should add the directory containing `libpcre.pc'
to the PKG_CONFIG_PATH environment variable
Package 'libpcre', required by 'glib-2.0', not found
Package libpcre was not found in the pkg-config search path.
Perhaps you should add the directory containing `libpcre.pc'
to the PKG_CONFIG_PATH environment variable
Package 'libpcre', required by 'glib-2.0', not found
Package libpcre was not found in the pkg-config search path.
Perhaps you should add the directory containing `libpcre.pc'
to the PKG_CONFIG_PATH environment variable
Package 'libpcre', required by 'glib-2.0', not found
Package libpcre was not found in the pkg-config search path.
Perhaps you should add the directory containing `libpcre.pc'
to the PKG_CONFIG_PATH environment variable
Package 'libpcre', required by 'glib-2.0', not found
-- Found Fontconfig: /usr/lib/libfontconfig.so  
-- Found JPEG: /usr/lib/libjpeg.so (found version "62") 
-- Found ZLIB: /usr/lib/libz.so (found version "1.2.11") 
-- Found PNG: /usr/lib/libpng.so (found version "1.6.36") 
-- Found TIFF: /usr/lib/libtiff.so (found version "4.0.3") 
-- Checking for module 'nss>=3.19'
--   Found nss, version 3.40.1
-- Found NSS3: ssl3;smime3;nss3;nssutil3;plds4;plc4;nspr4;pthread;dl  
-- Looking for Q_WS_X11
-- Looking for Q_WS_X11 - found
-- Looking for Q_WS_WIN
-- Looking for Q_WS_WIN - not found
-- Looking for Q_WS_QWS
-- Looking for Q_WS_QWS - not found
-- Looking for Q_WS_MAC
-- Looking for Q_WS_MAC - not found
-- Found Qt-Version 4.8.7 (using /usr/bin/qmake-qt4)
-- Looking for XOpenDisplay in /usr/lib/libX11.so;/usr/lib/libXext.so
-- Looking for XOpenDisplay in /usr/lib/libX11.so;/usr/lib/libXext.so - found
-- Looking for gethostbyname
-- Looking for gethostbyname - found
-- Looking for connect
-- Looking for connect - found
-- Looking for remove
-- Looking for remove - found
-- Looking for shmat
-- Looking for shmat - found
-- Looking for IceConnectionNumber in ICE
-- Looking for IceConnectionNumber in ICE - found
-- Found X11: /usr/lib/libX11.so
-- Checking for module 'cairo>=1.10.0'
--   Found cairo, version 1.16.0
Package libpcre was not found in the pkg-config search path.
Perhaps you should add the directory containing `libpcre.pc'
to the PKG_CONFIG_PATH environment variable
Package 'libpcre', required by 'glib-2.0', not found
Package libpcre was not found in the pkg-config search path.
Perhaps you should add the directory containing `libpcre.pc'
to the PKG_CONFIG_PATH environment variable
Package 'libpcre', required by 'glib-2.0', not found
Package libpcre was not found in the pkg-config search path.
Perhaps you should add the directory containing `libpcre.pc'
to the PKG_CONFIG_PATH environment variable
Package 'libpcre', required by 'glib-2.0', not found
Package libpcre was not found in the pkg-config search path.
Perhaps you should add the directory containing `libpcre.pc'
to the PKG_CONFIG_PATH environment variable
Package 'libpcre', required by 'glib-2.0', not found
-- Found Cairo: /usr/lib/libcairo.so (Required is at least version "1.10.0") 
-- Checking for module 'libopenjp2'
--   Found libopenjp2, version 2.3.0
-- Checking for module 'lcms2'
--   Found lcms2, version 2.9
-- Found lcms version 2.09, /usr/lib/liblcms2.so
-- Found CURL: /usr/lib/libcurl.so (found version "7.63.0-DEV") 
-- Checking for module 'poppler-data'
--   Found poppler-data, version 0.4.9
-- Looking for include file dlfcn.h
-- Looking for include file dlfcn.h - found
-- Looking for include file fcntl.h
-- Looking for include file fcntl.h - found
-- Looking for include file stdlib.h
-- Looking for include file stdlib.h - found
-- Looking for include file sys/mman.h
-- Looking for include file sys/mman.h - found
-- Looking for include file sys/stat.h
-- Looking for include file sys/stat.h - found
-- Looking for include file unistd.h
-- Looking for include file unistd.h - found
-- Looking for fseek64
-- Looking for fseek64 - not found
-- Looking for fseeko
-- Looking for fseeko - found
-- Looking for ftell64
-- Looking for ftell64 - not found
-- Looking for pread64
-- Looking for pread64 - found
-- Looking for lseek64
-- Looking for lseek64 - found
-- Looking for gmtime_r
-- Looking for gmtime_r - found
-- Looking for timegm
-- Looking for timegm - found
-- Looking for gettimeofday
-- Looking for gettimeofday - found
-- Looking for localtime_r
-- Looking for localtime_r - found
-- Looking for popen
-- Looking for popen - found
-- Looking for mkstemp
-- Looking for mkstemp - found
-- Looking for rand_r
-- Looking for rand_r - found
-- Looking for strcpy_s
-- Looking for strcpy_s - not found
-- Looking for strcat_s
-- Looking for strcat_s - not found
-- Looking for strtok_r
-- Looking for strtok_r - found
-- Performing Test HAVE_DIRENT_H
-- Performing Test HAVE_DIRENT_H - Success
-- Performing Test HAVE_NDIR_H
-- Performing Test HAVE_NDIR_H - Failed
-- Performing Test HAVE_SYS_DIR_H
-- Performing Test HAVE_SYS_DIR_H - Success
-- Performing Test HAVE_SYS_NDIR_H
-- Performing Test HAVE_SYS_NDIR_H - Failed
-- Looking for nanosleep
-- Looking for nanosleep - found
Building Poppler with support for:
  font configuration:   fontconfig
  splash output:        yes
  cairo output:         yes
  qt4 wrapper:          yes
  qt5 wrapper:          no
  glib wrapper:         no
    introspection:      no
    gtk-doc:            no
  cpp wrapper:          no
  use libjpeg:          yes
  use libpng:           yes
  use libtiff:          yes
  use zlib compress:    no
  use zlib uncompress:  no
  use nss3:             yes
  use curl:             yes
  use libopenjpeg:      yes
      with openjpeg2
  use cms:              yes
      with lcms2
  command line utils:   no
  test data dir:        /usr/src/RPM/BUILD/poppler-0.61.1/../test
-- Configuring done
-- Generating done
CMake Warning:
  Manually-specified variables were not used by the project:

    CMAKE_Fortran_FLAGS
    CMAKE_SKIP_INSTALL_RPATH
    INCLUDE_INSTALL_DIR
    LIB_DESTINATION
    LIB_INSTALL_DIR
    LIB_SUFFIX
    SHARE_INSTALL_DIR
    SHARE_INSTALL_PREFIX
    SYSCONF_INSTALL_DIR


-- Build files have been written to: /usr/src/RPM/BUILD/poppler-0.61.1/BUILD
+ popd
~/RPM/BUILD/poppler-0.61.1
+ make -j8 -C BUILD
make[2]: Entering directory '/usr/src/RPM/BUILD/poppler-0.61.1/BUILD'
Scanning dependencies of target poppler
make[2]: Leaving directory '/usr/src/RPM/BUILD/poppler-0.61.1/BUILD'
make[2]: Entering directory '/usr/src/RPM/BUILD/poppler-0.61.1/BUILD'
[  3%] Building CXX object CMakeFiles/poppler.dir/goo/FixedPoint.cc.o
make[2]: Leaving directory '/usr/src/RPM/BUILD/poppler-0.61.1/BUILD'
make[2]: Entering directory '/usr/src/RPM/BUILD/poppler-0.61.1/BUILD'
[  1%] Building CXX object CMakeFiles/poppler.dir/goo/gmempp.cc.o
make[2]: Leaving directory '/usr/src/RPM/BUILD/poppler-0.61.1/BUILD'
make[2]: Entering directory '/usr/src/RPM/BUILD/poppler-0.61.1/BUILD'
[  2%] Building CXX object CMakeFiles/poppler.dir/goo/GooTimer.cc.o
make[2]: Leaving directory '/usr/src/RPM/BUILD/poppler-0.61.1/BUILD'
make[2]: Entering directory '/usr/src/RPM/BUILD/poppler-0.61.1/BUILD'
[  3%] Building CXX object CMakeFiles/poppler.dir/goo/gmem.cc.o
make[2]: Leaving directory '/usr/src/RPM/BUILD/poppler-0.61.1/BUILD'
make[2]: Entering directory '/usr/src/RPM/BUILD/poppler-0.61.1/BUILD'
[  5%] Building CXX object CMakeFiles/poppler.dir/goo/TiffWriter.cc.o
make[2]: Leaving directory '/usr/src/RPM/BUILD/poppler-0.61.1/BUILD'
make[2]: Entering directory '/usr/src/RPM/BUILD/poppler-0.61.1/BUILD'
[  4%] Building CXX object CMakeFiles/poppler.dir/goo/PNGWriter.cc.o
make[2]: Leaving directory '/usr/src/RPM/BUILD/poppler-0.61.1/BUILD'
make[2]: Entering directory '/usr/src/RPM/BUILD/poppler-0.61.1/BUILD'
[  5%] Building CXX object CMakeFiles/poppler.dir/goo/JpegWriter.cc.o
make[2]: Leaving directory '/usr/src/RPM/BUILD/poppler-0.61.1/BUILD'
make[2]: Entering directory '/usr/src/RPM/BUILD/poppler-0.61.1/BUILD'
[  2%] Building CXX object CMakeFiles/poppler.dir/goo/GooList.cc.o
make[2]: Leaving directory '/usr/src/RPM/BUILD/poppler-0.61.1/BUILD'
make[2]: Entering directory '/usr/src/RPM/BUILD/poppler-0.61.1/BUILD'
[  5%] Building CXX object CMakeFiles/poppler.dir/goo/ImgWriter.cc.o
make[2]: Leaving directory '/usr/src/RPM/BUILD/poppler-0.61.1/BUILD'
make[2]: Entering directory '/usr/src/RPM/BUILD/poppler-0.61.1/BUILD'
[  4%] Building CXX object CMakeFiles/poppler.dir/goo/NetPBMWriter.cc.o
make[2]: Leaving directory '/usr/src/RPM/BUILD/poppler-0.61.1/BUILD'
make[2]: Entering directory '/usr/src/RPM/BUILD/poppler-0.61.1/BUILD'
[  7%] Building CXX object CMakeFiles/poppler.dir/goo/glibc.cc.o
make[2]: Leaving directory '/usr/src/RPM/BUILD/poppler-0.61.1/BUILD'
make[2]: Entering directory '/usr/src/RPM/BUILD/poppler-0.61.1/BUILD'
[  7%] Building CXX object CMakeFiles/poppler.dir/goo/glibc_strtok_r.cc.o
make[2]: Leaving directory '/usr/src/RPM/BUILD/poppler-0.61.1/BUILD'
make[2]: Entering directory '/usr/src/RPM/BUILD/poppler-0.61.1/BUILD'
[  5%] Building CXX object CMakeFiles/poppler.dir/goo/grandom.cc.o
make[2]: Leaving directory '/usr/src/RPM/BUILD/poppler-0.61.1/BUILD'
make[2]: Entering directory '/usr/src/RPM/BUILD/poppler-0.61.1/BUILD'
[  8%] Building CXX object CMakeFiles/poppler.dir/fofi/FoFiEncodings.cc.o
make[2]: Leaving directory '/usr/src/RPM/BUILD/poppler-0.61.1/BUILD'
make[2]: Entering directory '/usr/src/RPM/BUILD/poppler-0.61.1/BUILD'
[  0%] Building CXX object CMakeFiles/poppler.dir/goo/gfile.cc.o
make[2]: Leaving directory '/usr/src/RPM/BUILD/poppler-0.61.1/BUILD'
make[2]: Entering directory '/usr/src/RPM/BUILD/poppler-0.61.1/BUILD'
[  1%] Building CXX object CMakeFiles/poppler.dir/goo/GooHash.cc.o
make[2]: Leaving directory '/usr/src/RPM/BUILD/poppler-0.61.1/BUILD'
make[2]: Entering directory '/usr/src/RPM/BUILD/poppler-0.61.1/BUILD'
[  6%] Building CXX object CMakeFiles/poppler.dir/goo/gstrtod.cc.o
make[2]: Leaving directory '/usr/src/RPM/BUILD/poppler-0.61.1/BUILD'
make[2]: Entering directory '/usr/src/RPM/BUILD/poppler-0.61.1/BUILD'
[ 10%] Building CXX object CMakeFiles/poppler.dir/fofi/FoFiIdentifier.cc.o
make[2]: Leaving directory '/usr/src/RPM/BUILD/poppler-0.61.1/BUILD'
make[2]: Entering directory '/usr/src/RPM/BUILD/poppler-0.61.1/BUILD'
[  2%] Building CXX object CMakeFiles/poppler.dir/goo/GooString.cc.o
make[2]: Leaving directory '/usr/src/RPM/BUILD/poppler-0.61.1/BUILD'
make[2]: Entering directory '/usr/src/RPM/BUILD/poppler-0.61.1/BUILD'
[  8%] Building CXX object CMakeFiles/poppler.dir/fofi/FoFiBase.cc.o
make[2]: Leaving directory '/usr/src/RPM/BUILD/poppler-0.61.1/BUILD'
make[2]: Entering directory '/usr/src/RPM/BUILD/poppler-0.61.1/BUILD'
[ 11%] Building CXX object CMakeFiles/poppler.dir/poppler/BuiltinFont.cc.o
make[2]: Leaving directory '/usr/src/RPM/BUILD/poppler-0.61.1/BUILD'
make[2]: Entering directory '/usr/src/RPM/BUILD/poppler-0.61.1/BUILD'
[ 11%] Building CXX object CMakeFiles/poppler.dir/poppler/BuiltinFontTables.cc.o
make[2]: Leaving directory '/usr/src/RPM/BUILD/poppler-0.61.1/BUILD'
make[2]: Entering directory '/usr/src/RPM/BUILD/poppler-0.61.1/BUILD'
[  9%] Building CXX object CMakeFiles/poppler.dir/fofi/FoFiType1.cc.o
make[2]: Leaving directory '/usr/src/RPM/BUILD/poppler-0.61.1/BUILD'
make[2]: Entering directory '/usr/src/RPM/BUILD/poppler-0.61.1/BUILD'
[ 13%] Building CXX object CMakeFiles/poppler.dir/poppler/CharCodeToUnicode.cc.o
make[2]: Leaving directory '/usr/src/RPM/BUILD/poppler-0.61.1/BUILD'
make[2]: Entering directory '/usr/src/RPM/BUILD/poppler-0.61.1/BUILD'
[ 13%] Building CXX object CMakeFiles/poppler.dir/poppler/CMap.cc.o
make[2]: Leaving directory '/usr/src/RPM/BUILD/poppler-0.61.1/BUILD'
make[2]: Entering directory '/usr/src/RPM/BUILD/poppler-0.61.1/BUILD'
[ 12%] Building CXX object CMakeFiles/poppler.dir/poppler/CachedFile.cc.o
make[2]: Leaving directory '/usr/src/RPM/BUILD/poppler-0.61.1/BUILD'
make[2]: Entering directory '/usr/src/RPM/BUILD/poppler-0.61.1/BUILD'
[ 11%] Building CXX object CMakeFiles/poppler.dir/poppler/Array.cc.o
/usr/src/RPM/BUILD/poppler-0.61.1/poppler/Array.cc: In member function 'void Array::remove(int)':
/usr/src/RPM/BUILD/poppler-0.61.1/poppler/Array.cc:115:70: warning: 'void* memmove(void*, const void*, size_t)' writing to an object of type 'class Object' with no trivial copy-assignment [-Wclass-memaccess]
   memmove( elems + i, elems + i + 1, sizeof(elems[0]) * (length - i) );
                                                                      ^
In file included from /usr/src/RPM/BUILD/poppler-0.61.1/poppler/Array.cc:36:
/usr/src/RPM/BUILD/poppler-0.61.1/poppler/Object.h:137:7: note: 'class Object' declared here
 class Object {
       ^~~~~~
make[2]: Leaving directory '/usr/src/RPM/BUILD/poppler-0.61.1/BUILD'
make[2]: Entering directory '/usr/src/RPM/BUILD/poppler-0.61.1/BUILD'
[ 14%] Building CXX object CMakeFiles/poppler.dir/poppler/DateInfo.cc.o
make[2]: Leaving directory '/usr/src/RPM/BUILD/poppler-0.61.1/BUILD'
make[2]: Entering directory '/usr/src/RPM/BUILD/poppler-0.61.1/BUILD'
[ 15%] Building CXX object CMakeFiles/poppler.dir/poppler/Error.cc.o
make[2]: Leaving directory '/usr/src/RPM/BUILD/poppler-0.61.1/BUILD'
make[2]: Entering directory '/usr/src/RPM/BUILD/poppler-0.61.1/BUILD'
[ 16%] Building CXX object CMakeFiles/poppler.dir/poppler/FontEncodingTables.cc.o
make[2]: Leaving directory '/usr/src/RPM/BUILD/poppler-0.61.1/BUILD'
make[2]: Entering directory '/usr/src/RPM/BUILD/poppler-0.61.1/BUILD'
[ 15%] Building CXX object CMakeFiles/poppler.dir/poppler/FileSpec.cc.o
make[2]: Leaving directory '/usr/src/RPM/BUILD/poppler-0.61.1/BUILD'
make[2]: Entering directory '/usr/src/RPM/BUILD/poppler-0.61.1/BUILD'
[ 15%] Building CXX object CMakeFiles/poppler.dir/poppler/Dict.cc.o
/usr/src/RPM/BUILD/poppler-0.61.1/poppler/Dict.cc: In member function 'void Dict::remove(const char*)':
/usr/src/RPM/BUILD/poppler-0.61.1/poppler/Dict.cc:204:85: warning: 'void* memmove(void*, const void*, size_t)' writing to an object of type 'struct DictEntry' with no trivial copy-assignment [-Wclass-memaccess]
         memmove(&entries[pos], &entries[pos + 1], (length - pos) * sizeof(DictEntry));
                                                                                     ^
In file included from /usr/src/RPM/BUILD/poppler-0.61.1/poppler/Object.h:342,
                 from /usr/src/RPM/BUILD/poppler-0.61.1/poppler/Dict.cc:41:
/usr/src/RPM/BUILD/poppler-0.61.1/poppler/Dict.h:44:8: note: 'struct DictEntry' declared here
 struct DictEntry {
        ^~~~~~~~~
make[2]: Leaving directory '/usr/src/RPM/BUILD/poppler-0.61.1/BUILD'
make[2]: Entering directory '/usr/src/RPM/BUILD/poppler-0.61.1/BUILD'
[ 17%] Building CXX object CMakeFiles/poppler.dir/poppler/FontInfo.cc.o
make[2]: Leaving directory '/usr/src/RPM/BUILD/poppler-0.61.1/BUILD'
make[2]: Entering directory '/usr/src/RPM/BUILD/poppler-0.61.1/BUILD'
[  8%] Building CXX object CMakeFiles/poppler.dir/fofi/FoFiTrueType.cc.o
make[2]: Leaving directory '/usr/src/RPM/BUILD/poppler-0.61.1/BUILD'
make[2]: Entering directory '/usr/src/RPM/BUILD/poppler-0.61.1/BUILD'
[  9%] Building CXX object CMakeFiles/poppler.dir/fofi/FoFiType1C.cc.o
make[2]: Leaving directory '/usr/src/RPM/BUILD/poppler-0.61.1/BUILD'
make[2]: Entering directory '/usr/src/RPM/BUILD/poppler-0.61.1/BUILD'
[ 12%] Building CXX object CMakeFiles/poppler.dir/poppler/Catalog.cc.o
make[2]: Leaving directory '/usr/src/RPM/BUILD/poppler-0.61.1/BUILD'
make[2]: Entering directory '/usr/src/RPM/BUILD/poppler-0.61.1/BUILD'
[ 14%] Building CXX object CMakeFiles/poppler.dir/poppler/Decrypt.cc.o
make[2]: Leaving directory '/usr/src/RPM/BUILD/poppler-0.61.1/BUILD'
make[2]: Entering directory '/usr/src/RPM/BUILD/poppler-0.61.1/BUILD'
[ 19%] Building CXX object CMakeFiles/poppler.dir/poppler/GlobalParams.cc.o
make[2]: Leaving directory '/usr/src/RPM/BUILD/poppler-0.61.1/BUILD'
make[2]: Entering directory '/usr/src/RPM/BUILD/poppler-0.61.1/BUILD'
[ 20%] Building CXX object CMakeFiles/poppler.dir/poppler/JArithmeticDecoder.cc.o
make[2]: Leaving directory '/usr/src/RPM/BUILD/poppler-0.61.1/BUILD'
make[2]: Entering directory '/usr/src/RPM/BUILD/poppler-0.61.1/BUILD'
[ 16%] Building CXX object CMakeFiles/poppler.dir/poppler/Form.cc.o
make[2]: Leaving directory '/usr/src/RPM/BUILD/poppler-0.61.1/BUILD'
make[2]: Entering directory '/usr/src/RPM/BUILD/poppler-0.61.1/BUILD'
[ 19%] Building CXX object CMakeFiles/poppler.dir/poppler/Hints.cc.o
make[2]: Leaving directory '/usr/src/RPM/BUILD/poppler-0.61.1/BUILD'
make[2]: Entering directory '/usr/src/RPM/BUILD/poppler-0.61.1/BUILD'
[ 20%] Building CXX object CMakeFiles/poppler.dir/poppler/Lexer.cc.o
make[2]: Leaving directory '/usr/src/RPM/BUILD/poppler-0.61.1/BUILD'
make[2]: Entering directory '/usr/src/RPM/BUILD/poppler-0.61.1/BUILD'
[ 21%] Building CXX object CMakeFiles/poppler.dir/poppler/Link.cc.o
make[2]: Leaving directory '/usr/src/RPM/BUILD/poppler-0.61.1/BUILD'
make[2]: Entering directory '/usr/src/RPM/BUILD/poppler-0.61.1/BUILD'
[ 21%] Building CXX object CMakeFiles/poppler.dir/poppler/Linearization.cc.o
make[2]: Leaving directory '/usr/src/RPM/BUILD/poppler-0.61.1/BUILD'
make[2]: Entering directory '/usr/src/RPM/BUILD/poppler-0.61.1/BUILD'
[ 22%] Building CXX object CMakeFiles/poppler.dir/poppler/LocalPDFDocBuilder.cc.o
make[2]: Leaving directory '/usr/src/RPM/BUILD/poppler-0.61.1/BUILD'
make[2]: Entering directory '/usr/src/RPM/BUILD/poppler-0.61.1/BUILD'
[ 17%] Building CXX object CMakeFiles/poppler.dir/poppler/Function.cc.o
/usr/src/RPM/BUILD/poppler-0.61.1/poppler/Function.cc: In member function 'virtual void SampledFunction::transform(double*, double*)':
/usr/src/RPM/BUILD/poppler-0.61.1/poppler/Function.cc:473:21: warning: 'e[0]' may be used uninitialized in this function [-Wmaybe-uninitialized]
   idx0 = (idx0 + e[0]) * n;
                  ~~~^
make[2]: Leaving directory '/usr/src/RPM/BUILD/poppler-0.61.1/BUILD'
make[2]: Entering directory '/usr/src/RPM/BUILD/poppler-0.61.1/BUILD'
[ 23%] Building CXX object CMakeFiles/poppler.dir/poppler/NameToCharCode.cc.o
make[2]: Leaving directory '/usr/src/RPM/BUILD/poppler-0.61.1/BUILD'
make[2]: Entering directory '/usr/src/RPM/BUILD/poppler-0.61.1/BUILD'
[ 18%] Building CXX object CMakeFiles/poppler.dir/poppler/GfxFont.cc.o
make[2]: Leaving directory '/usr/src/RPM/BUILD/poppler-0.61.1/BUILD'
make[2]: Entering directory '/usr/src/RPM/BUILD/poppler-0.61.1/BUILD'
[ 22%] Building CXX object CMakeFiles/poppler.dir/poppler/MarkedContentOutputDev.cc.o
make[2]: Leaving directory '/usr/src/RPM/BUILD/poppler-0.61.1/BUILD'
make[2]: Entering directory '/usr/src/RPM/BUILD/poppler-0.61.1/BUILD'
[ 23%] Building CXX object CMakeFiles/poppler.dir/poppler/Object.cc.o
make[2]: Leaving directory '/usr/src/RPM/BUILD/poppler-0.61.1/BUILD'
make[2]: Entering directory '/usr/src/RPM/BUILD/poppler-0.61.1/BUILD'
[ 10%] Building CXX object CMakeFiles/poppler.dir/poppler/Annot.cc.o
make[2]: Leaving directory '/usr/src/RPM/BUILD/poppler-0.61.1/BUILD'
make[2]: Entering directory '/usr/src/RPM/BUILD/poppler-0.61.1/BUILD'
[ 24%] Building CXX object CMakeFiles/poppler.dir/poppler/Outline.cc.o
make[2]: Leaving directory '/usr/src/RPM/BUILD/poppler-0.61.1/BUILD'
make[2]: Entering directory '/usr/src/RPM/BUILD/poppler-0.61.1/BUILD'
[ 24%] Building CXX object CMakeFiles/poppler.dir/poppler/OutputDev.cc.o
make[2]: Leaving directory '/usr/src/RPM/BUILD/poppler-0.61.1/BUILD'
make[2]: Entering directory '/usr/src/RPM/BUILD/poppler-0.61.1/BUILD'
[ 23%] Building CXX object CMakeFiles/poppler.dir/poppler/OptionalContent.cc.o
make[2]: Leaving directory '/usr/src/RPM/BUILD/poppler-0.61.1/BUILD'
make[2]: Entering directory '/usr/src/RPM/BUILD/poppler-0.61.1/BUILD'
[ 27%] Building CXX object CMakeFiles/poppler.dir/poppler/PDFDocEncoding.cc.o
make[2]: Leaving directory '/usr/src/RPM/BUILD/poppler-0.61.1/BUILD'
make[2]: Entering directory '/usr/src/RPM/BUILD/poppler-0.61.1/BUILD'
[ 25%] Building CXX object CMakeFiles/poppler.dir/poppler/PageTransition.cc.o
make[2]: Leaving directory '/usr/src/RPM/BUILD/poppler-0.61.1/BUILD'
make[2]: Entering directory '/usr/src/RPM/BUILD/poppler-0.61.1/BUILD'
[ 27%] Building CXX object CMakeFiles/poppler.dir/poppler/PDFDocFactory.cc.o
make[2]: Leaving directory '/usr/src/RPM/BUILD/poppler-0.61.1/BUILD'
make[2]: Entering directory '/usr/src/RPM/BUILD/poppler-0.61.1/BUILD'
[ 28%] Building CXX object CMakeFiles/poppler.dir/poppler/ProfileData.cc.o
make[2]: Leaving directory '/usr/src/RPM/BUILD/poppler-0.61.1/BUILD'
make[2]: Entering directory '/usr/src/RPM/BUILD/poppler-0.61.1/BUILD'
[ 26%] Building CXX object CMakeFiles/poppler.dir/poppler/Parser.cc.o
make[2]: Leaving directory '/usr/src/RPM/BUILD/poppler-0.61.1/BUILD'
make[2]: Entering directory '/usr/src/RPM/BUILD/poppler-0.61.1/BUILD'
[ 29%] Building CXX object CMakeFiles/poppler.dir/poppler/PSTokenizer.cc.o
make[2]: Leaving directory '/usr/src/RPM/BUILD/poppler-0.61.1/BUILD'
make[2]: Entering directory '/usr/src/RPM/BUILD/poppler-0.61.1/BUILD'
[ 27%] Building CXX object CMakeFiles/poppler.dir/poppler/PopplerCache.cc.o
make[2]: Leaving directory '/usr/src/RPM/BUILD/poppler-0.61.1/BUILD'
make[2]: Entering directory '/usr/src/RPM/BUILD/poppler-0.61.1/BUILD'
[ 29%] Building CXX object CMakeFiles/poppler.dir/poppler/SignatureInfo.cc.o
make[2]: Leaving directory '/usr/src/RPM/BUILD/poppler-0.61.1/BUILD'
make[2]: Entering directory '/usr/src/RPM/BUILD/poppler-0.61.1/BUILD'
[ 17%] Building CXX object CMakeFiles/poppler.dir/poppler/Gfx.cc.o
make[2]: Leaving directory '/usr/src/RPM/BUILD/poppler-0.61.1/BUILD'
make[2]: Entering directory '/usr/src/RPM/BUILD/poppler-0.61.1/BUILD'
[ 20%] Building CXX object CMakeFiles/poppler.dir/poppler/JBIG2Stream.cc.o
make[2]: Leaving directory '/usr/src/RPM/BUILD/poppler-0.61.1/BUILD'
make[2]: Entering directory '/usr/src/RPM/BUILD/poppler-0.61.1/BUILD'
[ 28%] Building CXX object CMakeFiles/poppler.dir/poppler/PreScanOutputDev.cc.o
make[2]: Leaving directory '/usr/src/RPM/BUILD/poppler-0.61.1/BUILD'
make[2]: Entering directory '/usr/src/RPM/BUILD/poppler-0.61.1/BUILD'
[ 31%] Building CXX object CMakeFiles/poppler.dir/poppler/UnicodeMap.cc.o
make[2]: Leaving directory '/usr/src/RPM/BUILD/poppler-0.61.1/BUILD'
make[2]: Entering directory '/usr/src/RPM/BUILD/poppler-0.61.1/BUILD'
[ 25%] Building CXX object CMakeFiles/poppler.dir/poppler/Page.cc.o
make[2]: Leaving directory '/usr/src/RPM/BUILD/poppler-0.61.1/BUILD'
make[2]: Entering directory '/usr/src/RPM/BUILD/poppler-0.61.1/BUILD'
[ 30%] Building CXX object CMakeFiles/poppler.dir/poppler/StructTreeRoot.cc.o
make[2]: Leaving directory '/usr/src/RPM/BUILD/poppler-0.61.1/BUILD'
make[2]: Entering directory '/usr/src/RPM/BUILD/poppler-0.61.1/BUILD'
[ 31%] Building CXX object CMakeFiles/poppler.dir/poppler/UnicodeTypeTable.cc.o
make[2]: Leaving directory '/usr/src/RPM/BUILD/poppler-0.61.1/BUILD'
make[2]: Entering directory '/usr/src/RPM/BUILD/poppler-0.61.1/BUILD'
[ 26%] Building CXX object CMakeFiles/poppler.dir/poppler/PDFDoc.cc.o
make[2]: Leaving directory '/usr/src/RPM/BUILD/poppler-0.61.1/BUILD'
make[2]: Entering directory '/usr/src/RPM/BUILD/poppler-0.61.1/BUILD'
[ 32%] Building CXX object CMakeFiles/poppler.dir/poppler/UTF.cc.o
make[2]: Leaving directory '/usr/src/RPM/BUILD/poppler-0.61.1/BUILD'
make[2]: Entering directory '/usr/src/RPM/BUILD/poppler-0.61.1/BUILD'
[ 34%] Building CXX object CMakeFiles/poppler.dir/poppler/SecurityHandler.cc.o
make[2]: Leaving directory '/usr/src/RPM/BUILD/poppler-0.61.1/BUILD'
make[2]: Entering directory '/usr/src/RPM/BUILD/poppler-0.61.1/BUILD'
[ 33%] Building CXX object CMakeFiles/poppler.dir/poppler/PageLabelInfo.cc.o
make[2]: Leaving directory '/usr/src/RPM/BUILD/poppler-0.61.1/BUILD'
make[2]: Entering directory '/usr/src/RPM/BUILD/poppler-0.61.1/BUILD'
[ 34%] Building CXX object CMakeFiles/poppler.dir/poppler/StdinCachedFile.cc.o
make[2]: Leaving directory '/usr/src/RPM/BUILD/poppler-0.61.1/BUILD'
make[2]: Entering directory '/usr/src/RPM/BUILD/poppler-0.61.1/BUILD'
[ 18%] Building CXX object CMakeFiles/poppler.dir/poppler/GfxState.cc.o
make[2]: Leaving directory '/usr/src/RPM/BUILD/poppler-0.61.1/BUILD'
make[2]: Entering directory '/usr/src/RPM/BUILD/poppler-0.61.1/BUILD'
[ 35%] Building CXX object CMakeFiles/poppler.dir/poppler/StdinPDFDocBuilder.cc.o
make[2]: Leaving directory '/usr/src/RPM/BUILD/poppler-0.61.1/BUILD'
make[2]: Entering directory '/usr/src/RPM/BUILD/poppler-0.61.1/BUILD'
[ 36%] Building CXX object CMakeFiles/poppler.dir/poppler/XpdfPluginAPI.cc.o
make[2]: Leaving directory '/usr/src/RPM/BUILD/poppler-0.61.1/BUILD'
make[2]: Entering directory '/usr/src/RPM/BUILD/poppler-0.61.1/BUILD'
[ 35%] Building CXX object CMakeFiles/poppler.dir/poppler/Sound.cc.o
make[2]: Leaving directory '/usr/src/RPM/BUILD/poppler-0.61.1/BUILD'
make[2]: Entering directory '/usr/src/RPM/BUILD/poppler-0.61.1/BUILD'
[ 32%] Building CXX object CMakeFiles/poppler.dir/poppler/XRef.cc.o
make[2]: Leaving directory '/usr/src/RPM/BUILD/poppler-0.61.1/BUILD'
make[2]: Entering directory '/usr/src/RPM/BUILD/poppler-0.61.1/BUILD'
[ 36%] Building CXX object CMakeFiles/poppler.dir/poppler/ViewerPreferences.cc.o
make[2]: Leaving directory '/usr/src/RPM/BUILD/poppler-0.61.1/BUILD'
make[2]: Entering directory '/usr/src/RPM/BUILD/poppler-0.61.1/BUILD'
[ 30%] Building CXX object CMakeFiles/poppler.dir/poppler/Stream.cc.o
make[2]: Leaving directory '/usr/src/RPM/BUILD/poppler-0.61.1/BUILD'
make[2]: Entering directory '/usr/src/RPM/BUILD/poppler-0.61.1/BUILD'
[ 36%] Building CXX object CMakeFiles/poppler.dir/poppler/Movie.cc.o
make[2]: Leaving directory '/usr/src/RPM/BUILD/poppler-0.61.1/BUILD'
make[2]: Entering directory '/usr/src/RPM/BUILD/poppler-0.61.1/BUILD'
[ 30%] Building CXX object CMakeFiles/poppler.dir/poppler/StructElement.cc.o
make[2]: Leaving directory '/usr/src/RPM/BUILD/poppler-0.61.1/BUILD'
make[2]: Entering directory '/usr/src/RPM/BUILD/poppler-0.61.1/BUILD'
[ 37%] Building CXX object CMakeFiles/poppler.dir/poppler/Rendition.cc.o
make[2]: Leaving directory '/usr/src/RPM/BUILD/poppler-0.61.1/BUILD'
make[2]: Entering directory '/usr/src/RPM/BUILD/poppler-0.61.1/BUILD'
[ 39%] Building CXX object CMakeFiles/poppler.dir/splash/SplashFTFontEngine.cc.o
make[2]: Leaving directory '/usr/src/RPM/BUILD/poppler-0.61.1/BUILD'
make[2]: Entering directory '/usr/src/RPM/BUILD/poppler-0.61.1/BUILD'
[ 39%] Building CXX object CMakeFiles/poppler.dir/splash/SplashFTFont.cc.o
make[2]: Leaving directory '/usr/src/RPM/BUILD/poppler-0.61.1/BUILD'
make[2]: Entering directory '/usr/src/RPM/BUILD/poppler-0.61.1/BUILD'
[ 40%] Building CXX object CMakeFiles/poppler.dir/splash/SplashFont.cc.o
make[2]: Leaving directory '/usr/src/RPM/BUILD/poppler-0.61.1/BUILD'
make[2]: Entering directory '/usr/src/RPM/BUILD/poppler-0.61.1/BUILD'
[ 38%] Building CXX object CMakeFiles/poppler.dir/splash/SplashBitmap.cc.o
make[2]: Leaving directory '/usr/src/RPM/BUILD/poppler-0.61.1/BUILD'
make[2]: Entering directory '/usr/src/RPM/BUILD/poppler-0.61.1/BUILD'
[ 40%] Building CXX object CMakeFiles/poppler.dir/splash/SplashFTFontFile.cc.o
make[2]: Leaving directory '/usr/src/RPM/BUILD/poppler-0.61.1/BUILD'
make[2]: Entering directory '/usr/src/RPM/BUILD/poppler-0.61.1/BUILD'
[ 42%] Building CXX object CMakeFiles/poppler.dir/splash/SplashFontFileID.cc.o
make[2]: Leaving directory '/usr/src/RPM/BUILD/poppler-0.61.1/BUILD'
make[2]: Entering directory '/usr/src/RPM/BUILD/poppler-0.61.1/BUILD'
[ 41%] Building CXX object CMakeFiles/poppler.dir/splash/SplashFontFile.cc.o
make[2]: Leaving directory '/usr/src/RPM/BUILD/poppler-0.61.1/BUILD'
make[2]: Entering directory '/usr/src/RPM/BUILD/poppler-0.61.1/BUILD'
[ 42%] Building CXX object CMakeFiles/poppler.dir/splash/SplashPattern.cc.o
make[2]: Leaving directory '/usr/src/RPM/BUILD/poppler-0.61.1/BUILD'
make[2]: Entering directory '/usr/src/RPM/BUILD/poppler-0.61.1/BUILD'
[ 42%] Building CXX object CMakeFiles/poppler.dir/splash/SplashPath.cc.o
make[2]: Leaving directory '/usr/src/RPM/BUILD/poppler-0.61.1/BUILD'
make[2]: Entering directory '/usr/src/RPM/BUILD/poppler-0.61.1/BUILD'
[ 41%] Building CXX object CMakeFiles/poppler.dir/splash/SplashFontEngine.cc.o
make[2]: Leaving directory '/usr/src/RPM/BUILD/poppler-0.61.1/BUILD'
make[2]: Entering directory '/usr/src/RPM/BUILD/poppler-0.61.1/BUILD'
[ 43%] Building CXX object CMakeFiles/poppler.dir/splash/SplashState.cc.o
make[2]: Leaving directory '/usr/src/RPM/BUILD/poppler-0.61.1/BUILD'
make[2]: Entering directory '/usr/src/RPM/BUILD/poppler-0.61.1/BUILD'
[ 39%] Building CXX object CMakeFiles/poppler.dir/splash/SplashClip.cc.o
make[2]: Leaving directory '/usr/src/RPM/BUILD/poppler-0.61.1/BUILD'
make[2]: Entering directory '/usr/src/RPM/BUILD/poppler-0.61.1/BUILD'
[ 45%] Building CXX object CMakeFiles/poppler.dir/poppler/DCTStream.cc.o
make[2]: Leaving directory '/usr/src/RPM/BUILD/poppler-0.61.1/BUILD'
make[2]: Entering directory '/usr/src/RPM/BUILD/poppler-0.61.1/BUILD'
[ 45%] Building CXX object CMakeFiles/poppler.dir/poppler/CurlCachedFile.cc.o
make[2]: Leaving directory '/usr/src/RPM/BUILD/poppler-0.61.1/BUILD'
make[2]: Entering directory '/usr/src/RPM/BUILD/poppler-0.61.1/BUILD'
[ 43%] Building CXX object CMakeFiles/poppler.dir/splash/SplashScreen.cc.o
make[2]: Leaving directory '/usr/src/RPM/BUILD/poppler-0.61.1/BUILD'
make[2]: Entering directory '/usr/src/RPM/BUILD/poppler-0.61.1/BUILD'
[ 46%] Building CXX object CMakeFiles/poppler.dir/poppler/SignatureHandler.cc.o
make[2]: Leaving directory '/usr/src/RPM/BUILD/poppler-0.61.1/BUILD'
make[2]: Entering directory '/usr/src/RPM/BUILD/poppler-0.61.1/BUILD'
[ 45%] Building CXX object CMakeFiles/poppler.dir/poppler/CurlPDFDocBuilder.cc.o
make[2]: Leaving directory '/usr/src/RPM/BUILD/poppler-0.61.1/BUILD'
make[2]: Entering directory '/usr/src/RPM/BUILD/poppler-0.61.1/BUILD'
[ 33%] Building CXX object CMakeFiles/poppler.dir/poppler/PSOutputDev.cc.o
/usr/src/RPM/BUILD/poppler-0.61.1/poppler/PSOutputDev.cc: In member function 'void PSOutputDev::setupImage(Ref, Stream*, GBool)':
/usr/src/RPM/BUILD/poppler-0.61.1/poppler/PSOutputDev.cc:2950:9: warning: variable 'useFlate' set but not used [-Wunused-but-set-variable]
   GBool useFlate, useLZW, useRLE, useCompressed, doUseASCIIHex;
         ^~~~~~~~
make[2]: Leaving directory '/usr/src/RPM/BUILD/poppler-0.61.1/BUILD'
make[2]: Entering directory '/usr/src/RPM/BUILD/poppler-0.61.1/BUILD'
[ 44%] Building CXX object CMakeFiles/poppler.dir/splash/SplashXPath.cc.o
make[2]: Leaving directory '/usr/src/RPM/BUILD/poppler-0.61.1/BUILD'
make[2]: Entering directory '/usr/src/RPM/BUILD/poppler-0.61.1/BUILD'
[ 46%] Building CXX object CMakeFiles/poppler.dir/poppler/JPEG2000Stream.cc.o
make[2]: Leaving directory '/usr/src/RPM/BUILD/poppler-0.61.1/BUILD'
make[2]: Entering directory '/usr/src/RPM/BUILD/poppler-0.61.1/BUILD'
[ 45%] Building CXX object CMakeFiles/poppler.dir/splash/SplashXPathScanner.cc.o
make[2]: Leaving directory '/usr/src/RPM/BUILD/poppler-0.61.1/BUILD'
make[2]: Entering directory '/usr/src/RPM/BUILD/poppler-0.61.1/BUILD'
[ 33%] Building CXX object CMakeFiles/poppler.dir/poppler/TextOutputDev.cc.o
make[2]: Leaving directory '/usr/src/RPM/BUILD/poppler-0.61.1/BUILD'
make[2]: Entering directory '/usr/src/RPM/BUILD/poppler-0.61.1/BUILD'
[ 37%] Building CXX object CMakeFiles/poppler.dir/poppler/SplashOutputDev.cc.o
make[2]: Leaving directory '/usr/src/RPM/BUILD/poppler-0.61.1/BUILD'
make[2]: Entering directory '/usr/src/RPM/BUILD/poppler-0.61.1/BUILD'
[ 38%] Building CXX object CMakeFiles/poppler.dir/splash/Splash.cc.o
make[2]: Leaving directory '/usr/src/RPM/BUILD/poppler-0.61.1/BUILD'
make[2]: Entering directory '/usr/src/RPM/BUILD/poppler-0.61.1/BUILD'
[ 47%] Linking CXX shared library libpoppler.so
make[2]: Leaving directory '/usr/src/RPM/BUILD/poppler-0.61.1/BUILD'
make[1]: Entering directory '/usr/src/RPM/BUILD/poppler-0.61.1/BUILD'
[ 47%] Built target poppler
make[1]: Leaving directory '/usr/src/RPM/BUILD/poppler-0.61.1/BUILD'
make[2]: Entering directory '/usr/src/RPM/BUILD/poppler-0.61.1/BUILD'
Scanning dependencies of target perf-test
make[2]: Leaving directory '/usr/src/RPM/BUILD/poppler-0.61.1/BUILD'
make[2]: Entering directory '/usr/src/RPM/BUILD/poppler-0.61.1/BUILD'
Scanning dependencies of target pdf-fullrewrite
make[2]: Leaving directory '/usr/src/RPM/BUILD/poppler-0.61.1/BUILD'
make[2]: Entering directory '/usr/src/RPM/BUILD/poppler-0.61.1/BUILD'
[ 47%] Generating poppler-optcontent.moc
make[2]: Leaving directory '/usr/src/RPM/BUILD/poppler-0.61.1/BUILD'
make[2]: Entering directory '/usr/src/RPM/BUILD/poppler-0.61.1/BUILD'
Scanning dependencies of target poppler-qt4
make[2]: Leaving directory '/usr/src/RPM/BUILD/poppler-0.61.1/BUILD'
make[2]: Entering directory '/usr/src/RPM/BUILD/poppler-0.61.1/BUILD'
[ 49%] Building CXX object test/CMakeFiles/perf-test.dir/perf-test-preview-dummy.cc.o
make[2]: Leaving directory '/usr/src/RPM/BUILD/poppler-0.61.1/BUILD'
make[2]: Entering directory '/usr/src/RPM/BUILD/poppler-0.61.1/BUILD'
[ 49%] Building CXX object test/CMakeFiles/pdf-fullrewrite.dir/__/utils/parseargs.cc.o
make[2]: Leaving directory '/usr/src/RPM/BUILD/poppler-0.61.1/BUILD'
make[2]: Entering directory '/usr/src/RPM/BUILD/poppler-0.61.1/BUILD'
[ 49%] Building CXX object test/CMakeFiles/pdf-fullrewrite.dir/pdf-fullrewrite.cc.o
make[2]: Leaving directory '/usr/src/RPM/BUILD/poppler-0.61.1/BUILD'
make[2]: Entering directory '/usr/src/RPM/BUILD/poppler-0.61.1/BUILD'
[ 52%] Linking CXX executable pdf-fullrewrite
make[2]: Leaving directory '/usr/src/RPM/BUILD/poppler-0.61.1/BUILD'
make[1]: Entering directory '/usr/src/RPM/BUILD/poppler-0.61.1/BUILD'
[ 52%] Built target pdf-fullrewrite
make[1]: Leaving directory '/usr/src/RPM/BUILD/poppler-0.61.1/BUILD'
make[2]: Entering directory '/usr/src/RPM/BUILD/poppler-0.61.1/BUILD'
[ 48%] Building CXX object test/CMakeFiles/perf-test.dir/perf-test.cc.o
make[2]: Leaving directory '/usr/src/RPM/BUILD/poppler-0.61.1/BUILD'
make[2]: Entering directory '/usr/src/RPM/BUILD/poppler-0.61.1/BUILD'
[ 53%] Linking CXX executable perf-test
make[2]: Leaving directory '/usr/src/RPM/BUILD/poppler-0.61.1/BUILD'
make[1]: Entering directory '/usr/src/RPM/BUILD/poppler-0.61.1/BUILD'
[ 53%] Built target perf-test
make[1]: Leaving directory '/usr/src/RPM/BUILD/poppler-0.61.1/BUILD'
make[2]: Entering directory '/usr/src/RPM/BUILD/poppler-0.61.1/BUILD'
[ 50%] Building CXX object qt4/src/CMakeFiles/poppler-qt4.dir/poppler-embeddedfile.cc.o
make[2]: Leaving directory '/usr/src/RPM/BUILD/poppler-0.61.1/BUILD'
make[2]: Entering directory '/usr/src/RPM/BUILD/poppler-0.61.1/BUILD'
[ 54%] Building CXX object qt4/src/CMakeFiles/poppler-qt4.dir/poppler-movie.cc.o
make[2]: Leaving directory '/usr/src/RPM/BUILD/poppler-0.61.1/BUILD'
make[2]: Entering directory '/usr/src/RPM/BUILD/poppler-0.61.1/BUILD'
[ 52%] Building CXX object qt4/src/CMakeFiles/poppler-qt4.dir/poppler-link-extractor.cc.o
make[2]: Leaving directory '/usr/src/RPM/BUILD/poppler-0.61.1/BUILD'
make[2]: Entering directory '/usr/src/RPM/BUILD/poppler-0.61.1/BUILD'
[ 52%] Building CXX object qt4/src/CMakeFiles/poppler-qt4.dir/poppler-link.cc.o
make[2]: Leaving directory '/usr/src/RPM/BUILD/poppler-0.61.1/BUILD'
make[2]: Entering directory '/usr/src/RPM/BUILD/poppler-0.61.1/BUILD'
[ 50%] Building CXX object qt4/src/CMakeFiles/poppler-qt4.dir/poppler-document.cc.o
make[2]: Leaving directory '/usr/src/RPM/BUILD/poppler-0.61.1/BUILD'
make[2]: Entering directory '/usr/src/RPM/BUILD/poppler-0.61.1/BUILD'
[ 51%] Building CXX object qt4/src/CMakeFiles/poppler-qt4.dir/poppler-fontinfo.cc.o
make[2]: Leaving directory '/usr/src/RPM/BUILD/poppler-0.61.1/BUILD'
make[2]: Entering directory '/usr/src/RPM/BUILD/poppler-0.61.1/BUILD'
[ 50%] Building CXX object qt4/src/CMakeFiles/poppler-qt4.dir/poppler-form.cc.o
make[2]: Leaving directory '/usr/src/RPM/BUILD/poppler-0.61.1/BUILD'
make[2]: Entering directory '/usr/src/RPM/BUILD/poppler-0.61.1/BUILD'
[ 55%] Building CXX object qt4/src/CMakeFiles/poppler-qt4.dir/poppler-pdf-converter.cc.o
make[2]: Leaving directory '/usr/src/RPM/BUILD/poppler-0.61.1/BUILD'
make[2]: Entering directory '/usr/src/RPM/BUILD/poppler-0.61.1/BUILD'
[ 55%] Building CXX object qt4/src/CMakeFiles/poppler-qt4.dir/poppler-page.cc.o
/usr/src/RPM/BUILD/poppler-0.61.1/qt4/src/poppler-page.cc: In member function 'bool Poppler::Page::search(const QString&, QRectF&, Poppler::Page::SearchDirection, Poppler::Page::SearchMode, Poppler::Page::Rotation) const':
/usr/src/RPM/BUILD/poppler-0.61.1/qt4/src/poppler-page.cc:554:91: warning: 'bool Poppler::Page::search(const QString&, double&, double&, double&, double&, Poppler::Page::SearchDirection, Poppler::Page::SearchMode, Poppler::Page::Rotation) const' is deprecated [-Wdeprecated-declarations]
   bool found = search(text, sLeft, sTop, sRight, sBottom, direction, caseSensitive, rotate);
                                                                                           ^
/usr/src/RPM/BUILD/poppler-0.61.1/qt4/src/poppler-page.cc:517:6: note: declared here
 bool Page::search(const QString &text, double &sLeft, double &sTop, double &sRight, double &sBottom, SearchDirection direction, SearchMode caseSensitive, Rotation rotate) const
      ^~~~
make[2]: Leaving directory '/usr/src/RPM/BUILD/poppler-0.61.1/BUILD'
make[2]: Entering directory '/usr/src/RPM/BUILD/poppler-0.61.1/BUILD'
[ 57%] Building CXX object qt4/src/CMakeFiles/poppler-qt4.dir/poppler-qiodeviceoutstream.cc.o
make[2]: Leaving directory '/usr/src/RPM/BUILD/poppler-0.61.1/BUILD'
make[2]: Entering directory '/usr/src/RPM/BUILD/poppler-0.61.1/BUILD'
[ 56%] Building CXX object qt4/src/CMakeFiles/poppler-qt4.dir/poppler-private.cc.o
make[2]: Leaving directory '/usr/src/RPM/BUILD/poppler-0.61.1/BUILD'
make[2]: Entering directory '/usr/src/RPM/BUILD/poppler-0.61.1/BUILD'
[ 55%] Building CXX object qt4/src/CMakeFiles/poppler-qt4.dir/poppler-base-converter.cc.o
make[2]: Leaving directory '/usr/src/RPM/BUILD/poppler-0.61.1/BUILD'
make[2]: Entering directory '/usr/src/RPM/BUILD/poppler-0.61.1/BUILD'
[ 58%] Building CXX object qt4/src/CMakeFiles/poppler-qt4.dir/poppler-page-transition.cc.o
make[2]: Leaving directory '/usr/src/RPM/BUILD/poppler-0.61.1/BUILD'
make[2]: Entering directory '/usr/src/RPM/BUILD/poppler-0.61.1/BUILD'
[ 57%] Building CXX object qt4/src/CMakeFiles/poppler-qt4.dir/poppler-sound.cc.o
make[2]: Leaving directory '/usr/src/RPM/BUILD/poppler-0.61.1/BUILD'
make[2]: Entering directory '/usr/src/RPM/BUILD/poppler-0.61.1/BUILD'
[ 56%] Building CXX object qt4/src/CMakeFiles/poppler-qt4.dir/poppler-ps-converter.cc.o
make[2]: Leaving directory '/usr/src/RPM/BUILD/poppler-0.61.1/BUILD'
make[2]: Entering directory '/usr/src/RPM/BUILD/poppler-0.61.1/BUILD'
[ 58%] Building CXX object qt4/src/CMakeFiles/poppler-qt4.dir/poppler-textbox.cc.o
make[2]: Leaving directory '/usr/src/RPM/BUILD/poppler-0.61.1/BUILD'
make[2]: Entering directory '/usr/src/RPM/BUILD/poppler-0.61.1/BUILD'
[ 58%] Building CXX object qt4/src/CMakeFiles/poppler-qt4.dir/poppler-media.cc.o
make[2]: Leaving directory '/usr/src/RPM/BUILD/poppler-0.61.1/BUILD'
make[2]: Entering directory '/usr/src/RPM/BUILD/poppler-0.61.1/BUILD'
[ 54%] Building CXX object qt4/src/CMakeFiles/poppler-qt4.dir/poppler-optcontent.cc.o
make[2]: Leaving directory '/usr/src/RPM/BUILD/poppler-0.61.1/BUILD'
make[2]: Entering directory '/usr/src/RPM/BUILD/poppler-0.61.1/BUILD'
[ 59%] Building CXX object qt4/src/CMakeFiles/poppler-qt4.dir/ArthurOutputDev.cc.o
make[2]: Leaving directory '/usr/src/RPM/BUILD/poppler-0.61.1/BUILD'
make[2]: Entering directory '/usr/src/RPM/BUILD/poppler-0.61.1/BUILD'
[ 50%] Building CXX object qt4/src/CMakeFiles/poppler-qt4.dir/poppler-annotation.cc.o
/usr/src/RPM/BUILD/poppler-0.61.1/qt4/src/poppler-annotation.cc: In constructor 'Poppler::Annotation::Annotation(Poppler::AnnotationPrivate&)':
/usr/src/RPM/BUILD/poppler-0.61.1/qt4/src/poppler-annotation.cc:1062:18: warning: 'Poppler::Annotation::window' is deprecated [-Wdeprecated-declarations]
     : d_ptr( &dd )
                  ^
In file included from /usr/src/RPM/BUILD/poppler-0.61.1/qt4/src/poppler-annotation.cc:33:
/usr/src/RPM/BUILD/poppler-0.61.1/qt4/src/poppler-annotation.h:377:53: note: declared here
     Q_DECL_DEPRECATED struct { int width, height; } window; // Always set to zero
                                                     ^~~~~~
/usr/src/RPM/BUILD/poppler-0.61.1/qt4/src/poppler-annotation.cc:1062:18: warning: 'Poppler::Annotation::window' is deprecated [-Wdeprecated-declarations]
     : d_ptr( &dd )
                  ^
In file included from /usr/src/RPM/BUILD/poppler-0.61.1/qt4/src/poppler-annotation.cc:33:
/usr/src/RPM/BUILD/poppler-0.61.1/qt4/src/poppler-annotation.h:377:53: note: declared here
     Q_DECL_DEPRECATED struct { int width, height; } window; // Always set to zero
                                                     ^~~~~~
/usr/src/RPM/BUILD/poppler-0.61.1/qt4/src/poppler-annotation.cc:1064:5: warning: 'Poppler::Annotation::window' is deprecated [-Wdeprecated-declarations]
     window.width = window.height = 0;
     ^~~~~~
In file included from /usr/src/RPM/BUILD/poppler-0.61.1/qt4/src/poppler-annotation.cc:33:
/usr/src/RPM/BUILD/poppler-0.61.1/qt4/src/poppler-annotation.h:377:53: note: declared here
     Q_DECL_DEPRECATED struct { int width, height; } window; // Always set to zero
                                                     ^~~~~~
/usr/src/RPM/BUILD/poppler-0.61.1/qt4/src/poppler-annotation.cc:1064:5: warning: 'Poppler::Annotation::window' is deprecated [-Wdeprecated-declarations]
     window.width = window.height = 0;
     ^~~~~~
In file included from /usr/src/RPM/BUILD/poppler-0.61.1/qt4/src/poppler-annotation.cc:33:
/usr/src/RPM/BUILD/poppler-0.61.1/qt4/src/poppler-annotation.h:377:53: note: declared here
     Q_DECL_DEPRECATED struct { int width, height; } window; // Always set to zero
                                                     ^~~~~~
/usr/src/RPM/BUILD/poppler-0.61.1/qt4/src/poppler-annotation.cc:1064:20: warning: 'Poppler::Annotation::window' is deprecated [-Wdeprecated-declarations]
     window.width = window.height = 0;
                    ^~~~~~
In file included from /usr/src/RPM/BUILD/poppler-0.61.1/qt4/src/poppler-annotation.cc:33:
/usr/src/RPM/BUILD/poppler-0.61.1/qt4/src/poppler-annotation.h:377:53: note: declared here
     Q_DECL_DEPRECATED struct { int width, height; } window; // Always set to zero
                                                     ^~~~~~
/usr/src/RPM/BUILD/poppler-0.61.1/qt4/src/poppler-annotation.cc:1064:20: warning: 'Poppler::Annotation::window' is deprecated [-Wdeprecated-declarations]
     window.width = window.height = 0;
                    ^~~~~~
In file included from /usr/src/RPM/BUILD/poppler-0.61.1/qt4/src/poppler-annotation.cc:33:
/usr/src/RPM/BUILD/poppler-0.61.1/qt4/src/poppler-annotation.h:377:53: note: declared here
     Q_DECL_DEPRECATED struct { int width, height; } window; // Always set to zero
                                                     ^~~~~~
/usr/src/RPM/BUILD/poppler-0.61.1/qt4/src/poppler-annotation.cc: In constructor 'Poppler::Annotation::Annotation(Poppler::AnnotationPrivate&, const QDomNode&)':
/usr/src/RPM/BUILD/poppler-0.61.1/qt4/src/poppler-annotation.cc:1072:18: warning: 'Poppler::Annotation::window' is deprecated [-Wdeprecated-declarations]
     : d_ptr( &dd )
                  ^
In file included from /usr/src/RPM/BUILD/poppler-0.61.1/qt4/src/poppler-annotation.cc:33:
/usr/src/RPM/BUILD/poppler-0.61.1/qt4/src/poppler-annotation.h:377:53: note: declared here
     Q_DECL_DEPRECATED struct { int width, height; } window; // Always set to zero
                                                     ^~~~~~
/usr/src/RPM/BUILD/poppler-0.61.1/qt4/src/poppler-annotation.cc:1072:18: warning: 'Poppler::Annotation::window' is deprecated [-Wdeprecated-declarations]
     : d_ptr( &dd )
                  ^
In file included from /usr/src/RPM/BUILD/poppler-0.61.1/qt4/src/poppler-annotation.cc:33:
/usr/src/RPM/BUILD/poppler-0.61.1/qt4/src/poppler-annotation.h:377:53: note: declared here
     Q_DECL_DEPRECATED struct { int width, height; } window; // Always set to zero
                                                     ^~~~~~
/usr/src/RPM/BUILD/poppler-0.61.1/qt4/src/poppler-annotation.cc:1076:5: warning: 'Poppler::Annotation::window' is deprecated [-Wdeprecated-declarations]
     window.width = window.height = 0;
     ^~~~~~
In file included from /usr/src/RPM/BUILD/poppler-0.61.1/qt4/src/poppler-annotation.cc:33:
/usr/src/RPM/BUILD/poppler-0.61.1/qt4/src/poppler-annotation.h:377:53: note: declared here
     Q_DECL_DEPRECATED struct { int width, height; } window; // Always set to zero
                                                     ^~~~~~
/usr/src/RPM/BUILD/poppler-0.61.1/qt4/src/poppler-annotation.cc:1076:5: warning: 'Poppler::Annotation::window' is deprecated [-Wdeprecated-declarations]
     window.width = window.height = 0;
     ^~~~~~
In file included from /usr/src/RPM/BUILD/poppler-0.61.1/qt4/src/poppler-annotation.cc:33:
/usr/src/RPM/BUILD/poppler-0.61.1/qt4/src/poppler-annotation.h:377:53: note: declared here
     Q_DECL_DEPRECATED struct { int width, height; } window; // Always set to zero
                                                     ^~~~~~
/usr/src/RPM/BUILD/poppler-0.61.1/qt4/src/poppler-annotation.cc:1076:20: warning: 'Poppler::Annotation::window' is deprecated [-Wdeprecated-declarations]
     window.width = window.height = 0;
                    ^~~~~~
In file included from /usr/src/RPM/BUILD/poppler-0.61.1/qt4/src/poppler-annotation.cc:33:
/usr/src/RPM/BUILD/poppler-0.61.1/qt4/src/poppler-annotation.h:377:53: note: declared here
     Q_DECL_DEPRECATED struct { int width, height; } window; // Always set to zero
                                                     ^~~~~~
/usr/src/RPM/BUILD/poppler-0.61.1/qt4/src/poppler-annotation.cc:1076:20: warning: 'Poppler::Annotation::window' is deprecated [-Wdeprecated-declarations]
     window.width = window.height = 0;
                    ^~~~~~
In file included from /usr/src/RPM/BUILD/poppler-0.61.1/qt4/src/poppler-annotation.cc:33:
/usr/src/RPM/BUILD/poppler-0.61.1/qt4/src/poppler-annotation.h:377:53: note: declared here
     Q_DECL_DEPRECATED struct { int width, height; } window; // Always set to zero
                                                     ^~~~~~
/usr/src/RPM/BUILD/poppler-0.61.1/qt4/src/poppler-annotation.cc: In member function 'virtual void Poppler::LinkAnnotation::store(QDomNode&, QDomDocument&) const':
/usr/src/RPM/BUILD/poppler-0.61.1/qt4/src/poppler-annotation.cc:3863:15: warning: enumeration value 'JavaScript' not handled in switch [-Wswitch]
         switch( linkDestination()->linkType() )
               ^
/usr/src/RPM/BUILD/poppler-0.61.1/qt4/src/poppler-annotation.cc:3863:15: warning: enumeration value 'OCGState' not handled in switch [-Wswitch]
make[2]: Leaving directory '/usr/src/RPM/BUILD/poppler-0.61.1/BUILD'
make[2]: Entering directory '/usr/src/RPM/BUILD/poppler-0.61.1/BUILD'
[ 59%] Linking CXX shared library libpoppler-qt4.so
make[2]: Leaving directory '/usr/src/RPM/BUILD/poppler-0.61.1/BUILD'
make[1]: Entering directory '/usr/src/RPM/BUILD/poppler-0.61.1/BUILD'
[ 59%] Built target poppler-qt4
make[1]: Leaving directory '/usr/src/RPM/BUILD/poppler-0.61.1/BUILD'
make[2]: Entering directory '/usr/src/RPM/BUILD/poppler-0.61.1/BUILD'
Scanning dependencies of target poppler-qt4-fonts
make[2]: Leaving directory '/usr/src/RPM/BUILD/poppler-0.61.1/BUILD'
make[2]: Entering directory '/usr/src/RPM/BUILD/poppler-0.61.1/BUILD'
[ 59%] Generating check_goostring.moc
make[2]: Leaving directory '/usr/src/RPM/BUILD/poppler-0.61.1/BUILD'
make[2]: Entering directory '/usr/src/RPM/BUILD/poppler-0.61.1/BUILD'
[ 60%] Generating check_password.moc
make[2]: Leaving directory '/usr/src/RPM/BUILD/poppler-0.61.1/BUILD'
make[2]: Entering directory '/usr/src/RPM/BUILD/poppler-0.61.1/BUILD'
[ 60%] Generating check_actualtext.moc
make[2]: Leaving directory '/usr/src/RPM/BUILD/poppler-0.61.1/BUILD'
make[2]: Entering directory '/usr/src/RPM/BUILD/poppler-0.61.1/BUILD'
Scanning dependencies of target check_qt4_password
make[2]: Leaving directory '/usr/src/RPM/BUILD/poppler-0.61.1/BUILD'
make[2]: Entering directory '/usr/src/RPM/BUILD/poppler-0.61.1/BUILD'
Scanning dependencies of target check_qt4_actualtext
make[2]: Leaving directory '/usr/src/RPM/BUILD/poppler-0.61.1/BUILD'
make[2]: Entering directory '/usr/src/RPM/BUILD/poppler-0.61.1/BUILD'
Scanning dependencies of target check_qt4_goostring
make[2]: Leaving directory '/usr/src/RPM/BUILD/poppler-0.61.1/BUILD'
make[2]: Entering directory '/usr/src/RPM/BUILD/poppler-0.61.1/BUILD'
[ 60%] Generating check_pagelabelinfo.moc
make[2]: Leaving directory '/usr/src/RPM/BUILD/poppler-0.61.1/BUILD'
make[2]: Entering directory '/usr/src/RPM/BUILD/poppler-0.61.1/BUILD'
[ 60%] Generating check_search.moc
make[2]: Leaving directory '/usr/src/RPM/BUILD/poppler-0.61.1/BUILD'
make[2]: Entering directory '/usr/src/RPM/BUILD/poppler-0.61.1/BUILD'
[ 60%] Generating check_lexer.moc
make[2]: Leaving directory '/usr/src/RPM/BUILD/poppler-0.61.1/BUILD'
make[2]: Entering directory '/usr/src/RPM/BUILD/poppler-0.61.1/BUILD'
[ 60%] Generating check_strings.moc
make[2]: Leaving directory '/usr/src/RPM/BUILD/poppler-0.61.1/BUILD'
make[2]: Entering directory '/usr/src/RPM/BUILD/poppler-0.61.1/BUILD'
Scanning dependencies of target check_qt4_pagelabelinfo
make[2]: Leaving directory '/usr/src/RPM/BUILD/poppler-0.61.1/BUILD'
make[2]: Entering directory '/usr/src/RPM/BUILD/poppler-0.61.1/BUILD'
Scanning dependencies of target check_qt4_search
make[2]: Leaving directory '/usr/src/RPM/BUILD/poppler-0.61.1/BUILD'
make[2]: Entering directory '/usr/src/RPM/BUILD/poppler-0.61.1/BUILD'
Scanning dependencies of target check_qt4_lexer
make[2]: Leaving directory '/usr/src/RPM/BUILD/poppler-0.61.1/BUILD'
make[2]: Entering directory '/usr/src/RPM/BUILD/poppler-0.61.1/BUILD'
Scanning dependencies of target check_qt4_strings
make[2]: Leaving directory '/usr/src/RPM/BUILD/poppler-0.61.1/BUILD'
make[2]: Entering directory '/usr/src/RPM/BUILD/poppler-0.61.1/BUILD'
[ 62%] Building CXX object qt4/tests/CMakeFiles/check_qt4_password.dir/check_password.cpp.o
make[2]: Leaving directory '/usr/src/RPM/BUILD/poppler-0.61.1/BUILD'
make[2]: Entering directory '/usr/src/RPM/BUILD/poppler-0.61.1/BUILD'
[ 61%] Building CXX object qt4/tests/CMakeFiles/poppler-qt4-fonts.dir/poppler-fonts.cpp.o
make[2]: Leaving directory '/usr/src/RPM/BUILD/poppler-0.61.1/BUILD'
make[2]: Entering directory '/usr/src/RPM/BUILD/poppler-0.61.1/BUILD'
[ 63%] Building CXX object qt4/tests/CMakeFiles/check_qt4_goostring.dir/check_goostring.cpp.o
make[2]: Leaving directory '/usr/src/RPM/BUILD/poppler-0.61.1/BUILD'
make[2]: Entering directory '/usr/src/RPM/BUILD/poppler-0.61.1/BUILD'
[ 62%] Building CXX object qt4/tests/CMakeFiles/check_qt4_actualtext.dir/check_actualtext.cpp.o
make[2]: Leaving directory '/usr/src/RPM/BUILD/poppler-0.61.1/BUILD'
make[2]: Entering directory '/usr/src/RPM/BUILD/poppler-0.61.1/BUILD'
[ 65%] Linking CXX executable check_qt4_password
make[2]: Leaving directory '/usr/src/RPM/BUILD/poppler-0.61.1/BUILD'
make[1]: Entering directory '/usr/src/RPM/BUILD/poppler-0.61.1/BUILD'
[ 66%] Built target check_qt4_password
make[1]: Leaving directory '/usr/src/RPM/BUILD/poppler-0.61.1/BUILD'
make[2]: Entering directory '/usr/src/RPM/BUILD/poppler-0.61.1/BUILD'
[ 67%] Generating check_fonts.moc
make[2]: Leaving directory '/usr/src/RPM/BUILD/poppler-0.61.1/BUILD'
make[2]: Entering directory '/usr/src/RPM/BUILD/poppler-0.61.1/BUILD'
[ 65%] Linking CXX executable check_qt4_goostring
make[2]: Leaving directory '/usr/src/RPM/BUILD/poppler-0.61.1/BUILD'
make[2]: Entering directory '/usr/src/RPM/BUILD/poppler-0.61.1/BUILD'
Scanning dependencies of target check_qt4_fonts
make[2]: Leaving directory '/usr/src/RPM/BUILD/poppler-0.61.1/BUILD'
make[1]: Entering directory '/usr/src/RPM/BUILD/poppler-0.61.1/BUILD'
[ 67%] Built target check_qt4_goostring
make[1]: Leaving directory '/usr/src/RPM/BUILD/poppler-0.61.1/BUILD'
make[2]: Entering directory '/usr/src/RPM/BUILD/poppler-0.61.1/BUILD'
[ 67%] Generating check_metadata.moc
make[2]: Leaving directory '/usr/src/RPM/BUILD/poppler-0.61.1/BUILD'
make[2]: Entering directory '/usr/src/RPM/BUILD/poppler-0.61.1/BUILD'
Scanning dependencies of target check_qt4_metadata
make[2]: Leaving directory '/usr/src/RPM/BUILD/poppler-0.61.1/BUILD'
make[2]: Entering directory '/usr/src/RPM/BUILD/poppler-0.61.1/BUILD'
[ 64%] Building CXX object qt4/tests/CMakeFiles/check_qt4_lexer.dir/check_lexer.cpp.o
make[2]: Leaving directory '/usr/src/RPM/BUILD/poppler-0.61.1/BUILD'
make[2]: Entering directory '/usr/src/RPM/BUILD/poppler-0.61.1/BUILD'
[ 65%] Linking CXX executable poppler-qt4-fonts
make[2]: Leaving directory '/usr/src/RPM/BUILD/poppler-0.61.1/BUILD'
make[1]: Entering directory '/usr/src/RPM/BUILD/poppler-0.61.1/BUILD'
[ 67%] Built target poppler-qt4-fonts
make[1]: Leaving directory '/usr/src/RPM/BUILD/poppler-0.61.1/BUILD'
make[2]: Entering directory '/usr/src/RPM/BUILD/poppler-0.61.1/BUILD'
[ 66%] Linking CXX executable check_qt4_actualtext
make[2]: Leaving directory '/usr/src/RPM/BUILD/poppler-0.61.1/BUILD'
make[1]: Entering directory '/usr/src/RPM/BUILD/poppler-0.61.1/BUILD'
[ 67%] Built target check_qt4_actualtext
make[1]: Leaving directory '/usr/src/RPM/BUILD/poppler-0.61.1/BUILD'
make[2]: Entering directory '/usr/src/RPM/BUILD/poppler-0.61.1/BUILD'
[ 67%] Linking CXX executable check_qt4_lexer
make[2]: Leaving directory '/usr/src/RPM/BUILD/poppler-0.61.1/BUILD'
make[2]: Entering directory '/usr/src/RPM/BUILD/poppler-0.61.1/BUILD'
Scanning dependencies of target poppler-qt4-forms
make[2]: Leaving directory '/usr/src/RPM/BUILD/poppler-0.61.1/BUILD'
make[1]: Entering directory '/usr/src/RPM/BUILD/poppler-0.61.1/BUILD'
[ 67%] Built target check_qt4_lexer
make[1]: Leaving directory '/usr/src/RPM/BUILD/poppler-0.61.1/BUILD'
make[2]: Entering directory '/usr/src/RPM/BUILD/poppler-0.61.1/BUILD'
[ 67%] Generating check_optcontent.moc
make[2]: Leaving directory '/usr/src/RPM/BUILD/poppler-0.61.1/BUILD'
make[2]: Entering directory '/usr/src/RPM/BUILD/poppler-0.61.1/BUILD'
Scanning dependencies of target test-poppler-qt4
make[2]: Leaving directory '/usr/src/RPM/BUILD/poppler-0.61.1/BUILD'
make[2]: Entering directory '/usr/src/RPM/BUILD/poppler-0.61.1/BUILD'
Scanning dependencies of target check_qt4_optcontent
make[2]: Leaving directory '/usr/src/RPM/BUILD/poppler-0.61.1/BUILD'
make[2]: Entering directory '/usr/src/RPM/BUILD/poppler-0.61.1/BUILD'
[ 63%] Building CXX object qt4/tests/CMakeFiles/check_qt4_pagelabelinfo.dir/check_pagelabelinfo.cpp.o
make[2]: Leaving directory '/usr/src/RPM/BUILD/poppler-0.61.1/BUILD'
make[2]: Entering directory '/usr/src/RPM/BUILD/poppler-0.61.1/BUILD'
[ 65%] Building CXX object qt4/tests/CMakeFiles/check_qt4_strings.dir/check_strings.cpp.o
make[2]: Leaving directory '/usr/src/RPM/BUILD/poppler-0.61.1/BUILD'
make[2]: Entering directory '/usr/src/RPM/BUILD/poppler-0.61.1/BUILD'
[ 64%] Building CXX object qt4/tests/CMakeFiles/check_qt4_search.dir/check_search.cpp.o
In file included from /usr/include/qt4/QtTest/qtest.h:46,
                 from /usr/include/qt4/QtTest/QtTest:7,
                 from /usr/src/RPM/BUILD/poppler-0.61.1/qt4/tests/check_search.cpp:1:
/usr/src/RPM/BUILD/poppler-0.61.1/qt4/tests/check_search.cpp: In member function 'void TestSearch::bug7063()':
/usr/src/RPM/BUILD/poppler-0.61.1/qt4/tests/check_search.cpp:23:115: warning: 'bool Poppler::Page::search(const QString&, QRectF&, Poppler::Page::SearchDirection, Poppler::Page::SearchMode, Poppler::Page::Rotation) const' is deprecated [-Wdeprecated-declarations]
     QCOMPARE( page->search(QString("non-ascii:"), pageRegion, Poppler::Page::FromTop, Poppler::Page::CaseSensitive), true );
                                                                                                                   ^
/usr/include/qt4/QtTest/qtestcase.h:81:26: note: in definition of macro 'QCOMPARE'
     if (!QTest::qCompare(actual, expected, #actual, #expected, __FILE__, __LINE__))\
                          ^~~~~~
In file included from /usr/src/RPM/BUILD/poppler-0.61.1/qt4/tests/check_search.cpp:3:
/usr/src/RPM/BUILD/poppler-0.61.1/qt4/tests/../src/poppler-qt4.h:604:25: note: declared here
  Q_DECL_DEPRECATED bool search(const QString &text, QRectF &rect, SearchDirection direction, SearchMode caseSensitive, Rotation rotate = Rotate0) const;
                         ^~~~~~
In file included from /usr/include/qt4/QtTest/qtest.h:46,
                 from /usr/include/qt4/QtTest/QtTest:7,
                 from /usr/src/RPM/BUILD/poppler-0.61.1/qt4/tests/check_search.cpp:1:
/usr/src/RPM/BUILD/poppler-0.61.1/qt4/tests/check_search.cpp:25:110: warning: 'bool Poppler::Page::search(const QString&, QRectF&, Poppler::Page::SearchDirection, Poppler::Page::SearchMode, Poppler::Page::Rotation) const' is deprecated [-Wdeprecated-declarations]
     QCOMPARE( page->search(QString("Ascii"), pageRegion, Poppler::Page::FromTop, Poppler::Page::CaseSensitive), false );
                                                                                                              ^
/usr/include/qt4/QtTest/qtestcase.h:81:26: note: in definition of macro 'QCOMPARE'
     if (!QTest::qCompare(actual, expected, #actual, #expected, __FILE__, __LINE__))\
                          ^~~~~~
In file included from /usr/src/RPM/BUILD/poppler-0.61.1/qt4/tests/check_search.cpp:3:
/usr/src/RPM/BUILD/poppler-0.61.1/qt4/tests/../src/poppler-qt4.h:604:25: note: declared here
  Q_DECL_DEPRECATED bool search(const QString &text, QRectF &rect, SearchDirection direction, SearchMode caseSensitive, Rotation rotate = Rotate0) const;
                         ^~~~~~
In file included from /usr/include/qt4/QtTest/qtest.h:46,
                 from /usr/include/qt4/QtTest/QtTest:7,
                 from /usr/src/RPM/BUILD/poppler-0.61.1/qt4/tests/check_search.cpp:1:
/usr/src/RPM/BUILD/poppler-0.61.1/qt4/tests/check_search.cpp:26:112: warning: 'bool Poppler::Page::search(const QString&, QRectF&, Poppler::Page::SearchDirection, Poppler::Page::SearchMode, Poppler::Page::Rotation) const' is deprecated [-Wdeprecated-declarations]
     QCOMPARE( page->search(QString("Ascii"), pageRegion, Poppler::Page::FromTop, Poppler::Page::CaseInsensitive), true );
                                                                                                                ^
/usr/include/qt4/QtTest/qtestcase.h:81:26: note: in definition of macro 'QCOMPARE'
     if (!QTest::qCompare(actual, expected, #actual, #expected, __FILE__, __LINE__))\
                          ^~~~~~
In file included from /usr/src/RPM/BUILD/poppler-0.61.1/qt4/tests/check_search.cpp:3:
/usr/src/RPM/BUILD/poppler-0.61.1/qt4/tests/../src/poppler-qt4.h:604:25: note: declared here
  Q_DECL_DEPRECATED bool search(const QString &text, QRectF &rect, SearchDirection direction, SearchMode caseSensitive, Rotation rotate = Rotate0) const;
                         ^~~~~~
In file included from /usr/include/qt4/QtTest/qtest.h:46,
                 from /usr/include/qt4/QtTest/QtTest:7,
                 from /usr/src/RPM/BUILD/poppler-0.61.1/qt4/tests/check_search.cpp:1:
/usr/src/RPM/BUILD/poppler-0.61.1/qt4/tests/check_search.cpp:28:112: warning: 'bool Poppler::Page::search(const QString&, QRectF&, Poppler::Page::SearchDirection, Poppler::Page::SearchMode, Poppler::Page::Rotation) const' is deprecated [-Wdeprecated-declarations]
     QCOMPARE( page->search(QString("latin1:"), pageRegion, Poppler::Page::FromTop, Poppler::Page::CaseSensitive), false );
                                                                                                                ^
/usr/include/qt4/QtTest/qtestcase.h:81:26: note: in definition of macro 'QCOMPARE'
     if (!QTest::qCompare(actual, expected, #actual, #expected, __FILE__, __LINE__))\
                          ^~~~~~
In file included from /usr/src/RPM/BUILD/poppler-0.61.1/qt4/tests/check_search.cpp:3:
/usr/src/RPM/BUILD/poppler-0.61.1/qt4/tests/../src/poppler-qt4.h:604:25: note: declared here
  Q_DECL_DEPRECATED bool search(const QString &text, QRectF &rect, SearchDirection direction, SearchMode caseSensitive, Rotation rotate = Rotate0) const;
                         ^~~~~~
In file included from /usr/include/qt4/QtTest/qtest.h:46,
                 from /usr/include/qt4/QtTest/QtTest:7,
                 from /usr/src/RPM/BUILD/poppler-0.61.1/qt4/tests/check_search.cpp:1:
/usr/src/RPM/BUILD/poppler-0.61.1/qt4/tests/check_search.cpp:30:117: warning: 'bool Poppler::Page::search(const QString&, QRectF&, Poppler::Page::SearchDirection, Poppler::Page::SearchMode, Poppler::Page::Rotation) const' is deprecated [-Wdeprecated-declarations]
     QCOMPARE( page->search(QString::fromUtf8("é"), pageRegion, Poppler::Page::FromTop, Poppler::Page::CaseSensitive), true );
                                                                                                                     ^
/usr/include/qt4/QtTest/qtestcase.h:81:26: note: in definition of macro 'QCOMPARE'
     if (!QTest::qCompare(actual, expected, #actual, #expected, __FILE__, __LINE__))\
                          ^~~~~~
In file included from /usr/src/RPM/BUILD/poppler-0.61.1/qt4/tests/check_search.cpp:3:
/usr/src/RPM/BUILD/poppler-0.61.1/qt4/tests/../src/poppler-qt4.h:604:25: note: declared here
  Q_DECL_DEPRECATED bool search(const QString &text, QRectF &rect, SearchDirection direction, SearchMode caseSensitive, Rotation rotate = Rotate0) const;
                         ^~~~~~
In file included from /usr/include/qt4/QtTest/qtest.h:46,
                 from /usr/include/qt4/QtTest/QtTest:7,
                 from /usr/src/RPM/BUILD/poppler-0.61.1/qt4/tests/check_search.cpp:1:
/usr/src/RPM/BUILD/poppler-0.61.1/qt4/tests/check_search.cpp:31:117: warning: 'bool Poppler::Page::search(const QString&, QRectF&, Poppler::Page::SearchDirection, Poppler::Page::SearchMode, Poppler::Page::Rotation) const' is deprecated [-Wdeprecated-declarations]
     QCOMPARE( page->search(QString::fromUtf8("à"), pageRegion, Poppler::Page::FromTop, Poppler::Page::CaseSensitive), true );
                                                                                                                     ^
/usr/include/qt4/QtTest/qtestcase.h:81:26: note: in definition of macro 'QCOMPARE'
     if (!QTest::qCompare(actual, expected, #actual, #expected, __FILE__, __LINE__))\
                          ^~~~~~
In file included from /usr/src/RPM/BUILD/poppler-0.61.1/qt4/tests/check_search.cpp:3:
/usr/src/RPM/BUILD/poppler-0.61.1/qt4/tests/../src/poppler-qt4.h:604:25: note: declared here
  Q_DECL_DEPRECATED bool search(const QString &text, QRectF &rect, SearchDirection direction, SearchMode caseSensitive, Rotation rotate = Rotate0) const;
                         ^~~~~~
In file included from /usr/include/qt4/QtTest/qtest.h:46,
                 from /usr/include/qt4/QtTest/QtTest:7,
                 from /usr/src/RPM/BUILD/poppler-0.61.1/qt4/tests/check_search.cpp:1:
/usr/src/RPM/BUILD/poppler-0.61.1/qt4/tests/check_search.cpp:32:117: warning: 'bool Poppler::Page::search(const QString&, QRectF&, Poppler::Page::SearchDirection, Poppler::Page::SearchMode, Poppler::Page::Rotation) const' is deprecated [-Wdeprecated-declarations]
     QCOMPARE( page->search(QString::fromUtf8("ç"), pageRegion, Poppler::Page::FromTop, Poppler::Page::CaseSensitive), true );
                                                                                                                     ^
/usr/include/qt4/QtTest/qtestcase.h:81:26: note: in definition of macro 'QCOMPARE'
     if (!QTest::qCompare(actual, expected, #actual, #expected, __FILE__, __LINE__))\
                          ^~~~~~
In file included from /usr/src/RPM/BUILD/poppler-0.61.1/qt4/tests/check_search.cpp:3:
/usr/src/RPM/BUILD/poppler-0.61.1/qt4/tests/../src/poppler-qt4.h:604:25: note: declared here
  Q_DECL_DEPRECATED bool search(const QString &text, QRectF &rect, SearchDirection direction, SearchMode caseSensitive, Rotation rotate = Rotate0) const;
                         ^~~~~~
In file included from /usr/include/qt4/QtTest/qtest.h:46,
                 from /usr/include/qt4/QtTest/QtTest:7,
                 from /usr/src/RPM/BUILD/poppler-0.61.1/qt4/tests/check_search.cpp:1:
/usr/src/RPM/BUILD/poppler-0.61.1/qt4/tests/check_search.cpp:33:146: warning: 'bool Poppler::Page::search(const QString&, QRectF&, Poppler::Page::SearchDirection, Poppler::Page::SearchMode, Poppler::Page::Rotation) const' is deprecated [-Wdeprecated-declarations]
     QCOMPARE( page->search(QString::fromUtf8("search \"é\", \"à\" or \"ç\""), pageRegion, Poppler::Page::FromTop, Poppler::Page::CaseSensitive), true );
                                                                                                                                                  ^
/usr/include/qt4/QtTest/qtestcase.h:81:26: note: in definition of macro 'QCOMPARE'
     if (!QTest::qCompare(actual, expected, #actual, #expected, __FILE__, __LINE__))\
                          ^~~~~~
In file included from /usr/src/RPM/BUILD/poppler-0.61.1/qt4/tests/check_search.cpp:3:
/usr/src/RPM/BUILD/poppler-0.61.1/qt4/tests/../src/poppler-qt4.h:604:25: note: declared here
  Q_DECL_DEPRECATED bool search(const QString &text, QRectF &rect, SearchDirection direction, SearchMode caseSensitive, Rotation rotate = Rotate0) const;
                         ^~~~~~
In file included from /usr/include/qt4/QtTest/qtest.h:46,
                 from /usr/include/qt4/QtTest/QtTest:7,
                 from /usr/src/RPM/BUILD/poppler-0.61.1/qt4/tests/check_search.cpp:1:
/usr/src/RPM/BUILD/poppler-0.61.1/qt4/tests/check_search.cpp:34:121: warning: 'bool Poppler::Page::search(const QString&, QRectF&, Poppler::Page::SearchDirection, Poppler::Page::SearchMode, Poppler::Page::Rotation) const' is deprecated [-Wdeprecated-declarations]
     QCOMPARE( page->search(QString::fromUtf8("¥µ©"), pageRegion, Poppler::Page::FromTop, Poppler::Page::CaseSensitive), true );
                                                                                                                         ^
/usr/include/qt4/QtTest/qtestcase.h:81:26: note: in definition of macro 'QCOMPARE'
     if (!QTest::qCompare(actual, expected, #actual, #expected, __FILE__, __LINE__))\
                          ^~~~~~
In file included from /usr/src/RPM/BUILD/poppler-0.61.1/qt4/tests/check_search.cpp:3:
/usr/src/RPM/BUILD/poppler-0.61.1/qt4/tests/../src/poppler-qt4.h:604:25: note: declared here
  Q_DECL_DEPRECATED bool search(const QString &text, QRectF &rect, SearchDirection direction, SearchMode caseSensitive, Rotation rotate = Rotate0) const;
                         ^~~~~~
In file included from /usr/include/qt4/QtTest/qtest.h:46,
                 from /usr/include/qt4/QtTest/QtTest:7,
                 from /usr/src/RPM/BUILD/poppler-0.61.1/qt4/tests/check_search.cpp:1:
/usr/src/RPM/BUILD/poppler-0.61.1/qt4/tests/check_search.cpp:35:119: warning: 'bool Poppler::Page::search(const QString&, QRectF&, Poppler::Page::SearchDirection, Poppler::Page::SearchMode, Poppler::Page::Rotation) const' is deprecated [-Wdeprecated-declarations]
     QCOMPARE( page->search(QString::fromUtf8("¥©"), pageRegion, Poppler::Page::FromTop, Poppler::Page::CaseSensitive), false );
                                                                                                                       ^
/usr/include/qt4/QtTest/qtestcase.h:81:26: note: in definition of macro 'QCOMPARE'
     if (!QTest::qCompare(actual, expected, #actual, #expected, __FILE__, __LINE__))\
                          ^~~~~~
In file included from /usr/src/RPM/BUILD/poppler-0.61.1/qt4/tests/check_search.cpp:3:
/usr/src/RPM/BUILD/poppler-0.61.1/qt4/tests/../src/poppler-qt4.h:604:25: note: declared here
  Q_DECL_DEPRECATED bool search(const QString &text, QRectF &rect, SearchDirection direction, SearchMode caseSensitive, Rotation rotate = Rotate0) const;
                         ^~~~~~
In file included from /usr/include/qt4/QtTest/qtest.h:46,
                 from /usr/include/qt4/QtTest/QtTest:7,
                 from /usr/src/RPM/BUILD/poppler-0.61.1/qt4/tests/check_search.cpp:1:
/usr/src/RPM/BUILD/poppler-0.61.1/qt4/tests/check_search.cpp: In member function 'void TestSearch::testNextAndPrevious()':
/usr/src/RPM/BUILD/poppler-0.61.1/qt4/tests/check_search.cpp:64:103: warning: 'bool Poppler::Page::search(const QString&, QRectF&, Poppler::Page::SearchDirection, Poppler::Page::SearchMode, Poppler::Page::Rotation) const' is deprecated [-Wdeprecated-declarations]
     QCOMPARE( page->search(QString("is"), region, Poppler::Page::FromTop, Poppler::Page::CaseSensitive), true );
                                                                                                       ^
/usr/include/qt4/QtTest/qtestcase.h:81:26: note: in definition of macro 'QCOMPARE'
     if (!QTest::qCompare(actual, expected, #actual, #expected, __FILE__, __LINE__))\
                          ^~~~~~
In file included from /usr/src/RPM/BUILD/poppler-0.61.1/qt4/tests/check_search.cpp:3:
/usr/src/RPM/BUILD/poppler-0.61.1/qt4/tests/../src/poppler-qt4.h:604:25: note: declared here
  Q_DECL_DEPRECATED bool search(const QString &text, QRectF &rect, SearchDirection direction, SearchMode caseSensitive, Rotation rotate = Rotate0) const;
                         ^~~~~~
In file included from /usr/include/qt4/QtTest/qtest.h:46,
                 from /usr/include/qt4/QtTest/QtTest:7,
                 from /usr/src/RPM/BUILD/poppler-0.61.1/qt4/tests/check_search.cpp:1:
/usr/src/RPM/BUILD/poppler-0.61.1/qt4/tests/check_search.cpp:69:106: warning: 'bool Poppler::Page::search(const QString&, QRectF&, Poppler::Page::SearchDirection, Poppler::Page::SearchMode, Poppler::Page::Rotation) const' is deprecated [-Wdeprecated-declarations]
     QCOMPARE( page->search(QString("is"), region, Poppler::Page::NextResult, Poppler::Page::CaseSensitive), true );
                                                                                                          ^
/usr/include/qt4/QtTest/qtestcase.h:81:26: note: in definition of macro 'QCOMPARE'
     if (!QTest::qCompare(actual, expected, #actual, #expected, __FILE__, __LINE__))\
                          ^~~~~~
In file included from /usr/src/RPM/BUILD/poppler-0.61.1/qt4/tests/check_search.cpp:3:
/usr/src/RPM/BUILD/poppler-0.61.1/qt4/tests/../src/poppler-qt4.h:604:25: note: declared here
  Q_DECL_DEPRECATED bool search(const QString &text, QRectF &rect, SearchDirection direction, SearchMode caseSensitive, Rotation rotate = Rotate0) const;
                         ^~~~~~
In file included from /usr/include/qt4/QtTest/qtest.h:46,
                 from /usr/include/qt4/QtTest/QtTest:7,
                 from /usr/src/RPM/BUILD/poppler-0.61.1/qt4/tests/check_search.cpp:1:
/usr/src/RPM/BUILD/poppler-0.61.1/qt4/tests/check_search.cpp:74:106: warning: 'bool Poppler::Page::search(const QString&, QRectF&, Poppler::Page::SearchDirection, Poppler::Page::SearchMode, Poppler::Page::Rotation) const' is deprecated [-Wdeprecated-declarations]
     QCOMPARE( page->search(QString("is"), region, Poppler::Page::NextResult, Poppler::Page::CaseSensitive), true );
                                                                                                          ^
/usr/include/qt4/QtTest/qtestcase.h:81:26: note: in definition of macro 'QCOMPARE'
     if (!QTest::qCompare(actual, expected, #actual, #expected, __FILE__, __LINE__))\
                          ^~~~~~
In file included from /usr/src/RPM/BUILD/poppler-0.61.1/qt4/tests/check_search.cpp:3:
/usr/src/RPM/BUILD/poppler-0.61.1/qt4/tests/../src/poppler-qt4.h:604:25: note: declared here
  Q_DECL_DEPRECATED bool search(const QString &text, QRectF &rect, SearchDirection direction, SearchMode caseSensitive, Rotation rotate = Rotate0) const;
                         ^~~~~~
In file included from /usr/include/qt4/QtTest/qtest.h:46,
                 from /usr/include/qt4/QtTest/QtTest:7,
                 from /usr/src/RPM/BUILD/poppler-0.61.1/qt4/tests/check_search.cpp:1:
/usr/src/RPM/BUILD/poppler-0.61.1/qt4/tests/check_search.cpp:79:106: warning: 'bool Poppler::Page::search(const QString&, QRectF&, Poppler::Page::SearchDirection, Poppler::Page::SearchMode, Poppler::Page::Rotation) const' is deprecated [-Wdeprecated-declarations]
     QCOMPARE( page->search(QString("is"), region, Poppler::Page::NextResult, Poppler::Page::CaseSensitive), true );
                                                                                                          ^
/usr/include/qt4/QtTest/qtestcase.h:81:26: note: in definition of macro 'QCOMPARE'
     if (!QTest::qCompare(actual, expected, #actual, #expected, __FILE__, __LINE__))\
                          ^~~~~~
In file included from /usr/src/RPM/BUILD/poppler-0.61.1/qt4/tests/check_search.cpp:3:
/usr/src/RPM/BUILD/poppler-0.61.1/qt4/tests/../src/poppler-qt4.h:604:25: note: declared here
  Q_DECL_DEPRECATED bool search(const QString &text, QRectF &rect, SearchDirection direction, SearchMode caseSensitive, Rotation rotate = Rotate0) const;
                         ^~~~~~
In file included from /usr/include/qt4/QtTest/qtest.h:46,
                 from /usr/include/qt4/QtTest/QtTest:7,
                 from /usr/src/RPM/BUILD/poppler-0.61.1/qt4/tests/check_search.cpp:1:
/usr/src/RPM/BUILD/poppler-0.61.1/qt4/tests/check_search.cpp:84:106: warning: 'bool Poppler::Page::search(const QString&, QRectF&, Poppler::Page::SearchDirection, Poppler::Page::SearchMode, Poppler::Page::Rotation) const' is deprecated [-Wdeprecated-declarations]
     QCOMPARE( page->search(QString("is"), region, Poppler::Page::NextResult, Poppler::Page::CaseSensitive), false );
                                                                                                          ^
/usr/include/qt4/QtTest/qtestcase.h:81:26: note: in definition of macro 'QCOMPARE'
     if (!QTest::qCompare(actual, expected, #actual, #expected, __FILE__, __LINE__))\
                          ^~~~~~
In file included from /usr/src/RPM/BUILD/poppler-0.61.1/qt4/tests/check_search.cpp:3:
/usr/src/RPM/BUILD/poppler-0.61.1/qt4/tests/../src/poppler-qt4.h:604:25: note: declared here
  Q_DECL_DEPRECATED bool search(const QString &text, QRectF &rect, SearchDirection direction, SearchMode caseSensitive, Rotation rotate = Rotate0) const;
                         ^~~~~~
In file included from /usr/include/qt4/QtTest/qtest.h:46,
                 from /usr/include/qt4/QtTest/QtTest:7,
                 from /usr/src/RPM/BUILD/poppler-0.61.1/qt4/tests/check_search.cpp:1:
/usr/src/RPM/BUILD/poppler-0.61.1/qt4/tests/check_search.cpp:85:110: warning: 'bool Poppler::Page::search(const QString&, QRectF&, Poppler::Page::SearchDirection, Poppler::Page::SearchMode, Poppler::Page::Rotation) const' is deprecated [-Wdeprecated-declarations]
     QCOMPARE( page->search(QString("is"), region, Poppler::Page::PreviousResult, Poppler::Page::CaseSensitive), true );
                                                                                                              ^
/usr/include/qt4/QtTest/qtestcase.h:81:26: note: in definition of macro 'QCOMPARE'
     if (!QTest::qCompare(actual, expected, #actual, #expected, __FILE__, __LINE__))\
                          ^~~~~~
In file included from /usr/src/RPM/BUILD/poppler-0.61.1/qt4/tests/check_search.cpp:3:
/usr/src/RPM/BUILD/poppler-0.61.1/qt4/tests/../src/poppler-qt4.h:604:25: note: declared here
  Q_DECL_DEPRECATED bool search(const QString &text, QRectF &rect, SearchDirection direction, SearchMode caseSensitive, Rotation rotate = Rotate0) const;
                         ^~~~~~
In file included from /usr/include/qt4/QtTest/qtest.h:46,
                 from /usr/include/qt4/QtTest/QtTest:7,
                 from /usr/src/RPM/BUILD/poppler-0.61.1/qt4/tests/check_search.cpp:1:
/usr/src/RPM/BUILD/poppler-0.61.1/qt4/tests/check_search.cpp:90:110: warning: 'bool Poppler::Page::search(const QString&, QRectF&, Poppler::Page::SearchDirection, Poppler::Page::SearchMode, Poppler::Page::Rotation) const' is deprecated [-Wdeprecated-declarations]
     QCOMPARE( page->search(QString("is"), region, Poppler::Page::PreviousResult, Poppler::Page::CaseSensitive), true );
                                                                                                              ^
/usr/include/qt4/QtTest/qtestcase.h:81:26: note: in definition of macro 'QCOMPARE'
     if (!QTest::qCompare(actual, expected, #actual, #expected, __FILE__, __LINE__))\
                          ^~~~~~
In file included from /usr/src/RPM/BUILD/poppler-0.61.1/qt4/tests/check_search.cpp:3:
/usr/src/RPM/BUILD/poppler-0.61.1/qt4/tests/../src/poppler-qt4.h:604:25: note: declared here
  Q_DECL_DEPRECATED bool search(const QString &text, QRectF &rect, SearchDirection direction, SearchMode caseSensitive, Rotation rotate = Rotate0) const;
                         ^~~~~~
In file included from /usr/include/qt4/QtTest/qtest.h:46,
                 from /usr/include/qt4/QtTest/QtTest:7,
                 from /usr/src/RPM/BUILD/poppler-0.61.1/qt4/tests/check_search.cpp:1:
/usr/src/RPM/BUILD/poppler-0.61.1/qt4/tests/check_search.cpp:95:110: warning: 'bool Poppler::Page::search(const QString&, QRectF&, Poppler::Page::SearchDirection, Poppler::Page::SearchMode, Poppler::Page::Rotation) const' is deprecated [-Wdeprecated-declarations]
     QCOMPARE( page->search(QString("is"), region, Poppler::Page::PreviousResult, Poppler::Page::CaseSensitive), true );
                                                                                                              ^
/usr/include/qt4/QtTest/qtestcase.h:81:26: note: in definition of macro 'QCOMPARE'
     if (!QTest::qCompare(actual, expected, #actual, #expected, __FILE__, __LINE__))\
                          ^~~~~~
In file included from /usr/src/RPM/BUILD/poppler-0.61.1/qt4/tests/check_search.cpp:3:
/usr/src/RPM/BUILD/poppler-0.61.1/qt4/tests/../src/poppler-qt4.h:604:25: note: declared here
  Q_DECL_DEPRECATED bool search(const QString &text, QRectF &rect, SearchDirection direction, SearchMode caseSensitive, Rotation rotate = Rotate0) const;
                         ^~~~~~
In file included from /usr/include/qt4/QtTest/qtest.h:46,
                 from /usr/include/qt4/QtTest/QtTest:7,
                 from /usr/src/RPM/BUILD/poppler-0.61.1/qt4/tests/check_search.cpp:1:
/usr/src/RPM/BUILD/poppler-0.61.1/qt4/tests/check_search.cpp:100:110: warning: 'bool Poppler::Page::search(const QString&, QRectF&, Poppler::Page::SearchDirection, Poppler::Page::SearchMode, Poppler::Page::Rotation) const' is deprecated [-Wdeprecated-declarations]
     QCOMPARE( page->search(QString("is"), region, Poppler::Page::PreviousResult, Poppler::Page::CaseSensitive), false );
                                                                                                              ^
/usr/include/qt4/QtTest/qtestcase.h:81:26: note: in definition of macro 'QCOMPARE'
     if (!QTest::qCompare(actual, expected, #actual, #expected, __FILE__, __LINE__))\
                          ^~~~~~
In file included from /usr/src/RPM/BUILD/poppler-0.61.1/qt4/tests/check_search.cpp:3:
/usr/src/RPM/BUILD/poppler-0.61.1/qt4/tests/../src/poppler-qt4.h:604:25: note: declared here
  Q_DECL_DEPRECATED bool search(const QString &text, QRectF &rect, SearchDirection direction, SearchMode caseSensitive, Rotation rotate = Rotate0) const;
                         ^~~~~~
make[2]: Leaving directory '/usr/src/RPM/BUILD/poppler-0.61.1/BUILD'
make[2]: Entering directory '/usr/src/RPM/BUILD/poppler-0.61.1/BUILD'
[ 68%] Linking CXX executable check_qt4_pagelabelinfo
make[2]: Leaving directory '/usr/src/RPM/BUILD/poppler-0.61.1/BUILD'
make[1]: Entering directory '/usr/src/RPM/BUILD/poppler-0.61.1/BUILD'
[ 69%] Built target check_qt4_pagelabelinfo
make[1]: Leaving directory '/usr/src/RPM/BUILD/poppler-0.61.1/BUILD'
make[2]: Entering directory '/usr/src/RPM/BUILD/poppler-0.61.1/BUILD'
Scanning dependencies of target test-render-to-file-qt4
make[2]: Leaving directory '/usr/src/RPM/BUILD/poppler-0.61.1/BUILD'
make[2]: Entering directory '/usr/src/RPM/BUILD/poppler-0.61.1/BUILD'
[ 67%] Building CXX object qt4/tests/CMakeFiles/poppler-qt4-forms.dir/poppler-forms.cpp.o
make[2]: Leaving directory '/usr/src/RPM/BUILD/poppler-0.61.1/BUILD'
make[2]: Entering directory '/usr/src/RPM/BUILD/poppler-0.61.1/BUILD'
[ 70%] Linking CXX executable poppler-qt4-forms
make[2]: Leaving directory '/usr/src/RPM/BUILD/poppler-0.61.1/BUILD'
make[1]: Entering directory '/usr/src/RPM/BUILD/poppler-0.61.1/BUILD'
[ 70%] Built target poppler-qt4-forms
make[1]: Leaving directory '/usr/src/RPM/BUILD/poppler-0.61.1/BUILD'
make[2]: Entering directory '/usr/src/RPM/BUILD/poppler-0.61.1/BUILD'
[ 68%] Linking CXX executable check_qt4_strings
make[2]: Leaving directory '/usr/src/RPM/BUILD/poppler-0.61.1/BUILD'
make[2]: Entering directory '/usr/src/RPM/BUILD/poppler-0.61.1/BUILD'
Scanning dependencies of target test-password-qt4
make[2]: Leaving directory '/usr/src/RPM/BUILD/poppler-0.61.1/BUILD'
make[1]: Entering directory '/usr/src/RPM/BUILD/poppler-0.61.1/BUILD'
[ 70%] Built target check_qt4_strings
make[1]: Leaving directory '/usr/src/RPM/BUILD/poppler-0.61.1/BUILD'
make[2]: Entering directory '/usr/src/RPM/BUILD/poppler-0.61.1/BUILD'
Scanning dependencies of target stress-poppler-qt4
make[2]: Leaving directory '/usr/src/RPM/BUILD/poppler-0.61.1/BUILD'
make[2]: Entering directory '/usr/src/RPM/BUILD/poppler-0.61.1/BUILD'
[ 69%] Linking CXX executable check_qt4_search
make[2]: Leaving directory '/usr/src/RPM/BUILD/poppler-0.61.1/BUILD'
make[1]: Entering directory '/usr/src/RPM/BUILD/poppler-0.61.1/BUILD'
[ 71%] Built target check_qt4_search
make[1]: Leaving directory '/usr/src/RPM/BUILD/poppler-0.61.1/BUILD'
make[2]: Entering directory '/usr/src/RPM/BUILD/poppler-0.61.1/BUILD'
Scanning dependencies of target stress-poppler-dir-qt4
make[2]: Leaving directory '/usr/src/RPM/BUILD/poppler-0.61.1/BUILD'
make[2]: Entering directory '/usr/src/RPM/BUILD/poppler-0.61.1/BUILD'
[ 67%] Building CXX object qt4/tests/CMakeFiles/test-poppler-qt4.dir/test-poppler-qt4.cpp.o
make[2]: Leaving directory '/usr/src/RPM/BUILD/poppler-0.61.1/BUILD'
make[2]: Entering directory '/usr/src/RPM/BUILD/poppler-0.61.1/BUILD'
[ 69%] Building CXX object qt4/tests/CMakeFiles/test-render-to-file-qt4.dir/test-render-to-file.cpp.o
make[2]: Leaving directory '/usr/src/RPM/BUILD/poppler-0.61.1/BUILD'
make[2]: Entering directory '/usr/src/RPM/BUILD/poppler-0.61.1/BUILD'
[ 70%] Building CXX object qt4/tests/CMakeFiles/test-password-qt4.dir/test-password-qt4.cpp.o
make[2]: Leaving directory '/usr/src/RPM/BUILD/poppler-0.61.1/BUILD'
make[2]: Entering directory '/usr/src/RPM/BUILD/poppler-0.61.1/BUILD'
[ 73%] Linking CXX executable test-poppler-qt4
make[2]: Leaving directory '/usr/src/RPM/BUILD/poppler-0.61.1/BUILD'
make[1]: Entering directory '/usr/src/RPM/BUILD/poppler-0.61.1/BUILD'
[ 75%] Built target test-poppler-qt4
make[1]: Leaving directory '/usr/src/RPM/BUILD/poppler-0.61.1/BUILD'
make[2]: Entering directory '/usr/src/RPM/BUILD/poppler-0.61.1/BUILD'
[ 75%] Linking CXX executable test-password-qt4
make[2]: Leaving directory '/usr/src/RPM/BUILD/poppler-0.61.1/BUILD'
make[1]: Entering directory '/usr/src/RPM/BUILD/poppler-0.61.1/BUILD'
[ 75%] Built target test-password-qt4
make[1]: Leaving directory '/usr/src/RPM/BUILD/poppler-0.61.1/BUILD'
make[2]: Entering directory '/usr/src/RPM/BUILD/poppler-0.61.1/BUILD'
Scanning dependencies of target stress-threads-qt4
make[2]: Leaving directory '/usr/src/RPM/BUILD/poppler-0.61.1/BUILD'
make[2]: Entering directory '/usr/src/RPM/BUILD/poppler-0.61.1/BUILD'
[ 74%] Linking CXX executable test-render-to-file-qt4
make[2]: Leaving directory '/usr/src/RPM/BUILD/poppler-0.61.1/BUILD'
make[1]: Entering directory '/usr/src/RPM/BUILD/poppler-0.61.1/BUILD'
[ 76%] Built target test-render-to-file-qt4
make[1]: Leaving directory '/usr/src/RPM/BUILD/poppler-0.61.1/BUILD'
make[2]: Entering directory '/usr/src/RPM/BUILD/poppler-0.61.1/BUILD'
Scanning dependencies of target poppler-qt4-texts
make[2]: Leaving directory '/usr/src/RPM/BUILD/poppler-0.61.1/BUILD'
make[2]: Entering directory '/usr/src/RPM/BUILD/poppler-0.61.1/BUILD'
[ 76%] Generating check_permissions.moc
make[2]: Leaving directory '/usr/src/RPM/BUILD/poppler-0.61.1/BUILD'
make[2]: Entering directory '/usr/src/RPM/BUILD/poppler-0.61.1/BUILD'
Scanning dependencies of target check_qt4_permissions
make[2]: Leaving directory '/usr/src/RPM/BUILD/poppler-0.61.1/BUILD'
make[2]: Entering directory '/usr/src/RPM/BUILD/poppler-0.61.1/BUILD'
[ 71%] Building CXX object qt4/tests/CMakeFiles/stress-poppler-qt4.dir/stress-poppler-qt4.cpp.o
make[2]: Leaving directory '/usr/src/RPM/BUILD/poppler-0.61.1/BUILD'
make[2]: Entering directory '/usr/src/RPM/BUILD/poppler-0.61.1/BUILD'
[ 72%] Building CXX object qt4/tests/CMakeFiles/stress-poppler-dir-qt4.dir/stress-poppler-dir.cpp.o
make[2]: Leaving directory '/usr/src/RPM/BUILD/poppler-0.61.1/BUILD'
make[2]: Entering directory '/usr/src/RPM/BUILD/poppler-0.61.1/BUILD'
[ 67%] Building CXX object qt4/tests/CMakeFiles/check_qt4_metadata.dir/check_metadata.cpp.o
In file included from /usr/include/qt4/QtTest/qtest.h:46,
                 from /usr/include/qt4/QtTest/QtTest:7,
                 from /usr/src/RPM/BUILD/poppler-0.61.1/qt4/tests/check_metadata.cpp:1:
/usr/src/RPM/BUILD/poppler-0.61.1/qt4/tests/check_metadata.cpp: In member function 'void TestMetaData::checkVersion()':
/usr/src/RPM/BUILD/poppler-0.61.1/qt4/tests/check_metadata.cpp:216:31: warning: 'double Poppler::Document::pdfVersion() const' is deprecated [-Wdeprecated-declarations]
     QCOMPARE( doc->pdfVersion(), 1.6 );
                               ^
/usr/include/qt4/QtTest/qtestcase.h:81:26: note: in definition of macro 'QCOMPARE'
     if (!QTest::qCompare(actual, expected, #actual, #expected, __FILE__, __LINE__))\
                          ^~~~~~
In file included from /usr/src/RPM/BUILD/poppler-0.61.1/qt4/tests/check_metadata.cpp:3:
/usr/src/RPM/BUILD/poppler-0.61.1/qt4/tests/../src/poppler-qt4.h:1311:27: note: declared here
  Q_DECL_DEPRECATED double pdfVersion() const;
                           ^~~~~~~~~~
make[2]: Leaving directory '/usr/src/RPM/BUILD/poppler-0.61.1/BUILD'
make[2]: Entering directory '/usr/src/RPM/BUILD/poppler-0.61.1/BUILD'
[ 76%] Linking CXX executable stress-poppler-qt4
make[2]: Leaving directory '/usr/src/RPM/BUILD/poppler-0.61.1/BUILD'
make[1]: Entering directory '/usr/src/RPM/BUILD/poppler-0.61.1/BUILD'
[ 77%] Built target stress-poppler-qt4
make[1]: Leaving directory '/usr/src/RPM/BUILD/poppler-0.61.1/BUILD'
make[2]: Entering directory '/usr/src/RPM/BUILD/poppler-0.61.1/BUILD'
[ 67%] Building CXX object qt4/tests/CMakeFiles/check_qt4_fonts.dir/check_fonts.cpp.o
/usr/src/RPM/BUILD/poppler-0.61.1/qt4/tests/check_fonts.cpp: In member function 'void TestFontsData::checkScanForFonts()':
/usr/src/RPM/BUILD/poppler-0.61.1/qt4/tests/check_fonts.cpp:231:45: warning: 'bool Poppler::Document::scanForFonts(int, QList<Poppler::FontInfo>*) const' is deprecated [-Wdeprecated-declarations]
         doc->scanForFonts( 1, &listOfFonts2 );
                                             ^
In file included from /usr/src/RPM/BUILD/poppler-0.61.1/qt4/tests/check_fonts.cpp:3:
/usr/src/RPM/BUILD/poppler-0.61.1/qt4/tests/../src/poppler-qt4.h:1357:25: note: declared here
  Q_DECL_DEPRECATED bool scanForFonts( int numPages, QList<FontInfo> *fontList ) const;
                         ^~~~~~~~~~~~
/usr/src/RPM/BUILD/poppler-0.61.1/qt4/tests/check_fonts.cpp:239:45: warning: 'bool Poppler::Document::scanForFonts(int, QList<Poppler::FontInfo>*) const' is deprecated [-Wdeprecated-declarations]
         doc->scanForFonts( 1, &listOfFonts3 );
                                             ^
In file included from /usr/src/RPM/BUILD/poppler-0.61.1/qt4/tests/check_fonts.cpp:3:
/usr/src/RPM/BUILD/poppler-0.61.1/qt4/tests/../src/poppler-qt4.h:1357:25: note: declared here
  Q_DECL_DEPRECATED bool scanForFonts( int numPages, QList<FontInfo> *fontList ) const;
                         ^~~~~~~~~~~~
make[2]: Leaving directory '/usr/src/RPM/BUILD/poppler-0.61.1/BUILD'
make[2]: Entering directory '/usr/src/RPM/BUILD/poppler-0.61.1/BUILD'
[ 77%] Generating check_pagemode.moc
make[2]: Leaving directory '/usr/src/RPM/BUILD/poppler-0.61.1/BUILD'
make[2]: Entering directory '/usr/src/RPM/BUILD/poppler-0.61.1/BUILD'
Scanning dependencies of target check_qt4_pagemode
make[2]: Leaving directory '/usr/src/RPM/BUILD/poppler-0.61.1/BUILD'
make[2]: Entering directory '/usr/src/RPM/BUILD/poppler-0.61.1/BUILD'
[ 76%] Linking CXX executable stress-poppler-dir-qt4
make[2]: Leaving directory '/usr/src/RPM/BUILD/poppler-0.61.1/BUILD'
make[2]: Entering directory '/usr/src/RPM/BUILD/poppler-0.61.1/BUILD'
[ 77%] Linking CXX executable check_qt4_metadata
make[2]: Leaving directory '/usr/src/RPM/BUILD/poppler-0.61.1/BUILD'
make[1]: Entering directory '/usr/src/RPM/BUILD/poppler-0.61.1/BUILD'
[ 78%] Built target stress-poppler-dir-qt4
make[1]: Leaving directory '/usr/src/RPM/BUILD/poppler-0.61.1/BUILD'
make[1]: Entering directory '/usr/src/RPM/BUILD/poppler-0.61.1/BUILD'
[ 78%] Built target check_qt4_metadata
make[1]: Leaving directory '/usr/src/RPM/BUILD/poppler-0.61.1/BUILD'
make[2]: Entering directory '/usr/src/RPM/BUILD/poppler-0.61.1/BUILD'
Scanning dependencies of target poppler-qt4-attachments
make[2]: Leaving directory '/usr/src/RPM/BUILD/poppler-0.61.1/BUILD'
make[2]: Entering directory '/usr/src/RPM/BUILD/poppler-0.61.1/BUILD'
[ 80%] Generating check_pagelayout.moc
make[2]: Leaving directory '/usr/src/RPM/BUILD/poppler-0.61.1/BUILD'
make[2]: Entering directory '/usr/src/RPM/BUILD/poppler-0.61.1/BUILD'
Scanning dependencies of target check_qt4_pagelayout
make[2]: Leaving directory '/usr/src/RPM/BUILD/poppler-0.61.1/BUILD'
make[2]: Entering directory '/usr/src/RPM/BUILD/poppler-0.61.1/BUILD'
[ 68%] Building CXX object qt4/tests/CMakeFiles/check_qt4_optcontent.dir/check_optcontent.cpp.o
make[2]: Leaving directory '/usr/src/RPM/BUILD/poppler-0.61.1/BUILD'
make[2]: Entering directory '/usr/src/RPM/BUILD/poppler-0.61.1/BUILD'
[ 81%] Linking CXX executable check_qt4_optcontent
make[2]: Leaving directory '/usr/src/RPM/BUILD/poppler-0.61.1/BUILD'
make[1]: Entering directory '/usr/src/RPM/BUILD/poppler-0.61.1/BUILD'
[ 81%] Built target check_qt4_optcontent
make[1]: Leaving directory '/usr/src/RPM/BUILD/poppler-0.61.1/BUILD'
make[2]: Entering directory '/usr/src/RPM/BUILD/poppler-0.61.1/BUILD'
[ 76%] Building CXX object qt4/tests/CMakeFiles/stress-threads-qt4.dir/stress-threads-qt4.cpp.o
/usr/src/RPM/BUILD/poppler-0.61.1/qt4/tests/stress-threads-qt4.cpp: In member function 'virtual void CrazyThread::run()':
/usr/src/RPM/BUILD/poppler-0.61.1/qt4/tests/stress-threads-qt4.cpp:117:61: warning: 'QList<QRectF> Poppler::Page::search(const QString&, Poppler::Page::SearchMode, Poppler::Page::Rotation) const' is deprecated [-Wdeprecated-declarations]
             page->search("c", Poppler::Page::CaseInsensitive);
                                                             ^
In file included from /usr/src/RPM/BUILD/poppler-0.61.1/qt4/tests/stress-threads-qt4.cpp:10:
/usr/src/RPM/BUILD/poppler-0.61.1/qt4/tests/../src/poppler-qt4.h:644:41: note: declared here
         Q_DECL_DEPRECATED QList<QRectF> search(const QString &text, SearchMode caseSensitive, Rotation rotate = Rotate0) const;
                                         ^~~~~~
/usr/src/RPM/BUILD/poppler-0.61.1/qt4/tests/stress-threads-qt4.cpp:118:59: warning: 'QList<QRectF> Poppler::Page::search(const QString&, Poppler::Page::SearchMode, Poppler::Page::Rotation) const' is deprecated [-Wdeprecated-declarations]
             page->search("r", Poppler::Page::CaseSensitive);
                                                           ^
In file included from /usr/src/RPM/BUILD/poppler-0.61.1/qt4/tests/stress-threads-qt4.cpp:10:
/usr/src/RPM/BUILD/poppler-0.61.1/qt4/tests/../src/poppler-qt4.h:644:41: note: declared here
         Q_DECL_DEPRECATED QList<QRectF> search(const QString &text, SearchMode caseSensitive, Rotation rotate = Rotate0) const;
                                         ^~~~~~
/usr/src/RPM/BUILD/poppler-0.61.1/qt4/tests/stress-threads-qt4.cpp:119:61: warning: 'QList<QRectF> Poppler::Page::search(const QString&, Poppler::Page::SearchMode, Poppler::Page::Rotation) const' is deprecated [-Wdeprecated-declarations]
             page->search("a", Poppler::Page::CaseInsensitive);
                                                             ^
In file included from /usr/src/RPM/BUILD/poppler-0.61.1/qt4/tests/stress-threads-qt4.cpp:10:
/usr/src/RPM/BUILD/poppler-0.61.1/qt4/tests/../src/poppler-qt4.h:644:41: note: declared here
         Q_DECL_DEPRECATED QList<QRectF> search(const QString &text, SearchMode caseSensitive, Rotation rotate = Rotate0) const;
                                         ^~~~~~
/usr/src/RPM/BUILD/poppler-0.61.1/qt4/tests/stress-threads-qt4.cpp:120:59: warning: 'QList<QRectF> Poppler::Page::search(const QString&, Poppler::Page::SearchMode, Poppler::Page::Rotation) const' is deprecated [-Wdeprecated-declarations]
             page->search("z", Poppler::Page::CaseSensitive);
                                                           ^
In file included from /usr/src/RPM/BUILD/poppler-0.61.1/qt4/tests/stress-threads-qt4.cpp:10:
/usr/src/RPM/BUILD/poppler-0.61.1/qt4/tests/../src/poppler-qt4.h:644:41: note: declared here
         Q_DECL_DEPRECATED QList<QRectF> search(const QString &text, SearchMode caseSensitive, Rotation rotate = Rotate0) const;
                                         ^~~~~~
/usr/src/RPM/BUILD/poppler-0.61.1/qt4/tests/stress-threads-qt4.cpp:121:61: warning: 'QList<QRectF> Poppler::Page::search(const QString&, Poppler::Page::SearchMode, Poppler::Page::Rotation) const' is deprecated [-Wdeprecated-declarations]
             page->search("y", Poppler::Page::CaseInsensitive);
                                                             ^
In file included from /usr/src/RPM/BUILD/poppler-0.61.1/qt4/tests/stress-threads-qt4.cpp:10:
/usr/src/RPM/BUILD/poppler-0.61.1/qt4/tests/../src/poppler-qt4.h:644:41: note: declared here
         Q_DECL_DEPRECATED QList<QRectF> search(const QString &text, SearchMode caseSensitive, Rotation rotate = Rotate0) const;
                                         ^~~~~~
make[2]: Leaving directory '/usr/src/RPM/BUILD/poppler-0.61.1/BUILD'
make[2]: Entering directory '/usr/src/RPM/BUILD/poppler-0.61.1/BUILD'
[ 76%] Building CXX object qt4/tests/CMakeFiles/poppler-qt4-texts.dir/poppler-texts.cpp.o
make[2]: Leaving directory '/usr/src/RPM/BUILD/poppler-0.61.1/BUILD'
make[2]: Entering directory '/usr/src/RPM/BUILD/poppler-0.61.1/BUILD'
[ 78%] Linking CXX executable check_qt4_fonts
make[2]: Leaving directory '/usr/src/RPM/BUILD/poppler-0.61.1/BUILD'
make[1]: Entering directory '/usr/src/RPM/BUILD/poppler-0.61.1/BUILD'
[ 82%] Built target check_qt4_fonts
make[1]: Leaving directory '/usr/src/RPM/BUILD/poppler-0.61.1/BUILD'
make[2]: Entering directory '/usr/src/RPM/BUILD/poppler-0.61.1/BUILD'
[ 82%] Generating check_attachments.moc
make[2]: Leaving directory '/usr/src/RPM/BUILD/poppler-0.61.1/BUILD'
make[2]: Entering directory '/usr/src/RPM/BUILD/poppler-0.61.1/BUILD'
[ 84%] Generating check_links.moc
make[2]: Leaving directory '/usr/src/RPM/BUILD/poppler-0.61.1/BUILD'
make[2]: Entering directory '/usr/src/RPM/BUILD/poppler-0.61.1/BUILD'
Scanning dependencies of target check_qt4_links
make[2]: Leaving directory '/usr/src/RPM/BUILD/poppler-0.61.1/BUILD'
make[2]: Entering directory '/usr/src/RPM/BUILD/poppler-0.61.1/BUILD'
[ 76%] Building CXX object qt4/tests/CMakeFiles/check_qt4_permissions.dir/check_permissions.cpp.o
make[2]: Leaving directory '/usr/src/RPM/BUILD/poppler-0.61.1/BUILD'
make[2]: Entering directory '/usr/src/RPM/BUILD/poppler-0.61.1/BUILD'
Scanning dependencies of target check_qt4_attachments
make[2]: Leaving directory '/usr/src/RPM/BUILD/poppler-0.61.1/BUILD'
make[2]: Entering directory '/usr/src/RPM/BUILD/poppler-0.61.1/BUILD'
[ 79%] Building CXX object qt4/tests/CMakeFiles/check_qt4_pagemode.dir/check_pagemode.cpp.o
make[2]: Leaving directory '/usr/src/RPM/BUILD/poppler-0.61.1/BUILD'
make[2]: Entering directory '/usr/src/RPM/BUILD/poppler-0.61.1/BUILD'
[ 85%] Linking CXX executable check_qt4_permissions
make[2]: Leaving directory '/usr/src/RPM/BUILD/poppler-0.61.1/BUILD'
make[1]: Entering directory '/usr/src/RPM/BUILD/poppler-0.61.1/BUILD'
[ 86%] Built target check_qt4_permissions
make[1]: Leaving directory '/usr/src/RPM/BUILD/poppler-0.61.1/BUILD'
make[2]: Entering directory '/usr/src/RPM/BUILD/poppler-0.61.1/BUILD'
[ 87%] Generating check_dateConversion.moc
make[2]: Leaving directory '/usr/src/RPM/BUILD/poppler-0.61.1/BUILD'
make[2]: Entering directory '/usr/src/RPM/BUILD/poppler-0.61.1/BUILD'
Scanning dependencies of target check_qt4_dateConversion
make[2]: Leaving directory '/usr/src/RPM/BUILD/poppler-0.61.1/BUILD'
make[2]: Entering directory '/usr/src/RPM/BUILD/poppler-0.61.1/BUILD'
[ 82%] Linking CXX executable stress-threads-qt4
make[2]: Leaving directory '/usr/src/RPM/BUILD/poppler-0.61.1/BUILD'
make[1]: Entering directory '/usr/src/RPM/BUILD/poppler-0.61.1/BUILD'
[ 87%] Built target stress-threads-qt4
make[1]: Leaving directory '/usr/src/RPM/BUILD/poppler-0.61.1/BUILD'
make[2]: Entering directory '/usr/src/RPM/BUILD/poppler-0.61.1/BUILD'
[ 86%] Linking CXX executable check_qt4_pagemode
make[2]: Leaving directory '/usr/src/RPM/BUILD/poppler-0.61.1/BUILD'
make[1]: Entering directory '/usr/src/RPM/BUILD/poppler-0.61.1/BUILD'
[ 88%] Built target check_qt4_pagemode
make[1]: Leaving directory '/usr/src/RPM/BUILD/poppler-0.61.1/BUILD'
make[2]: Entering directory '/usr/src/RPM/BUILD/poppler-0.61.1/BUILD'
[ 88%] Generating viewer.moc
make[2]: Leaving directory '/usr/src/RPM/BUILD/poppler-0.61.1/BUILD'
make[2]: Entering directory '/usr/src/RPM/BUILD/poppler-0.61.1/BUILD'
[ 89%] Generating embeddedfiles.moc
make[2]: Leaving directory '/usr/src/RPM/BUILD/poppler-0.61.1/BUILD'
make[2]: Entering directory '/usr/src/RPM/BUILD/poppler-0.61.1/BUILD'
[ 89%] Generating abstractinfodock.moc
make[2]: Leaving directory '/usr/src/RPM/BUILD/poppler-0.61.1/BUILD'
make[2]: Entering directory '/usr/src/RPM/BUILD/poppler-0.61.1/BUILD'
[ 81%] Building CXX object qt4/tests/CMakeFiles/check_qt4_pagelayout.dir/check_pagelayout.cpp.o
make[2]: Leaving directory '/usr/src/RPM/BUILD/poppler-0.61.1/BUILD'
make[2]: Entering directory '/usr/src/RPM/BUILD/poppler-0.61.1/BUILD'
[ 83%] Linking CXX executable poppler-qt4-texts
make[2]: Leaving directory '/usr/src/RPM/BUILD/poppler-0.61.1/BUILD'
make[1]: Entering directory '/usr/src/RPM/BUILD/poppler-0.61.1/BUILD'
[ 90%] Built target poppler-qt4-texts
make[1]: Leaving directory '/usr/src/RPM/BUILD/poppler-0.61.1/BUILD'
make[2]: Entering directory '/usr/src/RPM/BUILD/poppler-0.61.1/BUILD'
[ 91%] Generating metadata.moc
make[2]: Leaving directory '/usr/src/RPM/BUILD/poppler-0.61.1/BUILD'
make[2]: Entering directory '/usr/src/RPM/BUILD/poppler-0.61.1/BUILD'
[ 81%] Building CXX object qt4/tests/CMakeFiles/poppler-qt4-attachments.dir/poppler-attachments.cpp.o
make[2]: Leaving directory '/usr/src/RPM/BUILD/poppler-0.61.1/BUILD'
make[2]: Entering directory '/usr/src/RPM/BUILD/poppler-0.61.1/BUILD'
[ 91%] Generating navigationtoolbar.moc
make[2]: Leaving directory '/usr/src/RPM/BUILD/poppler-0.61.1/BUILD'
make[2]: Entering directory '/usr/src/RPM/BUILD/poppler-0.61.1/BUILD'
[ 89%] Generating fonts.moc
make[2]: Leaving directory '/usr/src/RPM/BUILD/poppler-0.61.1/BUILD'
make[2]: Entering directory '/usr/src/RPM/BUILD/poppler-0.61.1/BUILD'
[ 89%] Generating info.moc
make[2]: Leaving directory '/usr/src/RPM/BUILD/poppler-0.61.1/BUILD'
make[2]: Entering directory '/usr/src/RPM/BUILD/poppler-0.61.1/BUILD'
[ 92%] Generating optcontent.moc
make[2]: Leaving directory '/usr/src/RPM/BUILD/poppler-0.61.1/BUILD'
make[2]: Entering directory '/usr/src/RPM/BUILD/poppler-0.61.1/BUILD'
[ 93%] Generating permissions.moc
make[2]: Leaving directory '/usr/src/RPM/BUILD/poppler-0.61.1/BUILD'
make[2]: Entering directory '/usr/src/RPM/BUILD/poppler-0.61.1/BUILD'
[ 93%] Generating thumbnails.moc
make[2]: Leaving directory '/usr/src/RPM/BUILD/poppler-0.61.1/BUILD'
make[2]: Entering directory '/usr/src/RPM/BUILD/poppler-0.61.1/BUILD'
[ 93%] Generating toc.moc
make[2]: Leaving directory '/usr/src/RPM/BUILD/poppler-0.61.1/BUILD'
make[2]: Entering directory '/usr/src/RPM/BUILD/poppler-0.61.1/BUILD'
[ 92%] Generating pageview.moc
make[2]: Leaving directory '/usr/src/RPM/BUILD/poppler-0.61.1/BUILD'
make[2]: Entering directory '/usr/src/RPM/BUILD/poppler-0.61.1/BUILD'
Scanning dependencies of target poppler_qt4viewer
make[2]: Leaving directory '/usr/src/RPM/BUILD/poppler-0.61.1/BUILD'
make[2]: Entering directory '/usr/src/RPM/BUILD/poppler-0.61.1/BUILD'
[ 86%] Building CXX object qt4/tests/CMakeFiles/check_qt4_attachments.dir/check_attachments.cpp.o
make[2]: Leaving directory '/usr/src/RPM/BUILD/poppler-0.61.1/BUILD'
make[2]: Entering directory '/usr/src/RPM/BUILD/poppler-0.61.1/BUILD'
[ 90%] Linking CXX executable check_qt4_pagelayout
make[2]: Leaving directory '/usr/src/RPM/BUILD/poppler-0.61.1/BUILD'
make[1]: Entering directory '/usr/src/RPM/BUILD/poppler-0.61.1/BUILD'
[ 94%] Built target check_qt4_pagelayout
make[1]: Leaving directory '/usr/src/RPM/BUILD/poppler-0.61.1/BUILD'
make[2]: Entering directory '/usr/src/RPM/BUILD/poppler-0.61.1/BUILD'
[ 94%] Linking CXX executable check_qt4_attachments
make[2]: Leaving directory '/usr/src/RPM/BUILD/poppler-0.61.1/BUILD'
make[1]: Entering directory '/usr/src/RPM/BUILD/poppler-0.61.1/BUILD'
[ 95%] Built target check_qt4_attachments
make[1]: Leaving directory '/usr/src/RPM/BUILD/poppler-0.61.1/BUILD'
make[2]: Entering directory '/usr/src/RPM/BUILD/poppler-0.61.1/BUILD'
[ 91%] Linking CXX executable poppler-qt4-attachments
make[2]: Leaving directory '/usr/src/RPM/BUILD/poppler-0.61.1/BUILD'
make[1]: Entering directory '/usr/src/RPM/BUILD/poppler-0.61.1/BUILD'
[ 95%] Built target poppler-qt4-attachments
make[1]: Leaving directory '/usr/src/RPM/BUILD/poppler-0.61.1/BUILD'
make[2]: Entering directory '/usr/src/RPM/BUILD/poppler-0.61.1/BUILD'
[ 94%] Building CXX object qt4/demos/CMakeFiles/poppler_qt4viewer.dir/embeddedfiles.cpp.o
make[2]: Leaving directory '/usr/src/RPM/BUILD/poppler-0.61.1/BUILD'
make[2]: Entering directory '/usr/src/RPM/BUILD/poppler-0.61.1/BUILD'
[ 84%] Building CXX object qt4/tests/CMakeFiles/check_qt4_links.dir/check_links.cpp.o
make[2]: Leaving directory '/usr/src/RPM/BUILD/poppler-0.61.1/BUILD'
make[2]: Entering directory '/usr/src/RPM/BUILD/poppler-0.61.1/BUILD'
[ 87%] Building CXX object qt4/tests/CMakeFiles/check_qt4_dateConversion.dir/check_dateConversion.cpp.o
make[2]: Leaving directory '/usr/src/RPM/BUILD/poppler-0.61.1/BUILD'
make[2]: Entering directory '/usr/src/RPM/BUILD/poppler-0.61.1/BUILD'
[ 95%] Building CXX object qt4/demos/CMakeFiles/poppler_qt4viewer.dir/main_viewer.cpp.o
make[2]: Leaving directory '/usr/src/RPM/BUILD/poppler-0.61.1/BUILD'
make[2]: Entering directory '/usr/src/RPM/BUILD/poppler-0.61.1/BUILD'
[ 97%] Linking CXX executable check_qt4_links
make[2]: Leaving directory '/usr/src/RPM/BUILD/poppler-0.61.1/BUILD'
make[1]: Entering directory '/usr/src/RPM/BUILD/poppler-0.61.1/BUILD'
[ 97%] Built target check_qt4_links
make[1]: Leaving directory '/usr/src/RPM/BUILD/poppler-0.61.1/BUILD'
make[2]: Entering directory '/usr/src/RPM/BUILD/poppler-0.61.1/BUILD'
[ 94%] Building CXX object qt4/demos/CMakeFiles/poppler_qt4viewer.dir/documentobserver.cpp.o
make[2]: Leaving directory '/usr/src/RPM/BUILD/poppler-0.61.1/BUILD'
make[2]: Entering directory '/usr/src/RPM/BUILD/poppler-0.61.1/BUILD'
[ 93%] Building CXX object qt4/demos/CMakeFiles/poppler_qt4viewer.dir/abstractinfodock.cpp.o
make[2]: Leaving directory '/usr/src/RPM/BUILD/poppler-0.61.1/BUILD'
make[2]: Entering directory '/usr/src/RPM/BUILD/poppler-0.61.1/BUILD'
[ 97%] Linking CXX executable check_qt4_dateConversion
make[2]: Leaving directory '/usr/src/RPM/BUILD/poppler-0.61.1/BUILD'
make[1]: Entering directory '/usr/src/RPM/BUILD/poppler-0.61.1/BUILD'
[ 99%] Built target check_qt4_dateConversion
make[1]: Leaving directory '/usr/src/RPM/BUILD/poppler-0.61.1/BUILD'
make[2]: Entering directory '/usr/src/RPM/BUILD/poppler-0.61.1/BUILD'
[ 95%] Building CXX object qt4/demos/CMakeFiles/poppler_qt4viewer.dir/info.cpp.o
make[2]: Leaving directory '/usr/src/RPM/BUILD/poppler-0.61.1/BUILD'
make[2]: Entering directory '/usr/src/RPM/BUILD/poppler-0.61.1/BUILD'
[ 97%] Building CXX object qt4/demos/CMakeFiles/poppler_qt4viewer.dir/navigationtoolbar.cpp.o
make[2]: Leaving directory '/usr/src/RPM/BUILD/poppler-0.61.1/BUILD'
make[2]: Entering directory '/usr/src/RPM/BUILD/poppler-0.61.1/BUILD'
[ 98%] Building CXX object qt4/demos/CMakeFiles/poppler_qt4viewer.dir/optcontent.cpp.o
make[2]: Leaving directory '/usr/src/RPM/BUILD/poppler-0.61.1/BUILD'
make[2]: Entering directory '/usr/src/RPM/BUILD/poppler-0.61.1/BUILD'
[ 95%] Building CXX object qt4/demos/CMakeFiles/poppler_qt4viewer.dir/fonts.cpp.o
make[2]: Leaving directory '/usr/src/RPM/BUILD/poppler-0.61.1/BUILD'
make[2]: Entering directory '/usr/src/RPM/BUILD/poppler-0.61.1/BUILD'
[ 98%] Building CXX object qt4/demos/CMakeFiles/poppler_qt4viewer.dir/pageview.cpp.o
make[2]: Leaving directory '/usr/src/RPM/BUILD/poppler-0.61.1/BUILD'
make[2]: Entering directory '/usr/src/RPM/BUILD/poppler-0.61.1/BUILD'
[ 96%] Building CXX object qt4/demos/CMakeFiles/poppler_qt4viewer.dir/metadata.cpp.o
make[2]: Leaving directory '/usr/src/RPM/BUILD/poppler-0.61.1/BUILD'
make[2]: Entering directory '/usr/src/RPM/BUILD/poppler-0.61.1/BUILD'
[ 99%] Building CXX object qt4/demos/CMakeFiles/poppler_qt4viewer.dir/thumbnails.cpp.o
make[2]: Leaving directory '/usr/src/RPM/BUILD/poppler-0.61.1/BUILD'
make[2]: Entering directory '/usr/src/RPM/BUILD/poppler-0.61.1/BUILD'
[ 99%] Building CXX object qt4/demos/CMakeFiles/poppler_qt4viewer.dir/toc.cpp.o
make[2]: Leaving directory '/usr/src/RPM/BUILD/poppler-0.61.1/BUILD'
make[2]: Entering directory '/usr/src/RPM/BUILD/poppler-0.61.1/BUILD'
[100%] Building CXX object qt4/demos/CMakeFiles/poppler_qt4viewer.dir/viewer.cpp.o
make[2]: Leaving directory '/usr/src/RPM/BUILD/poppler-0.61.1/BUILD'
make[2]: Entering directory '/usr/src/RPM/BUILD/poppler-0.61.1/BUILD'
[ 99%] Building CXX object qt4/demos/CMakeFiles/poppler_qt4viewer.dir/permissions.cpp.o
make[2]: Leaving directory '/usr/src/RPM/BUILD/poppler-0.61.1/BUILD'
make[2]: Entering directory '/usr/src/RPM/BUILD/poppler-0.61.1/BUILD'
[100%] Linking CXX executable poppler_qt4viewer
make[2]: Leaving directory '/usr/src/RPM/BUILD/poppler-0.61.1/BUILD'
make[1]: Entering directory '/usr/src/RPM/BUILD/poppler-0.61.1/BUILD'
[100%] Built target poppler_qt4viewer
make[1]: Leaving directory '/usr/src/RPM/BUILD/poppler-0.61.1/BUILD'
+ exit 0
Executing(%install): /bin/sh -e /usr/src/tmp/rpm-tmp.89638
+ umask 022
+ /bin/mkdir -p /usr/src/RPM/BUILD
+ cd /usr/src/RPM/BUILD
+ /bin/chmod -Rf u+rwX -- /usr/src/tmp/poppler72-buildroot
+ :
+ /bin/rm -rf -- /usr/src/tmp/poppler72-buildroot
+ cd poppler-0.61.1
+ make install DESTDIR=/usr/src/tmp/poppler72-buildroot -C BUILD
make: Entering directory '/usr/src/RPM/BUILD/poppler-0.61.1/BUILD'
make[1]: Entering directory '/usr/src/RPM/BUILD/poppler-0.61.1/BUILD'
make[2]: Entering directory '/usr/src/RPM/BUILD/poppler-0.61.1/BUILD'
make[2]: Leaving directory '/usr/src/RPM/BUILD/poppler-0.61.1/BUILD'
[ 47%] Built target poppler
make[2]: Entering directory '/usr/src/RPM/BUILD/poppler-0.61.1/BUILD'
make[2]: Leaving directory '/usr/src/RPM/BUILD/poppler-0.61.1/BUILD'
[ 48%] Built target pdf-fullrewrite
make[2]: Entering directory '/usr/src/RPM/BUILD/poppler-0.61.1/BUILD'
make[2]: Leaving directory '/usr/src/RPM/BUILD/poppler-0.61.1/BUILD'
[ 50%] Built target perf-test
make[2]: Entering directory '/usr/src/RPM/BUILD/poppler-0.61.1/BUILD'
make[2]: Leaving directory '/usr/src/RPM/BUILD/poppler-0.61.1/BUILD'
[ 59%] Built target poppler-qt4
make[2]: Entering directory '/usr/src/RPM/BUILD/poppler-0.61.1/BUILD'
make[2]: Leaving directory '/usr/src/RPM/BUILD/poppler-0.61.1/BUILD'
[ 60%] Built target check_qt4_goostring
make[2]: Entering directory '/usr/src/RPM/BUILD/poppler-0.61.1/BUILD'
make[2]: Leaving directory '/usr/src/RPM/BUILD/poppler-0.61.1/BUILD'
[ 61%] Built target check_qt4_pagelabelinfo
make[2]: Entering directory '/usr/src/RPM/BUILD/poppler-0.61.1/BUILD'
make[2]: Leaving directory '/usr/src/RPM/BUILD/poppler-0.61.1/BUILD'
[ 62%] Built target check_qt4_lexer
make[2]: Entering directory '/usr/src/RPM/BUILD/poppler-0.61.1/BUILD'
make[2]: Leaving directory '/usr/src/RPM/BUILD/poppler-0.61.1/BUILD'
[ 63%] Built target check_qt4_actualtext
make[2]: Entering directory '/usr/src/RPM/BUILD/poppler-0.61.1/BUILD'
make[2]: Leaving directory '/usr/src/RPM/BUILD/poppler-0.61.1/BUILD'
[ 64%] Built target check_qt4_strings
make[2]: Entering directory '/usr/src/RPM/BUILD/poppler-0.61.1/BUILD'
make[2]: Leaving directory '/usr/src/RPM/BUILD/poppler-0.61.1/BUILD'
[ 65%] Built target check_qt4_search
make[2]: Entering directory '/usr/src/RPM/BUILD/poppler-0.61.1/BUILD'
make[2]: Leaving directory '/usr/src/RPM/BUILD/poppler-0.61.1/BUILD'
[ 66%] Built target check_qt4_password
make[2]: Entering directory '/usr/src/RPM/BUILD/poppler-0.61.1/BUILD'
make[2]: Leaving directory '/usr/src/RPM/BUILD/poppler-0.61.1/BUILD'
[ 67%] Built target poppler-qt4-fonts
make[2]: Entering directory '/usr/src/RPM/BUILD/poppler-0.61.1/BUILD'
make[2]: Leaving directory '/usr/src/RPM/BUILD/poppler-0.61.1/BUILD'
[ 69%] Built target check_qt4_fonts
make[2]: Entering directory '/usr/src/RPM/BUILD/poppler-0.61.1/BUILD'
make[2]: Leaving directory '/usr/src/RPM/BUILD/poppler-0.61.1/BUILD'
[ 70%] Built target check_qt4_metadata
make[2]: Entering directory '/usr/src/RPM/BUILD/poppler-0.61.1/BUILD'
make[2]: Leaving directory '/usr/src/RPM/BUILD/poppler-0.61.1/BUILD'
[ 71%] Built target poppler-qt4-forms
make[2]: Entering directory '/usr/src/RPM/BUILD/poppler-0.61.1/BUILD'
make[2]: Leaving directory '/usr/src/RPM/BUILD/poppler-0.61.1/BUILD'
[ 72%] Built target check_qt4_optcontent
make[2]: Entering directory '/usr/src/RPM/BUILD/poppler-0.61.1/BUILD'
make[2]: Leaving directory '/usr/src/RPM/BUILD/poppler-0.61.1/BUILD'
[ 73%] Built target test-poppler-qt4
make[2]: Entering directory '/usr/src/RPM/BUILD/poppler-0.61.1/BUILD'
make[2]: Leaving directory '/usr/src/RPM/BUILD/poppler-0.61.1/BUILD'
[ 74%] Built target test-render-to-file-qt4
make[2]: Entering directory '/usr/src/RPM/BUILD/poppler-0.61.1/BUILD'
make[2]: Leaving directory '/usr/src/RPM/BUILD/poppler-0.61.1/BUILD'
[ 75%] Built target test-password-qt4
make[2]: Entering directory '/usr/src/RPM/BUILD/poppler-0.61.1/BUILD'
make[2]: Leaving directory '/usr/src/RPM/BUILD/poppler-0.61.1/BUILD'
[ 76%] Built target stress-poppler-qt4
make[2]: Entering directory '/usr/src/RPM/BUILD/poppler-0.61.1/BUILD'
make[2]: Leaving directory '/usr/src/RPM/BUILD/poppler-0.61.1/BUILD'
[ 77%] Built target stress-poppler-dir-qt4
make[2]: Entering directory '/usr/src/RPM/BUILD/poppler-0.61.1/BUILD'
make[2]: Leaving directory '/usr/src/RPM/BUILD/poppler-0.61.1/BUILD'
[ 78%] Built target stress-threads-qt4
make[2]: Entering directory '/usr/src/RPM/BUILD/poppler-0.61.1/BUILD'
make[2]: Leaving directory '/usr/src/RPM/BUILD/poppler-0.61.1/BUILD'
[ 80%] Built target check_qt4_permissions
make[2]: Entering directory '/usr/src/RPM/BUILD/poppler-0.61.1/BUILD'
make[2]: Leaving directory '/usr/src/RPM/BUILD/poppler-0.61.1/BUILD'
[ 81%] Built target poppler-qt4-texts
make[2]: Entering directory '/usr/src/RPM/BUILD/poppler-0.61.1/BUILD'
make[2]: Leaving directory '/usr/src/RPM/BUILD/poppler-0.61.1/BUILD'
[ 82%] Built target check_qt4_pagemode
make[2]: Entering directory '/usr/src/RPM/BUILD/poppler-0.61.1/BUILD'
make[2]: Leaving directory '/usr/src/RPM/BUILD/poppler-0.61.1/BUILD'
[ 84%] Built target check_qt4_pagelayout
make[2]: Entering directory '/usr/src/RPM/BUILD/poppler-0.61.1/BUILD'
make[2]: Leaving directory '/usr/src/RPM/BUILD/poppler-0.61.1/BUILD'
[ 85%] Built target poppler-qt4-attachments
make[2]: Entering directory '/usr/src/RPM/BUILD/poppler-0.61.1/BUILD'
make[2]: Leaving directory '/usr/src/RPM/BUILD/poppler-0.61.1/BUILD'
[ 86%] Built target check_qt4_attachments
make[2]: Entering directory '/usr/src/RPM/BUILD/poppler-0.61.1/BUILD'
make[2]: Leaving directory '/usr/src/RPM/BUILD/poppler-0.61.1/BUILD'
[ 88%] Built target check_qt4_links
make[2]: Entering directory '/usr/src/RPM/BUILD/poppler-0.61.1/BUILD'
make[2]: Leaving directory '/usr/src/RPM/BUILD/poppler-0.61.1/BUILD'
[ 89%] Built target check_qt4_dateConversion
make[2]: Entering directory '/usr/src/RPM/BUILD/poppler-0.61.1/BUILD'
make[2]: Leaving directory '/usr/src/RPM/BUILD/poppler-0.61.1/BUILD'
[100%] Built target poppler_qt4viewer
make[1]: Leaving directory '/usr/src/RPM/BUILD/poppler-0.61.1/BUILD'
Install the project...
-- Install configuration: "RelWithDebInfo"
-- Installing: /usr/src/tmp/poppler72-buildroot/usr/lib/libpoppler.so.72.0.0
-- Installing: /usr/src/tmp/poppler72-buildroot/usr/lib/libpoppler.so.72
-- Installing: /usr/src/tmp/poppler72-buildroot/usr/lib/libpoppler.so
-- Installing: /usr/src/tmp/poppler72-buildroot/usr/lib/pkgconfig/poppler.pc
-- Installing: /usr/src/tmp/poppler72-buildroot/usr/lib/pkgconfig/poppler-splash.pc
-- Installing: /usr/src/tmp/poppler72-buildroot/usr/lib/pkgconfig/poppler-qt4.pc
-- Installing: /usr/src/tmp/poppler72-buildroot/usr/lib/pkgconfig/poppler-cairo.pc
-- Installing: /usr/src/tmp/poppler72-buildroot/usr/lib/libpoppler-qt4.so.4.11.0
-- Installing: /usr/src/tmp/poppler72-buildroot/usr/lib/libpoppler-qt4.so.4
-- Installing: /usr/src/tmp/poppler72-buildroot/usr/lib/libpoppler-qt4.so
-- Installing: /usr/src/tmp/poppler72-buildroot/usr/include/poppler/qt4/poppler-qt4.h
-- Installing: /usr/src/tmp/poppler72-buildroot/usr/include/poppler/qt4/poppler-link.h
-- Installing: /usr/src/tmp/poppler72-buildroot/usr/include/poppler/qt4/poppler-annotation.h
-- Installing: /usr/src/tmp/poppler72-buildroot/usr/include/poppler/qt4/poppler-form.h
-- Installing: /usr/src/tmp/poppler72-buildroot/usr/include/poppler/qt4/poppler-optcontent.h
-- Installing: /usr/src/tmp/poppler72-buildroot/usr/include/poppler/qt4/poppler-export.h
-- Installing: /usr/src/tmp/poppler72-buildroot/usr/include/poppler/qt4/poppler-page-transition.h
-- Installing: /usr/src/tmp/poppler72-buildroot/usr/include/poppler/qt4/poppler-media.h
make: Leaving directory '/usr/src/RPM/BUILD/poppler-0.61.1/BUILD'
+ /usr/lib/rpm/brp-alt
Cleaning files in /usr/src/tmp/poppler72-buildroot (auto)
mode of './usr/lib/libpoppler-qt4.so.4.11.0' changed from 0755 (rwxr-xr-x) to 0644 (rw-r--r--)
mode of './usr/lib/libpoppler.so.72.0.0' changed from 0755 (rwxr-xr-x) to 0644 (rw-r--r--)
Verifying and fixing files in /usr/src/tmp/poppler72-buildroot (binconfig,pkgconfig,libtool,desktop)
/usr/lib/pkgconfig/poppler-qt4.pc: Libs: '-L${libdir} -lpoppler-qt4' --> '-lpoppler-qt4'
/usr/lib/pkgconfig/poppler.pc: Libs: '-L${libdir} -lpoppler' --> '-lpoppler'
Checking contents of files in /usr/src/tmp/poppler72-buildroot/ (default)
Compressing files in /usr/src/tmp/poppler72-buildroot (auto)
Adjusting library links in /usr/src/tmp/poppler72-buildroot
./usr/lib:
	libpoppler.so.72 -> libpoppler.so.72.0.0
	libpoppler-qt4.so.4 -> libpoppler-qt4.so.4.11.0
Verifying ELF objects in /usr/src/tmp/poppler72-buildroot (arch=normal,fhs=normal,lfs=relaxed,lint=relaxed,rpath=normal,stack=normal,textrel=normal,unresolved=normal)
verify-elf: WARNING: ./usr/lib/libpoppler.so.72.0.0: uses non-LFS functions: fopen
Hardlinking identical .pyc and .opt-?.pyc files
Hardlinking identical .pyc and .pyo files
Processing files: libpoppler72-0.61.1-alt3
Executing(%doc): /bin/sh -e /usr/src/tmp/rpm-tmp.85102
+ umask 022
+ /bin/mkdir -p /usr/src/RPM/BUILD
+ cd /usr/src/RPM/BUILD
+ cd poppler-0.61.1
+ DOCDIR=/usr/src/tmp/poppler72-buildroot/usr/share/doc/libpoppler72-0.61.1
+ export DOCDIR
+ rm -rf /usr/src/tmp/poppler72-buildroot/usr/share/doc/libpoppler72-0.61.1
+ /bin/mkdir -p /usr/src/tmp/poppler72-buildroot/usr/share/doc/libpoppler72-0.61.1
+ cp -prL AUTHORS ChangeLog NEWS README README-XPDF README.contributors /usr/src/tmp/poppler72-buildroot/usr/share/doc/libpoppler72-0.61.1
+ chmod -R go-w /usr/src/tmp/poppler72-buildroot/usr/share/doc/libpoppler72-0.61.1
+ chmod -R a+rX /usr/src/tmp/poppler72-buildroot/usr/share/doc/libpoppler72-0.61.1
+ exit 0
Finding Provides (using /usr/lib/rpm/find-provides)
Executing: /bin/sh -e /usr/src/tmp/rpm-tmp.fHl2w2
find-provides: running scripts (alternatives,debuginfo,gir,lib,pam,perl,pkgconfig,python,python3,shell,typelib)
lib.prov: /usr/src/tmp/poppler72-buildroot/usr/lib/libpoppler.so.72: 4542 symbols, 23 bpp
warning: hash collision: _ZN11PSOutputDev8drawFormE3Ref _ZN9GooString6formatEPKcz
warning: hash collision: _ZN16GfxTilingPattern5parseEP6Objecti _ZN6Parser6getObjEbPh14CryptAlgorithmiiiib
warning: hash collision: _ZN22GfxDeviceRGBColorSpaceD0Ev _ZN6PDFDoc6saveAsEP9GooString12PDFWriteMode
Finding Requires (using /usr/lib/rpm/find-requires)
Executing: /bin/sh -e /usr/src/tmp/rpm-tmp.mKUe2w
find-requires: running scripts (cpp,debuginfo,files,gir-js,gir-python,gir,lib,pam,perl,pkgconfig,pkgconfiglib,python,python3,rpmlib,shebang,shell,static,symlinks,typelib)
Provides: libpoppler.so.72 = set:qd4UzmZgPHwxuXZ2Ln90paui0NQv6WmmMZLbxVDWWQ9qNFgl3N00nDcZhU2lm5rMPeCVtyw27GOVsVVSkGZ6c2tZ2f31AkmZyUCeglkMhPJUyrQleKneVhQWNgcF6XofJzRDm5VtOZ1GguH5o5h1mf7yM4vunEHVoPENugcSbODvxFkebQvdRTlisttZufzM868zgmWuTAxLOQluTrUSNb20jDDo14WJe502KM5SILrMLD55H8Trxgcb6fjkZFMgiGySQSyO3ltGCwzbXKW25FpCtW2cpUqVfGsM4QL0WE0MBxxKvitn4wZEqup5kYigsqZFElVK1XJd6kWzWgtj7Oh1zq1t0SlfdhQZAUm26lfSZhou4u9TUpOcLNMWZhDSktU0cx5XgKPEs4Qaba2dNWTr54ErF0DsS6qlv7HJKHXs40hZfov7k92e65pH8R1gn2G3xtgjzf1sjz5KZn7elgor4NssBUb9w20Hk0wAxq3E1WKiC1ptPCm0NoUZDCuxlO9SnSCDFeUwxS14Zo117yFArEe7N5Ps5i6l07pHpm2sac6uax2oMvEZFnxKqYgwKbZhV7wIr67O1eqhUOPuyPciIMWzZ0VivJd3U8QgIaa11NprZdY4qwcjC99PQiiUqY3rDsdieJw02Z0soiNmAi641GTaKyyd1gWRNfAxFqvXgkDtrqAYJ12ullrwkNwdQACWHQO9n8Zn4yZAhSG9P7myT5VmUhL7pEUQp8QRgY6aMn8xoOvYH2bphAOKcFe61CWZ3XEV0RsWe0jJ3MsqJQX6cGEocueqDIiInyvThC6oEXa7sMuXtG0Nj6WIfuoGxN2mEiH7fvFYu2h6ABZ9F4KbvMlom9DoZIOixaG3W202iGey060JRM8vCbwtZ6xr3sr4oVcTEA1Ypg00p65W63HyZnHjwaAl8qm78y7OlnvyKgynwTzjEw2zCPyzhg1qkZ1arQNh3ZHN9ZCuqfKB0vgs2D1agD6IH0qI0LbI6tVwCBDXpFy4mvkXNoijjhcuhWcP0Pnd1gc6i5orLe1odiNakYtvkMRjDZJaVpaTe49irsXLz2dIPQv1EEyVzVJsCz5G48XqcOwY60ZouGUrqXMZy4fNtK7QooTV2sBS8RGQbfe9MgYkWwpZ73j74WvUDpqxFmvVAa5xd4C6nAJgUUH5HmXjtYIIdN5lPovd4aFwiFO0k9g0dF4NBO3GLgJaHOiNvo5friltmZzgGTXR23iYpuuTHCZ3B7ZDWOHJZ2glRG0m1RhRMzNL0em3UBTm7VDD3uqbGPMLmF8nxwoxk3NYTuHBSkLz3FOf23qhz64YP1B10NhfhGXBNNEtDbGHVNNc2im5rhQ94aDJWqILZe7vn8laZuzlvF9DaKfbl2svZkt1bkp6072QspEqmcjIVWM45tKkOQAbaL86PemWxnWLP3CYrcebzpTm8QrAJOgPhl2018LE8gjZ7vM3Y71cGnLIo0Ror9pmUlqI9EH9aNEy1VG8ygUhBustWW1Zx63TYnIhNaVqZgjEPc3DP7gf07ULCSV2KZggVLoDwW0tP65O4QUbE9f3HRqJYmDvYHBLkMPc5B41vDw4L7A5EYf9xxi6zBrTG7YcY98JwlgenVwEBk9bWUET1ymLjuiWZsfoRM0Mt4SLmOGiSvvxF6ovV30acoYTXUEwajte69Fwq3lum4M5Qy0P1yNWXqTw70c4DgBjA405ty20Nva82YJxMUbuQZvimOY1UEj2ASfPndELFTys4yx4oVsLK74ZkM0eRj2HiDfYev4975yNocwtXGoxufM0Ma8G9oSFmRP1kO04VAP2PUfp7Y7sgwkfOOcmUnB3YURUjd0wGV6V4daXV93a6UZp7G3O51R9hZzqjhCtqs000ZjqQXIdWZ1xpZxmJSR60UXsMhjCP6ZhyN9OHYh8IEMkbn3d4jU9Y2hHOS44o6aT5C1V242hh2W9lnLu009WkxDspfyAUg4SxB3fr5Z9cYxQ1b6gzStahpm85xJsOsA66IvZpJX08JATdJcZqMxO1mT8YvsOmSB14w0xzzIUjhyWh4moP3nf48fx8VYVn85c4hUCjib8uZyOEmiDoowNesdpynoWJnhdUzhGMUS4gyT9dxM6sxuY0T3EC0MLOcoIMh2U58qtTnuwI2MMhNjjjuq9wQmbt7rRFOILHF6ydzy1Mm0BBdZjqRHKvZ3ln2rFSq08RvwKadAsvYqZ9p7VkGKclFjvtIwj1D4tA0rq1ie3aMf2N0UT2w8FA3RVoLZK2zT8G6vitUlZcgQZAtDYeAXg8CsGD9lsXn0F0rZ32sXtomHoGUcAQO2wNnaiicw0Kh4ioZ5SPf32zUaYhSpz8sFzcu2h8Ur8fFkE6060Zb7ieC0GZkTLzLNUsySMsjOjZ5a8KlvQoYi6vHm1aoyZtZh4LpJWuhw6Mij3BLOMe48xI3l1pNEgAlhyrSojwsddZzpB5oQwo55AZeehjKtZnredyxywkhZwEI2BdghMDLIOUbT9zR0i757LARC0PEw5aewXM1MZc4TngjpszStygXpJvlILM4h1wpLY9Mnx189A0qZlM5H3zS3IZoeE3B9PZIMLBP3UsRnwZiAzESTIZCZ22WHLeZh2tRgekZClc5bK2e8itZ8ksaQAb7wsJBHo3RowPvZhHYPoo8n0L3GP112N9kAes8cBCy4mUhm5cZuFIdwQcce5M0ckTeEkuCjalW6whFoGhQBZ1mP2cwAlGx0fyeNSewYsGjDQ84vDHbYkAWwZ1QNviDUhuAtZdXWi2gMl73f7HnmuY6U0xkQb3c1HNCcjDwmjh4Z7ukj7xTSixToaULdfq9vaPbNVrDDNAbl1Ft09nPeEb9Wpn0WxKbva1U8cW6EXZd18TizXqWZsJab6FwVU568o8qekdQN70w1mrtDq3Z5QFpb0kNQyOn6q49UmB0cBXSDVxbDY15OEBi8huT0hJNI4yjwXUq8ZwZrLCYwyJQsx7Ld7Fxs8KbYJCAKcw2Az1zcr1A1xF0En2Rhs8dJthin7oaMDGpvUEF5Pe5EE1m0fR0FFcgl46TwRZsu8a6hvlxDD1lhdQ0jCoZD3eyu2EIiHRlZbhN0Z9msHOe8wZbMlKa4Me4XBAJCgGXZCoJLNxZCgE7ymKDIW1MGh4hf4065IfZyJmKZrhuZHjoDAXF57gcrZ56922t8UGY0yo0iioBXmEA2VcH1ILzs0U8ZbM1rjD23tsdwQgVdg0uQslNukATp3sKPgZb3F2iszWEcXeF6K2S6mshk4lbHeWBwSrRaSSdmN658rsYZkcc9E1i4SRa262VVPxxhOCC8TfcTPMTfG6Um8QJGc5F8ArKBx4EarS2fNkAEvC40oIbkUgAeJ0qzGHckKIijktuGSygjU3Nw0Ce2FbtkS4xBygRyd3Oa34jo6tkwsgiWVpelEwgDSBpSsjqlwLCu0wO1TWZmJNcCw18ewV6Jchhz1CxoxsiNAyrSzgOu5CGozEN0yG7SxinrdnZn5wzZ22pkMjr0nRwVUzIMYkWwgjbSTZEO4gP5TAhEfmXMiwI1ASCJ9phXjZ242TgkVuAcPZfZt9akHGNV0Z01oXU1QMOTCwmRewswiIrrHCYwfB1F3tDK0PDId0wIZ30toX9kTSNs5V72C7cbagkarTtm04Mm1MNxsZggO4GpGZcWif6W7wGOL0fK4oKnWvzpWEfBAVs89B9bO1dWo4Y0estnYjBJGZapWKRuqA1BHyZtekXLwItDNuWHfCRcUBFmDg3oeWjd2IZCNxl3pxVZcfkdWNk0TKX1brwQgaxulbZae5t7B4JLHffRZnBSN33Bs4cGL6hDGr4BeBe40wOTPBMD38NlWITHZ4rugzttJJakPEOsNsiqz2NsRaNpypog2KjAWF58HCv6hOFSWZ2kZCdZk513z6L636TqudUUWi1zEukq5uwuIZjYXyj00TAQB2OClOiMUwCMztvdOmLgfNj0YzQnQ104Z6FYNz9XfwR9cIITAExugAhVRcTfnsC6YsPB1PfZKFfhKG0QtsrHdMNHa2I4U5yioPOoqoO3L41AHyM4ICdwgSG0MXpJUOOZeXMDVi1ZwKV4r8OieThMng7aKknqlnh8k8AQrLh9eP0pPMhsEnlyCxZn03fQk81yuVQN9DOrDrpw9A5b4601mQ6EAmVy3xYF3Rj8rKVsfgIQhUs8OhyELflk1nR4ZyFYyt2ZK6PWtU73Z2FNMk9mQKmihxGXqgEkYmg3g39mgoVGj0ZzsZpsL9mIzZAK9EKyWyyPddZAi1R6Gt298L6wU2pTkz2baXUGAM24541pF9oDQ5FBEscnFqWYGlhjpGTU7cG3a40GZ98dLgZiK51LJQBqd51GzFoZe4iAOcw9tjaO9UwcQo3I3mMYApp4LM5sAwD6QOyRT9NSjr8qEZdrJ7GxuRj7Y6DuMoo6Xb8ovgvXrf2D0X7UwPhGAvxc7i9ZtdpJrK3dPzrf0ucegzp31sleg4Pl40ecsQkOchytL61zL9lX5B7leOfqOqip7WjuCQiTXYCZGiNXSnsAd0Pty8A0F35hAff1T6UgLXD0tSwgRt2hCPmTpWCNwMufvgVMdhtFMiyCbWMWQYmQeVsA68zmX15zu3DxUV3OUafeDiTsp5ErZHltBzwh6yJwb6Y06aYvjpIu9BaP4ZecNc6ZBsZg4NZnIG8pUFQluM2M6Nkpwa247iT89YH0sav3SP0ldFf8kCTdLU0fMc3KGvuGnnp1Ux3qarH6sLmvMD4ok1vBC4oIECiy0brLRnjatqif10mFGoeEx9Ij7rqjiju1GlynZnooqqthhmgAa4tFHEzgPABLuwswn0ddbhyZhXHY4L1dmx4If0g3mziQ5z2A20lguVrhYIzTZisfLKauvt6zHmD1soJRAihe3SXRGQrrBWxLCPz0S8gGD3bmsM90lcIXsDZwWsXilkKCTKAbQ6VsG6JaQFMdMLZnL93Z92ZeGsqWBjOt0dgfil6CDXP6UF0iqA4Y81jYx3oQXMZFwsrKlzb6NaUek1vX9XbZKIw02Fg0IsiIswi4AIsZBJE3QDw6uepKMoRn50zArXCIVZcD9qqi0Y0jQ5mShktp2egOxsdprn1ycTNpi5Tp5Zxefq4o9x05pk314R4PE5dUlKKYgKZ3Bw5P0ZohGwfMG6semIUCgzesYDKbxJqAZ6Kzd6qAeeh4K9Zr7MU2pJRlgmRuO0ibNLDVyF45gqf6Ju9B60pxy25FZgZw5xTBfPSOdovhfIdODivdMmZgZsUtUktqZbOVmrAiNhkhYFsQR8ST0tSySW4DTPTg1HOQ0NpCA7BAUyjzDTgo5mpBD0zZ1trwYYEjYEYHRwfJ4fgJ7Xnq2osvgJsIRWKHNLWF9a0rxtqQMYMb0cKsZqaFUiCWx0UOWGx34wLPcwOnGZipz5FJrHwzOXRmKBBM2tom03FEj8Zj50QgAz1FxLcOWwBONwr7fFsDvhrRFMW1QYLp8tRymwjHOHH4AyZy9TL1Fs3ZLGvZcj6QTMi3owG392VjgZ2ywKu5Rm2twFvzhJOLoaskkhqpSj9Ra3p7pnyq2c7ic4GLbrVL3wcnp3L3s0sOjTMwMJnEW1scSdqdBaurauwnMZD8zz9Jl0yakgUccisEBHYzEC1YhSI2BWPiH0I9EpxCAo3hTSng2EDgeBW9sgRJYfz26Z802ZDLpR5qIEURi0zr0m5ab0ZurYxgVZvpUqZ5BnCUc4yxGiJ5Lttc6M0t5W4VsFfnF9N51rAbKTws8WW6X0cCKtQ1vtyVkaVeZd3A4EW3KfMI1McRFW4di0i87asnhnQM122Zdw4iQUJPVMQjpXIpGwdisNZhq6mbUZyxXWB71vSzmq4lkpEi2CQn3gb6MdSdflNl1qSZaM32wo3XQDak2e5qZ1ArZ2nMZ9F4K8pWNfMLuUMT0YNIOC9MS1nXZjgyv1D5QeZ3MS5WMidewavMdwsZrWUSWoVovVvkDZysjGzD5FZ12EP0guxfjr0wotF44WlPizVEIjmwG07kaT2MQ89vc2wLRY1uyKbrlC1ECNklzwkTHEGyOrIWR1kjalFp8G9bBri9gdNklWPr0r3G1iaBMq236Rl2f08WQaunZ1AHgQQrCg7pJ49gPDoGmHjn2gfLR7kWcOVT7ycHcdJs0Uj9wZunLKG1R4oNFrMAkxkv1CB6kMfnXEgd8NRwQFNlruY3ZmOcoR0qm0pNe8ZLFKdNZ7tHY2kgqFv4UV8hOZ9QTL6K2vI2eRLJC3NGz7SZFzx49DACVBsGbh8wbwMvqrx2ZDB42U4bQl5qbN7gj835Hbtmo6f7sfxL3IWgJskML6beLAiSr1ggy9VT39aeRIT98wZjweynTJRvuwcneZDZAULUMxwKQo3AbRI9OO4Sr3lZuZ3zZCv9gjZFaKSGX8SYZoZFpjmJ34K9TsfMjMpDIulrT1wNxEdM8Z43r3wk2sUebQZ8Brn3fpY7UIxZhYvDolqAZzKJgcsvGbNbnsCpcPePbDiA3bXox3L9aZhncWZkbK480Dx7kWgXnMT3bWkdgGdz5cNQyd8zqHEGibxnfxrsF8mKlyex1igsFZAQZlRczwJGAmZHrSYyGEFNZ7CRlMr5XzOtl3zXi5QaFcZd4Ij7VgaCK0Bvp4weiFNrNNyb9qJvgmKDe6tqkcfRtASSkb3rtQP4OASW7XZthxztjxwy0w984ydjsvZokZgo00jnyoXFg0LLP8gG1wvEYtl2gm0A8vm26WNih4fAZjv2Y8wW5hK2Z6puRMN1FFr2jXYZcXtkxbW89tETO5BlxN23mWHiIUvmpCFUv3liI3rK7e4vb1sisaPUlpTgZG9iRZAe25GF576VSzAahQogjR36ZFBWUrKvCTjJuPqQTvXwZzu1h0M01AIyLoa0Uag21PQljk5kmrwM41lmchecYaUbYjM7t7k2bOo5MJyxFB1EVHMtASNsAxSzC1J6BytHNTeVZrkT048vZ6pqlnQJcirb9yI4jbomG6n9oUYSaDDVYfo5aEKA00ufa9Y2vrrklncYjmCAdhWLzKVI1Ni8G55YHEVZ1ikM2k3FfxQTlzwahmf7Gj0MrYQ5dUguJ1HCSdXFb1gK1ge9lXU80gb1siS4mvgrJ9DAi6WOgVZ6rN6mhzsSWGeynEkz6kPZ3y9lH0w0NjuTwJlZz1MQagB9kzDa7ASNNaVkCokZdg4uGAqwd3kyYfKzStWT0azOsL7XGWfhcfesb4thP1c41FjbfMoOWAnvhY9wzjlc2GDGq2nmYQe1uDItHoAgN2stBE0QPjLjcAxxq9cbwqwVrqMh2hFyUZbLZ1MI9wZ7cbe77j8n8H0Un7MnI3wlLSbVB17dSp624KMVPee7dgUYAJeT9cXYAducwLos4T26Z2YCgsmrtw1gobCnaochHZ6ijB9P8rLhZ3UqP2Yv2GPT23zvI8Si2wzgwM47y10X5LUcIG36RtjzBG0i9gwXsVrsWYz5DU2ofNdjti4tm2GNMQGnFh2OE5LW0ZnEb1MpR8BoLjwPpfQCAEn3LppB2e0oUYZe1Y5vjUZJErCgASUzy5ZIkL6OdaS1farsOlJCnJ4SESV0QU0YWhZjyigQR98p0NNlnLfqNt9ZEjc03C4F1VyEKIDkPYh1VYGmWrFaJ83wd6rKwBxgFPr0gASRuWwGhuC4ULohzZdoPrHOdVNs41gTUNfAZqJODteMWjxeERLILkkMXJKlORwGUhgFI6EiqlcPrZJt3QkquQq5eccbcHqiqA0iGMhAZ9yqHwnDy6MeS6E3UrO3DCPC4fIW6KFG65LPKMx3n7l2hp70xUNJ5lfQj3taIE8H4Ec8xZpviH7t0s90JJK1kaZt7gtreZ3a5m0Z0nex2rQbsBdAkeEA4Dy1nm4dBAyFK39uxMrxQP3I5Z7ZBNjAi7hDw3vuALD48iNUqwNDZtEH6TucV0kjmMBTY2ZuP9EQV6y2COzZGJXTasUBMrC7JYJB5KYkpbI8aMBN5yAyCiofD8M7vXxdAKFKQywjB9iYEmxPrW1TTn132U0L4YR9NS8Y22YwYXUaOTvZa9LWIfzeuEcNTDXGU1V0KxwfcxGx35MZJUAMoR55VgTxWj5aogUNiwilJN9HZmvZDx6BfP9kTQLxK4rjHY75HYx3DUQHPP14AMIV8ejcbaUrhFuXZzgXsr0IxEYxNavB31KjUYFZgpoG67cesRuoIdEhuBwe8EgQMuxxDtr7M54Mf4CPtPqX8Qx0dPq48e15wm9ygapp3FCTLxY3J0IUAk8kZ7renC218FwxeGZgW42a4UnMN7fk2jOK0AZyAy0fLtA4klNXCzBVj2OEFAhfMpvie7bM2PjdcGp0dDWZ0xaLVegoMNJgLwaKqUsAKDYdeLe20xBLJA2F1A722YyoO2wl5hoo0cJdBhVtaOnHxtx2hYP5zDY5mV7HkZJssEZfbceLOco8ibDyac1yFha3M38jZgjx7KoQt7NxHhTfxXK4KbLUjJ7ZiaNLHibnPnyKvTFHeOv1klxX8ko18SRnbX5jUEWdFNFDeZaYcKI5uhyR7pb2UqpaSEUdxJi7NrQr6MZDnyVCEVOGvO46LPe9yiwL0ZoYaVN23XEvITD7BU4xQoe7Q4sW7fZoWIoe20f8UdUjZA2MOYhxnzoKqy0OUBqC4GHjA4HUYjp4mZ4r7IMxVZuGyMrdOOFOnux8WKLNgMJN8m1k2ptaSW9QyXHadAI0lIAhtGJiaJGySwc6c1VeBmCjnfyfMKu1Zt6V88q863Eh5o4UsqsO7hXJrh9ZKZy9xDqa51rEePpgRAx0pL0SZrYTer6DEmjW9ImedP0jeDUPZ074cJ4QVX4mWwSHPv8AS1zZGNmydlEe8wyong4PHLToPyPqqnRkpR0bZ03QVesxCrxka8gooWESTzP2aV3Oz4hkCzqCxW4YbENZBecN3VF3hgOUYQ9F4XAvC7MFp4YUdAZyC4c9oY1jNcw5yafQmouZswFxZ9y5HojuYmQSm505MF0v4r77mslF6GStGAka5sqIaSCBtw8F0HnQFR54muSvO812X9TzyzmKof03PIvNrZ4Y2wagZaBfR71uv4IMchphk15rZo1XGi2qv3i4BI0LCwgf6vDm5SUgckBqIelPsq8bmZjLX1lcmrjMDdMglK34eOwBPRyIZAQZrG4wnqJ2w11LqE9HMQLK2TcROZ0Z4C25NpXLE46Hg4pT0C9bTdS1SRZI8F4obAkst2BYfFfnxpbbBYr7yz6XcRwiyQtqtZxNDIEnh1OjAaXoA8HjjxOXkICvCL3ukwV2Dipo0ef3jgiBMZdx290xIRE244Vz61gntu8y4fkJo8p4KWkc4WKSdUQ5uaP0hi24MxxkMrS8S1cukqZGpvttZukqybfVrEsZDeUZEeYpPk70Va0xrjZ3xLjP4ZKEGQuRx49E1GufcsG1BYFowHzaq0TuvYVR12GVYrZJNm5
Requires: poppler-data, libc.so.6(GLIBC_2.0), libc.so.6(GLIBC_2.1), libc.so.6(GLIBC_2.1.3), libc.so.6(GLIBC_2.11), libc.so.6(GLIBC_2.2), libc.so.6(GLIBC_2.3), libc.so.6(GLIBC_2.3.4), libc.so.6(GLIBC_2.4), libcurl.so.4 >= set:khZKmuO2BLGmoBdrq2, libfontconfig.so.1 >= set:lhrohCdZj2aDzRJ6gZyJdc0SVpug7529R3zvxO80, libfreetype.so.6 >= set:lgbRAdPOYSSUsHYJV4ok3GQZ3eIYm019NnZeVIgAy74lK2, libgcc_s.so.1(GCC_3.0), libgcc_s.so.1(GLIBC_2.0), libjpeg.so.62 >= set:jevZlZyd1MrHuky7qUx6GQbn4MiShRaoRnDHAfXv, liblcms2.so.2 >= set:miZ3tbG2LvRwPiGGhKlh4PB4IItgB9a, libm.so.6(GLIBC_2.0), libm.so.6(GLIBC_2.1), libnspr4.so >= set:mljVy1, libnss3.so >= set:ni2K122Bl8ZntbqnJT3u9BrwsP1ZkJ5DK8t0LqNhR1EKDM0ZxzP2Zd12O1, libnss3.so(NSS_3.12), libnss3.so(NSS_3.2), libnss3.so(NSS_3.3), libnss3.so(NSS_3.4), libnss3.so(NSS_3.8), libopenjp2.so.7 >= set:lgwIacCZc7eAN22kQBPp8FfYQpfRZH5vv03UqlThVs6rOfss6, libpng16.so.16 >= set:lhHMixN8M6530SEVZzYXfYgFsEqRnzIaIczzaFz, libpng16.so.16(PNG16_0), libpthread.so.0(GLIBC_2.0), libpthread.so.0(GLIBC_2.1), libpthread.so.0(GLIBC_2.2), libsmime3.so >= set:lhirPpQXlgtahZcacIWLHScw2qo2pi3hzc0, libsmime3.so(NSS_3.16), libsmime3.so(NSS_3.2), libsmime3.so(NSS_3.4), libstdc++.so.6(CXXABI_1.3), libstdc++.so.6(GLIBCXX_3.4), libtiff.so.5 >= set:likQdoCJLJxPiZc95, rtld(GNU_HASH), rtld(GNU_UNIQUE)
Requires(rpmlib): rpmlib(SetVersions)
Finding debuginfo files (using /usr/lib/rpm/find-debuginfo-files)
Executing: /bin/sh -e /usr/src/tmp/rpm-tmp.ycWiSE
Creating libpoppler72-debuginfo package
Processing files: libpoppler4-qt4-0.61.1-alt3
Finding Provides (using /usr/lib/rpm/find-provides)
Executing: /bin/sh -e /usr/src/tmp/rpm-tmp.DEteiP
find-provides: running scripts (alternatives,debuginfo,gir,lib,pam,perl,pkgconfig,python,python3,shell,typelib)
lib.prov: /usr/src/tmp/poppler72-buildroot/usr/lib/libpoppler-qt4.so.4: 1444 symbols, 21 bpp
Finding Requires (using /usr/lib/rpm/find-requires)
Executing: /bin/sh -e /usr/src/tmp/rpm-tmp.tPkljR
find-requires: running scripts (cpp,debuginfo,files,gir-js,gir-python,gir,lib,pam,perl,pkgconfig,pkgconfiglib,python,python3,rpmlib,shebang,shell,static,symlinks,typelib)
Provides: libpoppler08-qt4 = 0.61.1-alt3, libpoppler-qt4.so.4 = set:odqJB9c7azbHZbZpXYDLZho78yYrvqFBAZmO5VqAKmjjWmKw10IZxZIdYXYfJ6Z3tpd08MJJD71Emxf4j2Gcuqr8LAOp22akcTsNxKQsZ4X0o5MclPkZqGYQPsgSVxEX5qW3R7mdTeSFRsg6fc6jw6GPgkuZuFr1sfQEgwpzftDbr0F7gjt7PrLOivwM1n3OS1QaSbhr22I3JHRJutGrSAoeCbBFvRMjNtu0ZbaNkBbzCUujVw3yGH5urGG2ajy838pFrcn6HyAgbNMuRT6WysPZ4L6xJ3PBF5zJSgZqazNyO3ZC5u37z3yInidZjX2eZ3IjuNsJZCVZLhI3geiuinrnY50t8ZvyCAVbXFy9VFU6JDei6fk8Mt74gSPkKenyAoKbb3XKEhZ80ZvAKiuo3H0qIRwWlaTC5mE1kCe4tJg3eYSZ4h9khHhVh1HWZJZ1Zdq442McyfC2tH3jVWWMxo0HrL9oWYKZD2xRzK7dyGCeeyBNcNZFZInXN1aWDtg3V85xAUaoRVX48jmgGYYzD6A61pHs8RbIsoy9bdbA7heOSOEq0OZJdwEsPxP8ZmBZDaxYckWZgwV1CJC3ghVzRToIasyLBZ8j44P3CKwGuYZIn5ZL8JraoZ5VxP7lRvpM63Bv3RQcT30YmZuW0zsRCF4sie9B4cpqH54zinxZadh40scI2y7k3OZBHrbmUu1SScsTQZx1j5fPDP5XUQVUedZCpKYFVV2Zu4xGohMgvFTST6Jq0xIowktWaFb9MjMHMDQah209JcFNiRgzNdREUMcvWKOGTX7ZvAH9WA3ud31EVpZiAeYnQtIgmf1cDbFRkOHe3CwsLWITjVOid7Y1odPpQBtzcpzbio3yMCqoxXgClxvMTf5W55POheh1paTACMgzxqOlbUOjaQla3or85piGrNtZfR5rXIQZEgA0HzHCGGSETVYGRBhKbQmWkW93lWCaNsUtutONvI53Iu6rKjPmoWcsKn9x8niI5Ehf00dYOzJoVNZIxaD7yk4L1ZatDWA4msZajMWYYb6Crl6mOCSmT3egWO9G4ZcbgjOlohPhVZBbHb6i3ELGxZFjqZxNQphWks83cOy5QWGRmvBHQiCQwsNs5Yr32vayiVvuqSmluxYw4ovSiLzHtikQCmO75OfVhNSqGNViFUJWg7aKUpD0OWnsQtZLA1c5D0LKt2ZjVyPKe8zBVbwbr7a27u2aiWWprQ0EHMSpIXKddciQPR7MaFd1NRlbZ0bfnbcN6P5Z4bF5HvvxOOXIXM1WzM1PTMNFGz3KWSzV0AyNNFD9m8ffhMbwQmUrg5qZjhpDdGHUlcgC9No9B6pUZHQWHJoXsLToKq1XrrBAH6h6xk2uD1Zm8C1ON8Mk2Io9mPK0wZ2glqTl7t6RjKSFkWd5nqV3A5Dmxn7JfRwqnKbBrDv6inZDe4enZH5Zn14DxnNIMZw67xXQ222MBymIjOdzgj0lDFOZkAEV14Jv3u6aMupJXdITetHjoEHzZbiAw44aIZyVJEo1MjQv8swCGnBnRvZiOtiZ0gdMG8luZjbylNnMzG64kWQdFAFDEHJZpuysnRKZoRJBQ3yXW9ucjaMFkjFOZ6c6I72l2Z4sYRQkeERFcnkxg7S2XMzfdZmGQOiLOue6md5AZwZfgwcKYdSRJlndW9iR4AkRLPoU3DZ0GU6iZjoyN54udA4eDJl4RfyjNGbv1B7irr2RA49CWdOMiVVQEf1Z0GQsBP47IZC1RQMNxob00UIRBmtT9g4b7xsxf3fhIfQUMLFOm2GfWdMbMZf0fkN56YED6fLpehMiGp4yfFbwZev2OtKd91EJNyd1fRl79O9sKd1sXyfoeMSB3EYpKXuVic5SYuAkZdhDqSZeOlZnT7vuIeFu7ezIjIcHAQIEtpGs9w5RJIIs22uig65QNW90rquvwAD4OvmHR2pRvfmf4lzo2PpnEfah8DncG3RGTIaZkfNXcBx38s9sCePO4lotytmnB4WdXivCYmihAWusa9asWZEa0Dy6xa3ZhvdpFGiN4O1iuX64NgPjEViYruANGiqnp7HggkSAhPgEEykxEhtWMLik7lRY3SW7iCFvtTgEVJJ6oNldoF1WIxeIPw1bNUbBuWKtIpYyY1TNdkp72sxMeMq8d0rnCRpoCeZg7u1kateOgxC6RCiPhPDCZ27ZffYq4oflc02Ew1pXK78iKel0KklyRTZ32azl8pRfCHyv4LqVxPrWKF0djjzX7Z86cC1c90ik5mZIZcvY2jFppdbQYXSQwQoO18NgGMSyKwwG7MGsFQhgCCrSkEZjfoOseXXxj3OGTEB1GS9IYgAvDcnXs9j408Z2Gc1iZg8dIwKLPRG5H6I5Sfk6Umswsw94fvFEs8ZlAKS7B92c1oylBBsuZ6dByPvtuR4mip2kMhBZEE4vLpzl1EdABc9FbqrWoOxkP9SxBABmAjJMv5hNRXK7inHFBQ8wOKTg3N6Unddyj8hCs29T5aUgXl4cFwIU60lsXes21Mq8FtHg6ZhkbX3Qzwx6eBZIcYvuevXOP87SFwu0JNURtzg4Z4Wc9Efi0zsgTZruDcGIpAEFWEm8qdImcH9NEqv7ayZiOZwYadZGRELUwulnwDwwwEwPALgk2kpuXDNC7oJsOFZ6t49gb0u5odAQsMOlL3ma9DPPbd0Ocy9m9VhjO6k5MFMGgZgR9AvoYW3Uv0XJ3bxHzM5sqAGSCP6uuGXNfEO8As0lZ5VHa7CxsZAppkitZklwiO80TGHHZj9Zg6HWy8j4us6Y7T9Z34h6pZ0W5XZzFZKQlZBITEG2yJixRYc364yxQtv6kXhXjcpZB1E2iNJxZBfOTCQXmysU61crEGKF8cCzf77OyOQezowYI4z9ICE9eKoOceHBbuft9zdr5IjCHKZsX1hxZ6A9cBa3fcwcjC0cRs50
Requires: libpoppler72 = 0.61.1-alt3, libQtCore.so.4 >= set:phiBx69Zqfsb8oVYdPjDet8sZI7Fgi74qVzveefdkeuxDbAjbfNzaehmU6va2D5IG7q1y4FhHnFRoa4StaEyzwZDjpzgmo6wIGJSf87r25lVqG0IBXWp6V8zemZojlDoiq02GFBJli5EgVgaZnK8KFYvVNHB0gDpcnnMOzmiO5aEaHSruUPYgzTiIQkLS1Zv63We1crYtrDWbwgM3ZvaeB7nfjOqv6luYQE98IG9gskiQYy6VGJ7Lyy8187oMBc1AwXiVXvnF5sGaT3E93VGgsURhR1jHbSbNEVtn0mVA58VZz73vPrdDo6qJ87Z1wQhUBM4fIuZJWsLrd4Iys8fMoGbGQPNjbemnU1Zlc3bZnC83EUSl0ZeMfZriZAJwUaeuGKzlGrQZzfi4SKN0Pmm0g1, libQtGui.so.4 >= set:rkQy8isw0JcvAUGh9LqNZ9QdiH7Ohks05lBlPHPQdaNboQxZp3xwhwZCGCp6WZovwU2jkdcAzU8KH1n9RFoFbxl5AfjvJG5wKwVpoEmCmJHbGxqZvxmTZnnCe5mT5Olha2gydyCiFeMbIkkH2yFPUAKQawRa2157QC6cKJkqmYNoES6x3pbhYnti98Z1qArZ4N6hJDmPKNQM6oydKfzZqiGdUI0DJujmrs2WQor7kmr1OTPQZeqnh8SaLxxCj7ej0WXS3xxNZbeoHF0, libQtXml.so.4 >= set:mhpPvJqa2zeOgiwlyxZwGqlI43fPYw2k17z6h1x9ZsuI7WgwmeTCClK1OUnO20, libc.so.6(GLIBC_2.0), libc.so.6(GLIBC_2.1.3), libc.so.6(GLIBC_2.4), libpoppler.so.72 >= set:qhcKHWaUShh5IYOdxIkPxraNSLH3YA0LL9l5CCyoWHuWysSEGEoTZ8GrA1IvJef3rIFDq5s1zkgVNP05dojW6u9ysjICA1CZphE62IfmfeYZ3gcJoF34yHXOcFdMGys4ENugYyHuORHZm71iHZk6I0nzlx0oUmEciORZzrjpb0Zq51ZoZ5heERkoSFFEjBZipyoAeAxrOPhxCZcj1YoklQq24mC01sh1bjeifpqscXLb7UrsAJUgF504I4hZ8p5teoABwIAnIoMkMkyxYmg8W6dYA9gNh8Zcbf8BJbhi7XWYyEBRk57Xg1RGz96qvUU1sLjktNcl8GL7YV2qq8j9ieT94vktyFrhTNCLsTLgmogG9ZfcAWr5IKMCxsSB4sQtSwu86D7ufrf6FvEWJGVlxINHkTDEZsOQ2VToQ7n8hlCr10zCgBOAo3UehXQ9zl2NFxdGX0nbDZ1PHIJ4IGC2nlrP57C7a7Tn3MMaccwrnpproseADuw8IhrORhqK9YQctg5fn1EHvO21B2g9swGfNUXc3CiOIZqasSYAcUq0YmAItU6v9OwnjPIWhnmMBrEJl21dApOMIdhb0hGHM1Z86QMd8XqSEqqt7gcPBaBmvVESEFFQVTyndePGo5hjfs6Y88wGywVXnuu4bXPcx8gCMLxPQvj17MSej86cM5WCOlTwZm7RRVZGcZEdp0Q9QFpTCngVEgCwdqO8QxRs3FWKNvD0VFtkc9jjacFjRuDgDfzANt5gctlc8dAZAOQfREh736Za4zshY1QiFi14BCD1O8ImgKLFHXZvMyxHFS4uk9Uag0xPswJ, libstdc++.so.6(CXXABI_1.3), libstdc++.so.6(GLIBCXX_3.4), rtld(GNU_HASH)
Requires(rpmlib): rpmlib(SetVersions)
Obsoletes: libpoppler08-qt4 < 0.61.1-alt3
Finding debuginfo files (using /usr/lib/rpm/find-debuginfo-files)
Executing: /bin/sh -e /usr/src/tmp/rpm-tmp.UVhXTP
Creating libpoppler4-qt4-debuginfo package
Processing files: libpoppler-qt4-devel-0.61.1-alt3
Finding Provides (using /usr/lib/rpm/find-provides)
Executing: /bin/sh -e /usr/src/tmp/rpm-tmp.kGmVyk
find-provides: running scripts (alternatives,debuginfo,gir,lib,pam,perl,pkgconfig,python,python3,shell,typelib)
Finding Requires (using /usr/lib/rpm/find-requires)
Executing: /bin/sh -e /usr/src/tmp/rpm-tmp.LH9xDs
find-requires: running scripts (cpp,debuginfo,files,gir-js,gir-python,gir,lib,pam,perl,pkgconfig,pkgconfiglib,python,python3,rpmlib,shebang,shell,static,symlinks,typelib)
In file included from /usr/src/tmp/poppler72-buildroot/usr/include/poppler/qt4/poppler-qt4.h:37:
/usr/src/tmp/poppler72-buildroot/usr/include/poppler/qt4/poppler-annotation.h:30:10: fatal error: QtCore/QDateTime: No such file or directory
 #include <QtCore/QDateTime>
          ^~~~~~~~~~~~~~~~~~
compilation terminated.
cpp.req: /usr/src/tmp/poppler72-buildroot/usr/include/poppler/qt4/poppler-qt4.h: cpp failed, trying c++ mode
In file included from /usr/src/tmp/poppler72-buildroot/usr/include/poppler/qt4/poppler-qt4.h:37:
/usr/src/tmp/poppler72-buildroot/usr/include/poppler/qt4/poppler-annotation.h:30:10: fatal error: QtCore/QDateTime: No such file or directory
 #include <QtCore/QDateTime>
          ^~~~~~~~~~~~~~~~~~
compilation terminated.
cpp.req: WARNING: /usr/src/tmp/poppler72-buildroot/usr/include/poppler/qt4/poppler-qt4.h: cpp failed
/usr/src/tmp/poppler72-buildroot/usr/include/poppler/qt4/poppler-form.h:24:10: fatal error: QtCore/QRectF: No such file or directory
 #include <QtCore/QRectF>
          ^~~~~~~~~~~~~~~
compilation terminated.
cpp.req: /usr/src/tmp/poppler72-buildroot/usr/include/poppler/qt4/poppler-form.h: cpp failed, trying c++ mode
/usr/src/tmp/poppler72-buildroot/usr/include/poppler/qt4/poppler-form.h:24:10: fatal error: QtCore/QRectF: No such file or directory
 #include <QtCore/QRectF>
          ^~~~~~~~~~~~~~~
compilation terminated.
cpp.req: WARNING: /usr/src/tmp/poppler72-buildroot/usr/include/poppler/qt4/poppler-form.h: cpp failed
/usr/src/tmp/poppler72-buildroot/usr/include/poppler/qt4/poppler-link.h:27:10: fatal error: QtCore/QString: No such file or directory
 #include <QtCore/QString>
          ^~~~~~~~~~~~~~~~
compilation terminated.
cpp.req: /usr/src/tmp/poppler72-buildroot/usr/include/poppler/qt4/poppler-link.h: cpp failed, trying c++ mode
/usr/src/tmp/poppler72-buildroot/usr/include/poppler/qt4/poppler-link.h:27:10: fatal error: QtCore/QString: No such file or directory
 #include <QtCore/QString>
          ^~~~~~~~~~~~~~~~
compilation terminated.
cpp.req: WARNING: /usr/src/tmp/poppler72-buildroot/usr/include/poppler/qt4/poppler-link.h: cpp failed
/usr/src/tmp/poppler72-buildroot/usr/include/poppler/qt4/poppler-media.h:25:10: fatal error: QtCore/QSize: No such file or directory
 #include <QtCore/QSize>
          ^~~~~~~~~~~~~~
compilation terminated.
cpp.req: /usr/src/tmp/poppler72-buildroot/usr/include/poppler/qt4/poppler-media.h: cpp failed, trying c++ mode
/usr/src/tmp/poppler72-buildroot/usr/include/poppler/qt4/poppler-media.h:25:10: fatal error: QtCore/QSize: No such file or directory
 #include <QtCore/QSize>
          ^~~~~~~~~~~~~~
compilation terminated.
cpp.req: WARNING: /usr/src/tmp/poppler72-buildroot/usr/include/poppler/qt4/poppler-media.h: cpp failed
/usr/src/tmp/poppler72-buildroot/usr/include/poppler/qt4/poppler-annotation.h:30:10: fatal error: QtCore/QDateTime: No such file or directory
 #include <QtCore/QDateTime>
          ^~~~~~~~~~~~~~~~~~
compilation terminated.
cpp.req: /usr/src/tmp/poppler72-buildroot/usr/include/poppler/qt4/poppler-annotation.h: cpp failed, trying c++ mode
/usr/src/tmp/poppler72-buildroot/usr/include/poppler/qt4/poppler-annotation.h:30:10: fatal error: QtCore/QDateTime: No such file or directory
 #include <QtCore/QDateTime>
          ^~~~~~~~~~~~~~~~~~
compilation terminated.
cpp.req: WARNING: /usr/src/tmp/poppler72-buildroot/usr/include/poppler/qt4/poppler-annotation.h: cpp failed
/usr/src/tmp/poppler72-buildroot/usr/include/poppler/qt4/poppler-optcontent.h:25:10: fatal error: QtCore/QAbstractListModel: No such file or directory
 #include <QtCore/QAbstractListModel>
          ^~~~~~~~~~~~~~~~~~~~~~~~~~~
compilation terminated.
cpp.req: /usr/src/tmp/poppler72-buildroot/usr/include/poppler/qt4/poppler-optcontent.h: cpp failed, trying c++ mode
/usr/src/tmp/poppler72-buildroot/usr/include/poppler/qt4/poppler-optcontent.h:25:10: fatal error: QtCore/QAbstractListModel: No such file or directory
 #include <QtCore/QAbstractListModel>
          ^~~~~~~~~~~~~~~~~~~~~~~~~~~
compilation terminated.
cpp.req: WARNING: /usr/src/tmp/poppler72-buildroot/usr/include/poppler/qt4/poppler-optcontent.h: cpp failed
/usr/src/tmp/poppler72-buildroot/usr/include/poppler/qt4/poppler-page-transition.h:26:10: fatal error: QtCore/qglobal.h: No such file or directory
 #include <QtCore/qglobal.h>
          ^~~~~~~~~~~~~~~~~~
compilation terminated.
cpp.req: /usr/src/tmp/poppler72-buildroot/usr/include/poppler/qt4/poppler-page-transition.h: cpp failed, trying c++ mode
/usr/src/tmp/poppler72-buildroot/usr/include/poppler/qt4/poppler-page-transition.h:26:10: fatal error: QtCore/qglobal.h: No such file or directory
 #include <QtCore/qglobal.h>
          ^~~~~~~~~~~~~~~~~~
compilation terminated.
cpp.req: WARNING: /usr/src/tmp/poppler72-buildroot/usr/include/poppler/qt4/poppler-page-transition.h: cpp failed
Provides: pkgconfig(poppler-qt4) = 0.61.1
Requires: libpoppler4-qt4 = 0.61.1-alt3, /usr/lib/libpoppler-qt4.so.4, /usr/lib/pkgconfig
Finding debuginfo files (using /usr/lib/rpm/find-debuginfo-files)
Executing: /bin/sh -e /usr/src/tmp/rpm-tmp.kuUg9l
Processing files: libpoppler72-debuginfo-0.61.1-alt3
Finding Provides (using /usr/lib/rpm/find-provides)
Executing: /bin/sh -e /usr/src/tmp/rpm-tmp.U7OD7N
find-provides: running scripts (debuginfo)
Finding Requires (using /usr/lib/rpm/find-requires)
Executing: /bin/sh -e /usr/src/tmp/rpm-tmp.SQ7grA
find-requires: running scripts (debuginfo)
Provides: debug(libpoppler.so.72)
Requires: libpoppler72 = 0.61.1-alt3, debug(libc.so.6), debug(libcurl.so.4), debug(libfontconfig.so.1), debug(libfreetype.so.6), debug(libgcc_s.so.1), debug(libjpeg.so.62), debug(liblcms2.so.2), debug(libm.so.6), debug(libnspr4.so), debug(libnss3.so), debug(libopenjp2.so.7), debug(libpng16.so.16), debug(libpthread.so.0), debug(libsmime3.so), debug(libstdc++.so.6), debug(libtiff.so.5)
Processing files: libpoppler4-qt4-debuginfo-0.61.1-alt3
Finding Provides (using /usr/lib/rpm/find-provides)
Executing: /bin/sh -e /usr/src/tmp/rpm-tmp.p8o39H
find-provides: running scripts (debuginfo)
Finding Requires (using /usr/lib/rpm/find-requires)
Executing: /bin/sh -e /usr/src/tmp/rpm-tmp.9iMEx6
find-requires: running scripts (debuginfo)
Provides: debug(libpoppler-qt4.so.4)
Requires: libpoppler4-qt4 = 0.61.1-alt3, debug(libQtCore.so.4), debug(libQtGui.so.4), debug(libQtXml.so.4), debug(libc.so.6), debug(libpoppler.so.72), debug(libstdc++.so.6)
Adding to libpoppler4-qt4-debuginfo a strict dependency on libpoppler72-debuginfo
Removing from libpoppler4-qt4-debuginfo 46 sources provided by libpoppler72-debuginfo
also prunning dir /usr/src/debug/poppler-0.61.1/fofi
also prunning dir /usr/src/debug/poppler-0.61.1/goo
also prunning dir /usr/src/debug/poppler-0.61.1/poppler
also prunning dir /usr/src/debug/poppler-0.61.1/splash
Removing 1 extra deps from libpoppler4-qt4 due to dependency on libpoppler72
Removing 1 extra deps from libpoppler-qt4-devel due to dependency on libpoppler4-qt4
Removing 1 extra deps from libpoppler4-qt4-debuginfo due to dependency on libpoppler72-debuginfo
Removing 7 extra deps from libpoppler4-qt4 due to repentancy on libpoppler72
Removing 2 extra deps from libpoppler4-qt4-debuginfo due to repentancy on libpoppler72-debuginfo
warning: Installed (but unpackaged) file(s) found:
    /usr/lib/libpoppler.so
    /usr/lib/pkgconfig/poppler-cairo.pc
    /usr/lib/pkgconfig/poppler-splash.pc
    /usr/lib/pkgconfig/poppler.pc
Wrote: /usr/src/RPM/RPMS/i586/libpoppler72-0.61.1-alt3.i586.rpm
Wrote: /usr/src/RPM/RPMS/i586/libpoppler4-qt4-0.61.1-alt3.i586.rpm
Wrote: /usr/src/RPM/RPMS/i586/libpoppler-qt4-devel-0.61.1-alt3.i586.rpm
Wrote: /usr/src/RPM/RPMS/i586/libpoppler72-debuginfo-0.61.1-alt3.i586.rpm
Wrote: /usr/src/RPM/RPMS/i586/libpoppler4-qt4-debuginfo-0.61.1-alt3.i586.rpm
200.98user 16.03system 2:13.57elapsed 162%CPU (0avgtext+0avgdata 170272maxresident)k
0inputs+0outputs (0major+5430325minor)pagefaults 0swaps
228.38user 22.97system 2:54.30elapsed 144%CPU (0avgtext+0avgdata 170272maxresident)k
2000inputs+0outputs (0major+6268357minor)pagefaults 0swaps
error: open of /ALT/repo/sisyphus/task/archive/_215/220204/files/i586/RPMS/libpoppler-qt4-devel-0.61.1-alt3.i586.rpm failed: No such file or directory
error: open of /ALT/repo/sisyphus/task/archive/_215/220204/files/i586/RPMS/libpoppler4-qt4-0.61.1-alt3.i586.rpm failed: No such file or directory
error: open of /ALT/repo/sisyphus/task/archive/_215/220204/files/i586/RPMS/libpoppler4-qt4-debuginfo-0.61.1-alt3.i586.rpm failed: No such file or directory
error: open of /ALT/repo/sisyphus/task/archive/_215/220204/files/i586/RPMS/libpoppler72-0.61.1-alt3.i586.rpm failed: No such file or directory
error: open of /ALT/repo/sisyphus/task/archive/_215/220204/files/i586/RPMS/libpoppler72-debuginfo-0.61.1-alt3.i586.rpm failed: No such file or directory