<86>Jan 24 07:38:15 userdel[30145]: delete user 'rooter'
<86>Jan 24 07:38:15 userdel[30145]: removed group 'rooter' owned by 'rooter'
<86>Jan 24 07:38:15 userdel[30145]: removed shadow group 'rooter' owned by 'rooter'
<86>Jan 24 07:38:15 groupadd[30176]: group added to /etc/group: name=rooter, GID=543
<86>Jan 24 07:38:15 groupadd[30176]: group added to /etc/gshadow: name=rooter
<86>Jan 24 07:38:15 groupadd[30176]: new group: name=rooter, GID=543
<86>Jan 24 07:38:15 useradd[30197]: new user: name=rooter, UID=543, GID=543, home=/root, shell=/bin/bash
<86>Jan 24 07:38:15 userdel[30224]: delete user 'builder'
<86>Jan 24 07:38:15 userdel[30224]: removed group 'builder' owned by 'builder'
<86>Jan 24 07:38:15 groupadd[30239]: group added to /etc/group: name=builder, GID=544
<86>Jan 24 07:38:15 groupadd[30239]: group added to /etc/gshadow: name=builder
<86>Jan 24 07:38:15 groupadd[30239]: new group: name=builder, GID=544
<86>Jan 24 07:38:15 useradd[30249]: new user: name=builder, UID=544, GID=544, home=/usr/src, shell=/bin/bash
<13>Jan 24 07:38:20 rpmi: rpm-macros-ubt-0.2-alt2 1488208885 installed
<13>Jan 24 07:38:20 rpmi: rpm-build-ubt-0.3.1-alt3 sisyphus.213781.100 1538147677 installed
warning: Macro %cmake not found
warning: Macro %cmake_build not found
warning: Macro %cmakeinstall_std not found
<13>Jan 24 07:38:27 rpmi: libexpat-2.2.4-alt1 1503305345 installed
<13>Jan 24 07:38:27 rpmi: libsqlite3-3.26.0-alt1 sisyphus.219274.100 1547430858 installed
<13>Jan 24 07:38:27 rpmi: libxkbcommon-0.8.2-alt1 1533800181 installed
<13>Jan 24 07:38:27 rpmi: libglvnd-7:1.1.0-alt3 sisyphus.215982.100 1541498632 installed
<13>Jan 24 07:38:27 rpmi: qt5-base-common-5.11.3-alt1 sisyphus.217836.100 1545040818 installed
<13>Jan 24 07:38:27 rpmi: libmtdev-1.1.5-alt1 1399539297 installed
<13>Jan 24 07:38:27 rpmi: libpng16-1.6.36-alt1 sisyphus+219478.100.1.1 1547633314 installed
<13>Jan 24 07:38:27 rpmi: libICE-1.0.9-alt1 1409902721 installed
<13>Jan 24 07:38:27 rpmi: libwayland-server-1.16.0-alt1 1535614871 installed
<13>Jan 24 07:38:27 rpmi: libnspr-1:4.20-alt1 sisyphus.216395.100 1542113039 installed
<13>Jan 24 07:38:27 rpmi: libgdbm-1.8.3-alt10 1454943334 installed
<13>Jan 24 07:38:27 rpmi: libidn2-2.1.0-alt2 sisyphus+219831.100.1.1 1548176663 installed
<13>Jan 24 07:38:27 rpmi: libSM-1.2.3-alt1 sisyphus.215747.100 1540812795 installed
<13>Jan 24 07:38:27 rpmi: rpm-macros-qt5-5.11.3-alt1 sisyphus.217836.100 1545040569 installed
<13>Jan 24 07:38:27 rpmi: libOpenGL-7:1.1.0-alt3 sisyphus.215982.100 1541498632 installed
<13>Jan 24 07:38:27 rpmi: libGLES-7:1.1.0-alt3 sisyphus.215982.100 1541498632 installed
<13>Jan 24 07:38:27 rpmi: libsqlite3-devel-3.26.0-alt1 sisyphus.219274.100 1547430858 installed
<13>Jan 24 07:38:27 rpmi: xxd-4:8.1.26-alt1 1528475306 installed
<13>Jan 24 07:38:27 rpmi: python-modules-curses-2.7.15-alt1 sisyphus.217364.100 1544022423 installed
<13>Jan 24 07:38:27 rpmi: libts-1.0-alt1.qa1 1366249315 installed
<13>Jan 24 07:38:27 rpmi: libproxy-0.4.15-alt2 sisyphus.214008.100 1538585336 installed
<13>Jan 24 07:38:27 rpmi: libpcre2-10.32-alt1 sisyphus.212994.100 1536866761 installed
<13>Jan 24 07:38:27 rpmi: vapi-common-0.42.5-alt1 sisyphus+219796.100.1.1 1548157684 installed
<13>Jan 24 07:38:27 rpmi: libapt-0.5.15lorg2-alt61 sisyphus.218765.400 1547197197 installed
<13>Jan 24 07:38:27 rpmi: libjpeg-2:1.5.1-alt1 1498218318 installed
<13>Jan 24 07:38:27 rpmi: libwacom-data-0.32-alt1 sisyphus.216114.100 1541407217 installed
<13>Jan 24 07:38:27 rpmi: udev-rules-1:240-alt4 sisyphus.219244.100 1547241418 installed
<13>Jan 24 07:38:28 rpmi: libicu63-1:6.3.1-alt1 sisyphus.215328.100 1540049988 installed
<13>Jan 24 07:38:29 rpmi: libqt5-core-5.11.3-alt1 sisyphus.217836.100 1545040818 installed
<13>Jan 24 07:38:29 rpmi: libqt5-concurrent-5.11.3-alt1 sisyphus.217836.100 1545040818 installed
<13>Jan 24 07:38:29 rpmi: libqt5-sql-5.11.3-alt1 sisyphus.217836.100 1545040818 installed
<13>Jan 24 07:38:29 rpmi: libqt5-test-5.11.3-alt1 sisyphus.217836.100 1545040818 installed
<13>Jan 24 07:38:29 rpmi: libqt5-xml-5.11.3-alt1 sisyphus.217836.100 1545040818 installed
<13>Jan 24 07:38:29 rpmi: libgudev-1:232-alt3 1523738518 installed
<13>Jan 24 07:38:29 rpmi: libwacom-0.32-alt1 sisyphus.216114.100 1541407221 installed
<13>Jan 24 07:38:29 rpmi: libgraphite2-1.3.13-alt1 sisyphus.218545.100 1545686511 installed
<13>Jan 24 07:38:29 rpmi: libharfbuzz-2.2.0-alt1 sisyphus.218134.500 1545261518 installed
<13>Jan 24 07:38:29 rpmi: libfreetype-2.9.1-alt1.S1 1530781053 installed
<13>Jan 24 07:38:29 rpmi: fontconfig-2.13.1-alt1 sisyphus.215917.100 1540973886 installed
Updating fonts cache: <29>Jan 24 07:38:30 fontconfig: Updating fonts cache: succeeded
[ DONE ]
<13>Jan 24 07:38:30 rpmi: libevdev-1.6.0-alt1 sisyphus.215605.100 1540547069 installed
<13>Jan 24 07:38:30 rpmi: libinput-1.12.6-alt1 sisyphus+219722.300.2.2 1548107560 installed
<13>Jan 24 07:38:30 rpmi: liblz4-1:1.8.3-alt2 sisyphus.217095.200 1547082375 installed
<13>Jan 24 07:38:30 rpmi: xorg-proto-devel-2018.4-alt3 1527685079 installed
<13>Jan 24 07:38:30 rpmi: libxshmfence-1.2-alt2 1518613552 installed
<13>Jan 24 07:38:30 rpmi: libX11-locales-3:1.6.7-alt1 sisyphus.214413.200 1539171080 installed
<13>Jan 24 07:38:30 rpmi: libXdmcp-1.1.1-alt1 1334617701 installed
<13>Jan 24 07:38:30 rpmi: libXau-1.0.8-alt1 1369565808 installed
<13>Jan 24 07:38:30 rpmi: libxcb-1.13.1-alt1 sisyphus.214413.100 1539170896 installed
<13>Jan 24 07:38:30 rpmi: libX11-3:1.6.7-alt1 sisyphus.214413.200 1539171143 installed
<13>Jan 24 07:38:30 rpmi: libXext-1.3.3-alt1 1409902959 installed
<13>Jan 24 07:38:30 rpmi: libXxf86vm-1.1.4-alt2 1527672187 installed
<13>Jan 24 07:38:30 rpmi: libXi-1.7.9-alt1.S1 1515755342 installed
<13>Jan 24 07:38:30 rpmi: libXdamage-1.1.3-alt4 1297162593 installed
<13>Jan 24 07:38:30 rpmi: libXfixes-5.0.3-alt1 sisyphus.216396.300 1542022162 installed
<13>Jan 24 07:38:30 rpmi: libXrender-0.9.8-alt1 1371312112 installed
<13>Jan 24 07:38:33 rpmi: libxcb-devel-1.13.1-alt1 sisyphus.214413.100 1539170896 installed
<13>Jan 24 07:38:33 rpmi: libX11-devel-3:1.6.7-alt1 sisyphus.214413.200 1539171143 installed
<13>Jan 24 07:38:33 rpmi: libxcbutil-icccm-0.4.1-alt1 1396161557 installed
<13>Jan 24 07:38:33 rpmi: libxcbutil-1:0.4.0-alt1 1413392888 installed
<13>Jan 24 07:38:33 rpmi: libxcbutil-image-0.4.0-alt1 1446204182 installed
<13>Jan 24 07:38:33 rpmi: libxcbutil-keysyms-0.4.0-alt1 1446204124 installed
<13>Jan 24 07:38:33 rpmi: libxcb-render-util-0.3.9-alt3 sisyphus.213915.600 1538554008 installed
<13>Jan 24 07:38:33 rpmi: libxkbcommon-x11-0.8.2-alt1 1533800181 installed
<13>Jan 24 07:38:33 rpmi: libwayland-client-1.16.0-alt1 1535614871 installed
<13>Jan 24 07:38:33 rpmi: libpciaccess-1:0.14-alt1 1528969252 installed
<13>Jan 24 07:38:33 rpmi: libdrm-1:2.4.96-alt1 sisyphus.215486.100 1540374027 installed
<13>Jan 24 07:38:33 rpmi: libGLX-mesa-4:18.3.2-alt1 sisyphus+219595.100.1.1 1547814036 installed
<13>Jan 24 07:38:33 rpmi: libgbm-4:18.3.2-alt1 sisyphus+219595.100.1.1 1547814036 installed
<13>Jan 24 07:38:33 rpmi: libEGL-mesa-4:18.3.2-alt1 sisyphus+219595.100.1.1 1547814036 installed
<13>Jan 24 07:38:33 rpmi: libEGL-7:1.1.0-alt3 sisyphus.215982.100 1541498632 installed
<13>Jan 24 07:38:33 rpmi: libGLX-7:1.1.0-alt3 sisyphus.215982.100 1541498632 installed
<13>Jan 24 07:38:33 rpmi: libGL-7:1.1.0-alt3 sisyphus.215982.100 1541498632 installed
<13>Jan 24 07:38:33 rpmi: libglvnd-devel-7:1.1.0-alt3 sisyphus.215982.100 1541498632 installed
<13>Jan 24 07:38:33 rpmi: libEGL-devel-4:18.3.2-alt1 sisyphus+219595.100.1.1 1547814036 installed
<13>Jan 24 07:38:33 rpmi: libGL-devel-4:18.3.2-alt1 sisyphus+219595.100.1.1 1547814036 installed
<13>Jan 24 07:38:33 rpmi: libxapian-1.4.5-alt3 sisyphus.215025.100 1539610704 installed
<13>Jan 24 07:38:33 rpmi: python-sphinx-objects.inv-1:2.3.8.20190122-alt1 sisyphus+219845.100.1.1 1548202828 installed
<13>Jan 24 07:38:33 rpmi: libgpg-error-1.31-alt1.S1 1529015802 installed
<13>Jan 24 07:38:34 rpmi: libgcrypt20-1.8.3-alt4 sisyphus.218050.200 1545223289 installed
<13>Jan 24 07:38:34 rpmi: libsystemd-1:240-alt4 sisyphus.219244.100 1547241502 installed
<13>Jan 24 07:38:34 rpmi: libdbus-1.12.12-alt1 sisyphus.217336.100 1544000923 installed
<13>Jan 24 07:38:34 rpmi: libavahi-0.6.32-alt1 1500485702 installed
<13>Jan 24 07:38:34 rpmi: libqt5-dbus-5.11.3-alt1 sisyphus.217836.100 1545040818 installed
<13>Jan 24 07:38:34 rpmi: libxslt-1.1.32-alt2 1517429984 installed
<13>Jan 24 07:38:34 rpmi: libffi-devel-1:3.2.1-alt2 1528881777 installed
<13>Jan 24 07:38:34 rpmi: xml-utils-1:2.9.4.0.12.e905-alt1.1 1525115767 installed
<13>Jan 24 07:38:34 rpmi: rpm-build-gir-0.7.2-alt4 1534675014 installed
<13>Jan 24 07:38:34 rpmi: gcc-c++-common-1.4.23-alt1 sisyphus.218115.200 1545282875 installed
<13>Jan 24 07:38:34 rpmi: libstdc++8-devel-8.2.1-alt3 sisyphus.219333.200 1547468342 installed
<13>Jan 24 07:38:36 rpmi: gcc8-c++-8.2.1-alt3 sisyphus.219333.200 1547468342 installed
<13>Jan 24 07:38:36 rpmi: gcc-c++-8-alt1 sisyphus.214000.40 1542664775 installed
<13>Jan 24 07:38:36 rpmi: libuv-1.23.2-alt1 sisyphus.217108.100 1543612230 installed
<13>Jan 24 07:38:36 rpmi: librhash-1.3.5-alt2 1505156279 installed
<13>Jan 24 07:38:36 rpmi: libjsoncpp19-1.8.4-alt2.S1 1518769525 installed
<13>Jan 24 07:38:36 rpmi: publicsuffix-list-dafsa-20181106-alt1 sisyphus.216228.100 1541611754 installed
<13>Jan 24 07:38:36 rpmi: libpsl-0.20.2-alt2 sisyphus.216228.200 1541611889 installed
<13>Jan 24 07:38:36 rpmi: libnghttp2-1.34.0-alt1 sisyphus.214524.100 1539249634 installed
<13>Jan 24 07:38:36 rpmi: libverto-0.3.0-alt1_5 1525957714 installed
<13>Jan 24 07:38:36 rpmi: libkeyutils-1.6-alt2 sisyphus.217337.100 1544003161 installed
<13>Jan 24 07:38:36 rpmi: libcom_err-1.44.5-alt1 sisyphus.218838.100 1546206118 installed
<13>Jan 24 07:38:36 rpmi: libbrotlicommon-1.0.7-alt1 sisyphus.215491.100 1540428597 installed
<13>Jan 24 07:38:36 rpmi: libbrotlidec-1.0.7-alt1 sisyphus.215491.100 1540428597 installed
<13>Jan 24 07:38:36 rpmi: libnettle6-3.4.1-alt1 sisyphus.217427.100 1544107917 installed
<13>Jan 24 07:38:36 rpmi: libarchive13-3.3.1-alt2 sisyphus.219343.100 1547461970 installed
<13>Jan 24 07:38:36 rpmi: rpm-macros-cmake-3.13.1-alt1 sisyphus.217317.100 1544006298 installed
<13>Jan 24 07:38:36 rpmi: cmake-modules-3.13.1-alt1 sisyphus.217317.100 1544006285 installed
<13>Jan 24 07:38:36 rpmi: libtasn1-4.13-alt2 1521133850 installed
<13>Jan 24 07:38:36 rpmi: libp11-kit-0.23.9-alt5 1525798298 installed
<13>Jan 24 07:38:36 rpmi: libyaml2-0.2.1-alt1 sisyphus.214707.100 1539464411 installed
<13>Jan 24 07:38:36 rpmi: libstemmer-0-alt1.svn585 1428058060 installed
<13>Jan 24 07:38:36 rpmi: shared-mime-info-1.12-alt1 sisyphus+219597.100.2.2 1548057005 installed
<13>Jan 24 07:38:37 rpmi: gsettings-desktop-schemas-data-3.28.1-alt1 sisyphus.212587.100 1536082062 installed
<13>Jan 24 07:38:37 rpmi: libgio-2.58.3-alt1 sisyphus+219722.100.1.1 1548088777 installed
<13>Jan 24 07:38:37 rpmi: gsettings-desktop-schemas-3.28.1-alt1 sisyphus.212587.100 1536082066 installed
<13>Jan 24 07:38:37 rpmi: gobject-introspection-1.58.3-alt1 sisyphus.218857.100 1546259916 installed
<13>Jan 24 07:38:37 rpmi: appstream-0.12.4-alt1 sisyphus.218480.100 1545646498 installed
<13>Jan 24 07:38:37 rpmi: gobject-introspection-x11-1.58.3-alt1 sisyphus.218857.100 1546259916 installed
<13>Jan 24 07:38:37 rpmi: libgstreamer1.0-1.14.4-alt1 sisyphus.214120.2200 1538778557 installed
<13>Jan 24 07:38:37 rpmi: libpolkit-0.115-alt5 sisyphus.219065.100 1547027030 installed
<13>Jan 24 07:38:37 rpmi: rpm-macros-alternatives-0.5.0-alt1 sisyphus.219012.300 1546745004 installed
<13>Jan 24 07:38:37 rpmi: alternatives-0.5.0-alt1 sisyphus.219012.300 1546745004 installed
<13>Jan 24 07:38:37 rpmi: ca-certificates-2018.11.12-alt1 sisyphus.216395.300 1542114035 installed
<13>Jan 24 07:38:37 rpmi: ca-trust-0.1.1-alt2 1515595785 installed
<13>Jan 24 07:38:37 rpmi: p11-kit-trust-0.23.9-alt5 1525798298 installed
<13>Jan 24 07:38:37 rpmi: libcrypto1.1-1.1.0j-alt1 sisyphus.216647.100 1542743878 installed
<13>Jan 24 07:38:37 rpmi: libssl1.1-1.1.0j-alt1 sisyphus.216647.100 1542743878 installed
<13>Jan 24 07:38:37 rpmi: libpython3-3.6.5-alt1.1 1535734576 installed
<13>Jan 24 07:38:37 rpmi: rpm-build-python3-0.1.13.1-alt2 1535450458 installed
<13>Jan 24 07:38:37 rpmi: tests-for-installed-python3-pkgs-0.1.13.1-alt2 1535450458 installed
<13>Jan 24 07:38:37 rpmi: python3-3.6.5-alt1.1 1535734576 installed
<13>Jan 24 07:38:39 rpmi: python3-base-3.6.5-alt1.1 1535734576 installed
<13>Jan 24 07:38:39 rpmi: python3-module-pkg_resources-1:40.6.3-alt1 sisyphus+219164.200.2.1 1548188195 installed
<13>Jan 24 07:38:39 rpmi: python3-module-six-1.12.0-alt1 sisyphus+219665.100.2.1 1548148570 installed
<86>Jan 24 07:38:39 groupadd[26292]: group added to /etc/group: name=_keytab, GID=499
<86>Jan 24 07:38:39 groupadd[26292]: group added to /etc/gshadow: name=_keytab
<86>Jan 24 07:38:39 groupadd[26292]: new group: name=_keytab, GID=499
<13>Jan 24 07:38:39 rpmi: libkrb5-1.16.3-alt1 sisyphus.219042.100 1547045815 installed
<13>Jan 24 07:38:39 rpmi: glib2-devel-2.58.3-alt1 sisyphus+219722.100.1.1 1548088777 installed
<13>Jan 24 07:38:39 rpmi: python3-module-idna-2.7-alt1 1530720902 installed
<13>Jan 24 07:38:39 rpmi: libqt5-network-5.11.3-alt1 sisyphus.217836.100 1545040818 installed
<13>Jan 24 07:38:39 rpmi: libqt5-xcbqpa-5.11.3-alt1 sisyphus.217836.100 1545040818 installed
<13>Jan 24 07:38:39 rpmi: libqt5-eglfskmssupport-5.11.3-alt1 sisyphus.217836.100 1545040818 installed
<13>Jan 24 07:38:39 rpmi: libqt5-eglfsdeviceintegration-5.11.3-alt1 sisyphus.217836.100 1545040818 installed
<13>Jan 24 07:38:40 rpmi: libqt5-gui-5.11.3-alt1 sisyphus.217836.100 1545040818 installed
<13>Jan 24 07:38:40 rpmi: libqt5-widgets-5.11.3-alt1 sisyphus.217836.100 1545040818 installed
<13>Jan 24 07:38:40 rpmi: libqt5-opengl-5.11.3-alt1 sisyphus.217836.100 1545040818 installed
<13>Jan 24 07:38:40 rpmi: libgio-devel-2.58.3-alt1 sisyphus+219722.100.1.1 1548088777 installed
<86>Jan 24 07:38:40 groupadd[28248]: group added to /etc/group: name=sasl, GID=498
<86>Jan 24 07:38:40 groupadd[28248]: group added to /etc/gshadow: name=sasl
<86>Jan 24 07:38:40 groupadd[28248]: new group: name=sasl, GID=498
<13>Jan 24 07:38:40 rpmi: libsasl2-3-2.1.27-alt1 sisyphus.218476.200 1545647755 installed
<13>Jan 24 07:38:40 rpmi: libldap-2.4.46-alt1 1535562135 installed
<13>Jan 24 07:38:40 rpmi: libcurl-7.63.0-alt1 sisyphus.217831.100 1544762811 installed
<13>Jan 24 07:38:40 rpmi: libcups-2.2.6-alt1 1510070343 installed
<13>Jan 24 07:38:40 rpmi: libqt5-printsupport-5.11.3-alt1 sisyphus.217836.100 1545040818 installed
<13>Jan 24 07:38:40 rpmi: libtirpc-1.0.3-alt1 1532008017 installed
<13>Jan 24 07:38:40 rpmi: libnsl2-1.1.0-alt1_1 1511548749 installed
<13>Jan 24 07:38:40 rpmi: python-modules-compiler-2.7.15-alt1 sisyphus.217364.100 1544022423 installed
<13>Jan 24 07:38:40 rpmi: python-modules-email-2.7.15-alt1 sisyphus.217364.100 1544022423 installed
<13>Jan 24 07:38:40 rpmi: python-modules-unittest-2.7.15-alt1 sisyphus.217364.100 1544022423 installed
<13>Jan 24 07:38:40 rpmi: python-modules-nis-2.7.15-alt1 sisyphus.217364.100 1544022423 installed
<13>Jan 24 07:38:41 rpmi: python-modules-encodings-2.7.15-alt1 sisyphus.217364.100 1544022423 installed
<13>Jan 24 07:38:41 rpmi: python-modules-2.7.15-alt1 sisyphus.217364.100 1544022423 installed
<13>Jan 24 07:38:41 rpmi: python-modules-xml-2.7.15-alt1 sisyphus.217364.100 1544022423 installed
<13>Jan 24 07:38:41 rpmi: python-modules-hotshot-2.7.15-alt1 sisyphus.217364.100 1544022423 installed
<13>Jan 24 07:38:41 rpmi: python-modules-bsddb-2.7.15-alt1 sisyphus.217364.100 1544022423 installed
<13>Jan 24 07:38:41 rpmi: python-modules-ctypes-2.7.15-alt1 sisyphus.217364.100 1544022423 installed
<13>Jan 24 07:38:41 rpmi: python-modules-multiprocessing-2.7.15-alt1 sisyphus.217364.100 1544022423 installed
<13>Jan 24 07:38:41 rpmi: python-modules-logging-2.7.15-alt1 sisyphus.217364.100 1544022423 installed
<13>Jan 24 07:38:41 rpmi: python-2.7.15-alt1 sisyphus.217364.100 1544022423 installed
<13>Jan 24 07:38:41 rpmi: python-modules-distutils-2.7.15-alt1 sisyphus.217364.100 1544022423 installed
<13>Jan 24 07:38:41 rpmi: python-modules-json-2.7.15-alt1 sisyphus.217364.100 1544022423 installed
<13>Jan 24 07:38:41 rpmi: python3-module-more-itertools-5.0.0-alt1 sisyphus.218699.100 1545980609 installed
<13>Jan 24 07:38:41 rpmi: python3-module-ntlm-1.1.0-alt1.1.1.1 1460405346 installed
<13>Jan 24 07:38:41 rpmi: python3-module-pycparser-2.19-alt1 sisyphus.216095.100 1541345023 installed
<13>Jan 24 07:38:41 rpmi: python3-module-cffi-1.10.0-alt1.1 1525117736 installed
<13>Jan 24 07:38:41 rpmi: python3-module-asn1crypto-0.24.0-alt1 1521037480 installed
<13>Jan 24 07:38:41 rpmi: python3-module-cryptography-2.4.2-alt1 sisyphus.216799.200 1543487260 installed
<13>Jan 24 07:38:41 rpmi: python3-module-OpenSSL-18.0.0-alt1 1532996168 installed
<13>Jan 24 07:38:42 rpmi: python3-module-pytz-1:2016.10-alt1 1484291011 installed
<13>Jan 24 07:38:42 rpmi: python3-module-babel-1:2.4.0-alt1.1 1517644530 installed
<13>Jan 24 07:38:42 rpmi: python3-module-zope.interface-4.5.0-alt1.qa1 sisyphus.214938.100 1539939473 installed
<13>Jan 24 07:38:42 rpmi: python3-module-chameleon.core-3.1-alt1.2 1527237057 installed
<13>Jan 24 07:38:42 rpmi: python3-module-polib-1.0.5-alt1.1.2 1526977584 installed
<13>Jan 24 07:38:42 rpmi: python3-module-lingua-4.13-alt1.1 1517783822 installed
<13>Jan 24 07:38:42 rpmi: python3-module-genshi-0.7-alt1.1.1.1 1460400448 installed
<13>Jan 24 07:38:43 rpmi: python3-module-webencodings-0.5.1-alt1.1 1517943573 installed
<13>Jan 24 07:38:43 rpmi: python3-module-cssselect-0.9.1-alt1.2 1526980827 installed
<13>Jan 24 07:38:43 rpmi: python3-module-html5lib-1:0.999999999-alt4.qa1 sisyphus.214868.100 1539741045 installed
<13>Jan 24 07:38:43 rpmi: python3-module-lxml-4.3.0-alt1 sisyphus.219015.100 1546759265 installed
<13>Jan 24 07:38:43 rpmi: python3-module-docutils-0.14-alt2 1535729778 installed
<13>Jan 24 07:38:43 rpmi: python3-module-chardet-3.0.4-alt1 1506613818 installed
<13>Jan 24 07:38:43 rpmi: python3-module-ndg-0.4.2-alt1.qa1 1531457735 installed
<13>Jan 24 07:38:43 rpmi: python3-module-ndg-httpsclient-0.4.2-alt1.qa1 1531457735 installed
<13>Jan 24 07:38:43 rpmi: python3-module-urllib3-2:1.24.1-alt2 sisyphus.218529.100 1545673498 installed
<13>Jan 24 07:38:43 rpmi: python3-module-requests-2.21.0-alt1 sisyphus.218511.200 1545669878 installed
<13>Jan 24 07:38:43 rpmi: python3-module-imagesize-0.7.1-alt1 1461387704 installed
<13>Jan 24 07:38:43 rpmi: python3-module-markupsafe-0.23-alt1.2.1.1 1525118834 installed
<13>Jan 24 07:38:43 rpmi: python3-module-jinja2-2.10-alt1 1521724576 installed
<13>Jan 24 07:38:43 rpmi: python3-module-atomicwrites-1.2.1-alt1 sisyphus.214347.100 1539076636 installed
<13>Jan 24 07:38:43 rpmi: python3-module-attrs-18.2.0-alt1 sisyphus.214354.100 1539088435 installed
<13>Jan 24 07:38:43 rpmi: python3-module-pluggy-0.8.1-alt1 sisyphus.219350.100 1547468434 installed
<13>Jan 24 07:38:43 rpmi: python3-module-py-1.7.0-alt1 sisyphus.214414.220 1539670883 installed
<13>Jan 24 07:38:43 rpmi: python3-module-pytest-3.10.1-alt3 sisyphus+219849.1200.10.1 1548275625 installed
<13>Jan 24 07:38:43 rpmi: python3-module-snowballstemmer-1.2.0-alt2.1 1457859319 installed
<13>Jan 24 07:38:44 rpmi: python3-module-whoosh-2.7.4-alt1 1527698183 installed
<13>Jan 24 07:38:44 rpmi: python3-module-xapian-1.4.5-alt2.qa1 1531484078 installed
<13>Jan 24 07:38:44 rpmi: python3-module-markdown-2.6.7-alt1.1 1517789319 installed
<13>Jan 24 07:38:44 rpmi: python3-module-packagekit-1.1.12-alt1 sisyphus.210919.274 1545820026 installed
<13>Jan 24 07:38:44 rpmi: libpackagekit-glib-1.1.12-alt1 sisyphus.210919.274 1545820042 installed
<13>Jan 24 07:38:44 rpmi: packagekit-1.1.12-alt1 sisyphus.210919.274 1545820042 installed
error reading information on service packagekit: No such file or directory
<13>Jan 24 07:38:44 rpmi: python3-modules-sqlite3-3.6.5-alt1.1 1535734576 installed
<13>Jan 24 07:38:44 rpmi: python3-module-SQLAlchemy-1.2.15-alt1 sisyphus.219175.100 1547139402 installed
<13>Jan 24 07:38:44 rpmi: python3-module-sphinxcontrib-websupport-1.0.1-alt3.qa1 sisyphus.214922.100 1539851266 installed
<13>Jan 24 07:38:44 rpmi: python3-module-alabaster-0.7.6-alt3 1526385201 installed
<13>Jan 24 07:38:44 rpmi: python3-module-Pygments-2.2.0-alt2 1526455576 installed
<13>Jan 24 07:38:45 rpmi: python3-module-sphinx-1:1.6.5-alt3 sisyphus.213215.100 1537280252 installed
<13>Jan 24 07:38:45 rpmi: libnss-3.40.1-alt1 sisyphus.218259.100 1545764952 installed
<13>Jan 24 07:38:45 rpmi: python3-module-nss-1.0.1-alt2.S1.1 1525119671 installed
<13>Jan 24 07:38:45 rpmi: python3-module-beaker-1.9.0-alt1 1521467136 installed
<13>Jan 24 07:38:45 rpmi: python3-module-mako-1.0.1-alt1.1.1.1 1460400692 installed
<13>Jan 24 07:38:46 rpmi: gobject-introspection-devel-1.58.3-alt1 sisyphus.218857.100 1546259916 installed
<13>Jan 24 07:38:46 rpmi: libpackagekit-glib-devel-1.1.12-alt1 sisyphus.210919.274 1545820042 installed
<13>Jan 24 07:38:47 rpmi: qt5-base-devel-5.11.3-alt1 sisyphus.217836.100 1545040818 installed
<13>Jan 24 07:38:47 rpmi: cmake-3.13.1-alt1 sisyphus.217317.100 1544006298 installed
<13>Jan 24 07:38:47 rpmi: libssl-devel-1.1.0j-alt1 sisyphus.216647.100 1542743878 installed
Building target platforms: i586
Building for target i586
Wrote: /usr/src/in/nosrpm/packagekit-qt-1.0.1-alt2.nosrc.rpm
Installing packagekit-qt-1.0.1-alt2.src.rpm
Building target platforms: i586
Building for target i586
Executing(%prep): /bin/sh -e /usr/src/tmp/rpm-tmp.39703
+ umask 022
+ /bin/mkdir -p /usr/src/RPM/BUILD
+ cd /usr/src/RPM/BUILD
+ cd /usr/src/RPM/BUILD
+ rm -rf PackageKit-Qt-1.0.1
+ echo 'Source #0 (PackageKit-Qt-1.0.1.tar):'
Source #0 (PackageKit-Qt-1.0.1.tar):
+ /bin/tar -xf /usr/src/RPM/SOURCES/PackageKit-Qt-1.0.1.tar
+ cd PackageKit-Qt-1.0.1
+ /bin/chmod -c -Rf u+rwX,go-w .
+ exit 0
Executing(%build): /bin/sh -e /usr/src/tmp/rpm-tmp.99221
+ umask 022
+ /bin/mkdir -p /usr/src/RPM/BUILD
+ cd /usr/src/RPM/BUILD
+ cd PackageKit-Qt-1.0.1
+ mkdir -p BUILD
+ __cmake
+ pushd BUILD
~/RPM/BUILD/PackageKit-Qt-1.0.1/BUILD ~/RPM/BUILD/PackageKit-Qt-1.0.1
+ cmake .. -DCMAKE_SKIP_RPATH:BOOL=ON -DCMAKE_SKIP_INSTALL_RPATH:BOOL=yes '-DCMAKE_C_FLAGS:STRING=-pipe -frecord-gcc-switches -Wall -g -O2 -march=i586 -mtune=generic' '-DCMAKE_CXX_FLAGS:STRING=-pipe -frecord-gcc-switches -Wall -g -O2 -march=i586 -mtune=generic' '-DCMAKE_Fortran_FLAGS:STRING=-pipe -frecord-gcc-switches -Wall -g -O2 -march=i586 -mtune=generic' -DCMAKE_INSTALL_PREFIX=/usr -DINCLUDE_INSTALL_DIR:PATH=/usr/include -DLIB_INSTALL_DIR:PATH=/usr/lib -DSYSCONF_INSTALL_DIR:PATH=/etc -DSHARE_INSTALL_PREFIX:PATH=/usr/share -DLIB_DESTINATION=lib -DLIB_SUFFIX=
-- The C compiler identification is GNU 8.2.1
-- The CXX compiler identification is GNU 8.2.1
-- Check for working C compiler: /usr/bin/cc
-- Check for working C compiler: /usr/bin/cc -- works
-- Detecting C compiler ABI info
-- Detecting C compiler ABI info - done
-- Detecting C compile features
-- Detecting C compile features - done
-- Check for working CXX compiler: /usr/bin/c++
-- Check for working CXX compiler: /usr/bin/c++ -- works
-- Detecting CXX compiler ABI info
-- Detecting CXX compiler ABI info - done
-- Detecting CXX compile features
-- Detecting CXX compile features - done
-- Configuring done
-- Generating done
CMake Warning:
  Manually-specified variables were not used by the project:

    CMAKE_Fortran_FLAGS
    CMAKE_SKIP_INSTALL_RPATH
    INCLUDE_INSTALL_DIR
    LIB_DESTINATION
    LIB_INSTALL_DIR
    LIB_SUFFIX
    SHARE_INSTALL_PREFIX
    SYSCONF_INSTALL_DIR


-- Build files have been written to: /usr/src/RPM/BUILD/PackageKit-Qt-1.0.1/BUILD
+ popd
~/RPM/BUILD/PackageKit-Qt-1.0.1
+ make -j8 -C BUILD
make[2]: Entering directory '/usr/src/RPM/BUILD/PackageKit-Qt-1.0.1/BUILD'
Scanning dependencies of target packagekitqt5_autogen
make[2]: Leaving directory '/usr/src/RPM/BUILD/PackageKit-Qt-1.0.1/BUILD'
make[2]: Entering directory '/usr/src/RPM/BUILD/PackageKit-Qt-1.0.1/BUILD'
[  6%] Automatic MOC for target packagekitqt5
make[2]: Leaving directory '/usr/src/RPM/BUILD/PackageKit-Qt-1.0.1/BUILD'
make[1]: Entering directory '/usr/src/RPM/BUILD/PackageKit-Qt-1.0.1/BUILD'
[  6%] Built target packagekitqt5_autogen
make[1]: Leaving directory '/usr/src/RPM/BUILD/PackageKit-Qt-1.0.1/BUILD'
make[2]: Entering directory '/usr/src/RPM/BUILD/PackageKit-Qt-1.0.1/BUILD'
[ 18%] Generating daemonproxy.cpp, daemonproxy.h
make[2]: Leaving directory '/usr/src/RPM/BUILD/PackageKit-Qt-1.0.1/BUILD'
make[2]: Entering directory '/usr/src/RPM/BUILD/PackageKit-Qt-1.0.1/BUILD'
[ 12%] Generating transactionproxy.cpp, transactionproxy.h
make[2]: Leaving directory '/usr/src/RPM/BUILD/PackageKit-Qt-1.0.1/BUILD'
make[2]: Entering directory '/usr/src/RPM/BUILD/PackageKit-Qt-1.0.1/BUILD'
[ 25%] Generating daemonproxy.moc
make[2]: Leaving directory '/usr/src/RPM/BUILD/PackageKit-Qt-1.0.1/BUILD'
make[2]: Entering directory '/usr/src/RPM/BUILD/PackageKit-Qt-1.0.1/BUILD'
[ 31%] Generating transactionproxy.moc
make[2]: Leaving directory '/usr/src/RPM/BUILD/PackageKit-Qt-1.0.1/BUILD'
make[2]: Entering directory '/usr/src/RPM/BUILD/PackageKit-Qt-1.0.1/BUILD'
Scanning dependencies of target packagekitqt5
make[2]: Leaving directory '/usr/src/RPM/BUILD/PackageKit-Qt-1.0.1/BUILD'
make[2]: Entering directory '/usr/src/RPM/BUILD/PackageKit-Qt-1.0.1/BUILD'
[ 37%] Building CXX object src/CMakeFiles/packagekitqt5.dir/bitfield.cpp.o
make[2]: Leaving directory '/usr/src/RPM/BUILD/PackageKit-Qt-1.0.1/BUILD'
make[2]: Entering directory '/usr/src/RPM/BUILD/PackageKit-Qt-1.0.1/BUILD'
[ 75%] Building CXX object src/CMakeFiles/packagekitqt5.dir/details.cpp.o
make[2]: Leaving directory '/usr/src/RPM/BUILD/PackageKit-Qt-1.0.1/BUILD'
make[2]: Entering directory '/usr/src/RPM/BUILD/PackageKit-Qt-1.0.1/BUILD'
[ 93%] Building CXX object src/CMakeFiles/packagekitqt5.dir/packagekitqt5_autogen/mocs_compilation.cpp.o
make[2]: Leaving directory '/usr/src/RPM/BUILD/PackageKit-Qt-1.0.1/BUILD'
make[2]: Entering directory '/usr/src/RPM/BUILD/PackageKit-Qt-1.0.1/BUILD'
[ 50%] Building CXX object src/CMakeFiles/packagekitqt5.dir/daemonprivate.cpp.o
make[2]: Leaving directory '/usr/src/RPM/BUILD/PackageKit-Qt-1.0.1/BUILD'
make[2]: Entering directory '/usr/src/RPM/BUILD/PackageKit-Qt-1.0.1/BUILD'
[ 68%] Building CXX object src/CMakeFiles/packagekitqt5.dir/offline.cpp.o
make[2]: Leaving directory '/usr/src/RPM/BUILD/PackageKit-Qt-1.0.1/BUILD'
make[2]: Entering directory '/usr/src/RPM/BUILD/PackageKit-Qt-1.0.1/BUILD'
[ 56%] Building CXX object src/CMakeFiles/packagekitqt5.dir/transaction.cpp.o
make[2]: Leaving directory '/usr/src/RPM/BUILD/PackageKit-Qt-1.0.1/BUILD'
make[2]: Entering directory '/usr/src/RPM/BUILD/PackageKit-Qt-1.0.1/BUILD'
[ 62%] Building CXX object src/CMakeFiles/packagekitqt5.dir/transactionprivate.cpp.o
make[2]: Leaving directory '/usr/src/RPM/BUILD/PackageKit-Qt-1.0.1/BUILD'
make[2]: Entering directory '/usr/src/RPM/BUILD/PackageKit-Qt-1.0.1/BUILD'
[ 87%] Building CXX object src/CMakeFiles/packagekitqt5.dir/transactionproxy.cpp.o
make[2]: Leaving directory '/usr/src/RPM/BUILD/PackageKit-Qt-1.0.1/BUILD'
make[2]: Entering directory '/usr/src/RPM/BUILD/PackageKit-Qt-1.0.1/BUILD'
[ 50%] Building CXX object src/CMakeFiles/packagekitqt5.dir/daemon.cpp.o
make[2]: Leaving directory '/usr/src/RPM/BUILD/PackageKit-Qt-1.0.1/BUILD'
make[2]: Entering directory '/usr/src/RPM/BUILD/PackageKit-Qt-1.0.1/BUILD'
[ 81%] Building CXX object src/CMakeFiles/packagekitqt5.dir/daemonproxy.cpp.o
make[2]: Leaving directory '/usr/src/RPM/BUILD/PackageKit-Qt-1.0.1/BUILD'
make[2]: Entering directory '/usr/src/RPM/BUILD/PackageKit-Qt-1.0.1/BUILD'
[100%] Linking CXX shared library libpackagekitqt5.so
make[2]: Leaving directory '/usr/src/RPM/BUILD/PackageKit-Qt-1.0.1/BUILD'
make[1]: Entering directory '/usr/src/RPM/BUILD/PackageKit-Qt-1.0.1/BUILD'
[100%] Built target packagekitqt5
make[1]: Leaving directory '/usr/src/RPM/BUILD/PackageKit-Qt-1.0.1/BUILD'
+ exit 0
Executing(%install): /bin/sh -e /usr/src/tmp/rpm-tmp.99636
+ umask 022
+ /bin/mkdir -p /usr/src/RPM/BUILD
+ cd /usr/src/RPM/BUILD
+ /bin/chmod -Rf u+rwX -- /usr/src/tmp/packagekit-qt-buildroot
+ :
+ /bin/rm -rf -- /usr/src/tmp/packagekit-qt-buildroot
+ cd PackageKit-Qt-1.0.1
+ make 'INSTALL=/bin/install -p' install DESTDIR=/usr/src/tmp/packagekit-qt-buildroot -C BUILD
make: Entering directory '/usr/src/RPM/BUILD/PackageKit-Qt-1.0.1/BUILD'
make[1]: Entering directory '/usr/src/RPM/BUILD/PackageKit-Qt-1.0.1/BUILD'
make[2]: Entering directory '/usr/src/RPM/BUILD/PackageKit-Qt-1.0.1/BUILD'
make[2]: Leaving directory '/usr/src/RPM/BUILD/PackageKit-Qt-1.0.1/BUILD'
make[2]: Entering directory '/usr/src/RPM/BUILD/PackageKit-Qt-1.0.1/BUILD'
[  6%] Automatic MOC for target packagekitqt5
make[2]: Leaving directory '/usr/src/RPM/BUILD/PackageKit-Qt-1.0.1/BUILD'
[  6%] Built target packagekitqt5_autogen
make[2]: Entering directory '/usr/src/RPM/BUILD/PackageKit-Qt-1.0.1/BUILD'
make[2]: Leaving directory '/usr/src/RPM/BUILD/PackageKit-Qt-1.0.1/BUILD'
[100%] Built target packagekitqt5
make[1]: Leaving directory '/usr/src/RPM/BUILD/PackageKit-Qt-1.0.1/BUILD'
Install the project...
-- Install configuration: ""
-- Installing: /usr/src/tmp/packagekit-qt-buildroot/usr/lib/cmake/packagekitqt5/PackageKitQtTargets.cmake
-- Installing: /usr/src/tmp/packagekit-qt-buildroot/usr/lib/cmake/packagekitqt5/PackageKitQtTargets-noconfig.cmake
-- Installing: /usr/src/tmp/packagekit-qt-buildroot/usr/lib/libpackagekitqt5.so.1.0.1
-- Installing: /usr/src/tmp/packagekit-qt-buildroot/usr/lib/libpackagekitqt5.so.1
-- Installing: /usr/src/tmp/packagekit-qt-buildroot/usr/lib/libpackagekitqt5.so
-- Installing: /usr/src/tmp/packagekit-qt-buildroot/usr/lib/pkgconfig/packagekitqt5.pc
-- Installing: /usr/src/tmp/packagekit-qt-buildroot/usr/include/packagekitqt5/PackageKit/Daemon
-- Installing: /usr/src/tmp/packagekit-qt-buildroot/usr/include/packagekitqt5/PackageKit/Transaction
-- Installing: /usr/src/tmp/packagekit-qt-buildroot/usr/include/packagekitqt5/PackageKit/common.h
-- Installing: /usr/src/tmp/packagekit-qt-buildroot/usr/include/packagekitqt5/PackageKit/daemon.h
-- Installing: /usr/src/tmp/packagekit-qt-buildroot/usr/include/packagekitqt5/PackageKit/transaction.h
-- Installing: /usr/src/tmp/packagekit-qt-buildroot/usr/include/packagekitqt5/PackageKit/Details
-- Installing: /usr/src/tmp/packagekit-qt-buildroot/usr/include/packagekitqt5/PackageKit/details.h
-- Installing: /usr/src/tmp/packagekit-qt-buildroot/usr/include/packagekitqt5/PackageKit/bitfield.h
-- Installing: /usr/src/tmp/packagekit-qt-buildroot/usr/include/packagekitqt5/PackageKit/packagekitqt_global.h
-- Installing: /usr/src/tmp/packagekit-qt-buildroot/usr/include/packagekitqt5/PackageKit/offline.h
-- Installing: /usr/src/tmp/packagekit-qt-buildroot/usr/include/packagekitqt5/PackageKit/Offline
-- Installing: /usr/src/tmp/packagekit-qt-buildroot/usr/lib/cmake/packagekitqt5/packagekitqt5-config.cmake
-- Installing: /usr/src/tmp/packagekit-qt-buildroot/usr/lib/cmake/packagekitqt5/packagekitqt5-config-version.cmake
make: Leaving directory '/usr/src/RPM/BUILD/PackageKit-Qt-1.0.1/BUILD'
+ /usr/lib/rpm/brp-alt
Cleaning files in /usr/src/tmp/packagekit-qt-buildroot (auto)
mode of './usr/lib/libpackagekitqt5.so.1.0.1' changed from 0755 (rwxr-xr-x) to 0644 (rw-r--r--)
Verifying and fixing files in /usr/src/tmp/packagekit-qt-buildroot (binconfig,pkgconfig,libtool,desktop)
/usr/lib/pkgconfig/packagekitqt5.pc: Libs: '-L${libdir} -lpackagekitqt5' --> '-lpackagekitqt5'
Checking contents of files in /usr/src/tmp/packagekit-qt-buildroot/ (default)
Compressing files in /usr/src/tmp/packagekit-qt-buildroot (auto)
Adjusting library links in /usr/src/tmp/packagekit-qt-buildroot
./usr/lib:
	libpackagekitqt5.so.1 -> libpackagekitqt5.so.1.0.1
Verifying ELF objects in /usr/src/tmp/packagekit-qt-buildroot (arch=normal,fhs=normal,lfs=relaxed,lint=relaxed,rpath=normal,stack=normal,textrel=normal,unresolved=normal)
Hardlinking identical .pyc and .opt-?.pyc files
Hardlinking identical .pyc and .pyo files
Processing files: libpackagekitqt5_1-1.0.1-alt2
Executing(%doc): /bin/sh -e /usr/src/tmp/rpm-tmp.80642
+ umask 022
+ /bin/mkdir -p /usr/src/RPM/BUILD
+ cd /usr/src/RPM/BUILD
+ cd PackageKit-Qt-1.0.1
+ DOCDIR=/usr/src/tmp/packagekit-qt-buildroot/usr/share/doc/libpackagekitqt5_1-1.0.1
+ export DOCDIR
+ rm -rf /usr/src/tmp/packagekit-qt-buildroot/usr/share/doc/libpackagekitqt5_1-1.0.1
+ /bin/mkdir -p /usr/src/tmp/packagekit-qt-buildroot/usr/share/doc/libpackagekitqt5_1-1.0.1
+ cp -prL AUTHORS NEWS COPYING /usr/src/tmp/packagekit-qt-buildroot/usr/share/doc/libpackagekitqt5_1-1.0.1
+ chmod -R go-w /usr/src/tmp/packagekit-qt-buildroot/usr/share/doc/libpackagekitqt5_1-1.0.1
+ chmod -R a+rX /usr/src/tmp/packagekit-qt-buildroot/usr/share/doc/libpackagekitqt5_1-1.0.1
+ exit 0
warning: File listed twice: /usr/lib/libpackagekitqt5.so.1
Finding Provides (using /usr/lib/rpm/find-provides)
Executing: /bin/sh -e /usr/src/tmp/rpm-tmp.VrcbTs
find-provides: running scripts (alternatives,debuginfo,gir,lib,pam,perl,pkgconfig,python,python3,shell,typelib)
lib.prov: /usr/src/tmp/packagekit-qt-buildroot/usr/lib/libpackagekitqt5.so.1: 230 symbols, 18 bpp
Finding Requires (using /usr/lib/rpm/find-requires)
Executing: /bin/sh -e /usr/src/tmp/rpm-tmp.45YaFA
find-requires: running scripts (cpp,debuginfo,files,gir-js,gir-python,gir,lib,pam,perl,pkgconfig,pkgconfiglib,python,python3,rpmlib,shebang,shell,static,symlinks,typelib)
Provides: libpackagekitqt5.so.1 = set:ldeoheiZlKORjy9KOYWqdKTWW4AnqHfa4dyF6ZiAJq0xUxruIyNkh6goX1xJCdM2wYmTb8AXNDKQlIZmC9Y1RdLX1RWT3VTZtFZAKbq1Iuz7CZxBZleSTHegtPZt9a4ZqJjrKtUWaJM4l5cbhgpBs1F1YEuL9WMzatpanMOni9dcyCjGjZuHIA142tOlLE6thQeszeZHtB8IcW51CuZhlJ8HDtIZb1LZj8RmduEBD08HDLTEP0wXESqteZ4c08ZcDDymuVpbvCIZhSxL8qDf0RJEg7Z4DsBgOfjawtc61bmZbSvWaP2i6XfcGZcUtQuRO2P6kXwEzmyvqKZ2AECsaPwQKzm6PF468JWZlVGNwo1XTsSskUp0fskETtRQWudf2gKcAZ4nQGD7jJi80LlfJBPBYtTZgFJUhs0XxHOlh5eau3lK8Kah67LrUzABSSPpm6wwUK2e2
Requires: libQt5Core.so.5 >= set:qjoZodl2HsQTKg5bT4I4QEWZdqfgP1zcZv8BuTORoI9IrHpRmAQ7eJzNwEZiZD4DanKy14ZGfZFNtadvxrznUh9jX0fyFVASPebY0rUSDmtAqOzBvLanbIQ1VI38yZxVnMOZEp3EPZhHEQjFkMEZqvyyeHzftjPoglEU4OY8OnsXDbe4JeJebSyGj7tLK0nOIPO4zLIhgae0Cok6NYv1LTeXNZ9cJRuEWNIXh0IvqeAsZI8Wxcj1UJf3v0OqdUXzwTiMfVqFJ7CHdOKcZpRk4il5aJTMI7SkFMNypR1VuvKWSSp488ekZmhu9v1GWnfO1o94Jse5GK0pdLcWIaSNgCWnvTwEiMzJZyo8ZvDrExw0, libQt5Core.so.5(Qt_5), libQt5Core.so.5(Qt_5.11), libQt5DBus.so.5 >= set:mglgsZ8xhkaxL31EHeZA8r2glGs0cEnLrgZIYn8U10WpntbyjwhERiAFSMJPtSYPDM5ImoUT1XL1rKqT6ew23ezY1Ra7Z24J5ZEX, libQt5DBus.so.5(Qt_5), libc.so.6(GLIBC_2.0), libc.so.6(GLIBC_2.1.3), libgcc_s.so.1(GCC_3.0), libstdc++.so.6(CXXABI_1.3), libstdc++.so.6(GLIBCXX_3.4), rtld(GNU_HASH)
Requires(rpmlib): rpmlib(SetVersions)
Finding debuginfo files (using /usr/lib/rpm/find-debuginfo-files)
Executing: /bin/sh -e /usr/src/tmp/rpm-tmp.KvFMON
Creating libpackagekitqt5_1-debuginfo package
Processing files: packagekit-qt-devel-1.0.1-alt2
Finding Provides (using /usr/lib/rpm/find-provides)
Executing: /bin/sh -e /usr/src/tmp/rpm-tmp.KnEccO
find-provides: running scripts (alternatives,debuginfo,gir,lib,pam,perl,pkgconfig,python,python3,shell,typelib)
Finding Requires (using /usr/lib/rpm/find-requires)
Executing: /bin/sh -e /usr/src/tmp/rpm-tmp.JdSbwn
find-requires: running scripts (cpp,debuginfo,files,gir-js,gir-python,gir,lib,pam,perl,pkgconfig,pkgconfiglib,python,python3,rpmlib,shebang,shell,static,symlinks,typelib)
In file included from /usr/include/qt5/QtCore/qatomic.h:46,
                 from /usr/include/qt5/QtCore/qrefcount.h:43,
                 from /usr/include/qt5/QtCore/qbytearray.h:44,
                 from /usr/include/qt5/QtCore/qstring.h:49,
                 from /usr/include/qt5/QtCore/qobject.h:47,
                 from /usr/include/qt5/QtCore/QObject:1,
                 from /usr/src/tmp/packagekit-qt-buildroot/usr/include/packagekitqt5/PackageKit/daemon.h:25:
/usr/include/qt5/QtCore/qbasicatomic.h:61:4: error: #error "Qt requires C++11 support"
 #  error "Qt requires C++11 support"
    ^~~~~
In file included from /usr/include/qt5/QtCore/qstring.h:49,
                 from /usr/include/qt5/QtCore/qobject.h:47,
                 from /usr/include/qt5/QtCore/QObject:1,
                 from /usr/src/tmp/packagekit-qt-buildroot/usr/include/packagekitqt5/PackageKit/daemon.h:25:
/usr/include/qt5/QtCore/qbytearray.h:52:10: fatal error: string: No such file or directory
 #include <string>
          ^~~~~~~~
compilation terminated.
cpp.req: /usr/src/tmp/packagekit-qt-buildroot/usr/include/packagekitqt5/PackageKit/daemon.h: cpp failed, trying c++ mode
In file included from /usr/include/qt5/QtCore/qnamespace.h:43,
                 from /usr/include/qt5/QtCore/qobjectdefs.h:48,
                 from /usr/include/qt5/QtCore/qobject.h:46,
                 from /usr/include/qt5/QtCore/QObject:1,
                 from /usr/src/tmp/packagekit-qt-buildroot/usr/include/packagekitqt5/PackageKit/daemon.h:25:
/usr/include/qt5/QtCore/qglobal.h:1177:4: error: #error "You must build your code with position independent code if Qt was built with -reduce-relocations. " "Compile your code with -fPIC (-fPIE is not enough)."
 #  error "You must build your code with position independent code if Qt was built with -reduce-relocations. "\
    ^~~~~
cpp.req: WARNING: /usr/src/tmp/packagekit-qt-buildroot/usr/include/packagekitqt5/PackageKit/daemon.h: cpp failed
In file included from /usr/include/qt5/QtCore/qatomic.h:46,
                 from /usr/include/qt5/QtCore/qvariant.h:43,
                 from /usr/include/qt5/QtCore/QVariantMap:1,
                 from /usr/src/tmp/packagekit-qt-buildroot/usr/include/packagekitqt5/PackageKit/details.h:24:
/usr/include/qt5/QtCore/qbasicatomic.h:61:4: error: #error "Qt requires C++11 support"
 #  error "Qt requires C++11 support"
    ^~~~~
In file included from /usr/include/qt5/QtCore/qvariant.h:44,
                 from /usr/include/qt5/QtCore/QVariantMap:1,
                 from /usr/src/tmp/packagekit-qt-buildroot/usr/include/packagekitqt5/PackageKit/details.h:24:
/usr/include/qt5/QtCore/qbytearray.h:52:10: fatal error: string: No such file or directory
 #include <string>
          ^~~~~~~~
compilation terminated.
cpp.req: /usr/src/tmp/packagekit-qt-buildroot/usr/include/packagekitqt5/PackageKit/details.h: cpp failed, trying c++ mode
In file included from /usr/include/qt5/QtCore/qatomic.h:41,
                 from /usr/include/qt5/QtCore/qvariant.h:43,
                 from /usr/include/qt5/QtCore/QVariantMap:1,
                 from /usr/src/tmp/packagekit-qt-buildroot/usr/include/packagekitqt5/PackageKit/details.h:24:
/usr/include/qt5/QtCore/qglobal.h:1177:4: error: #error "You must build your code with position independent code if Qt was built with -reduce-relocations. " "Compile your code with -fPIC (-fPIE is not enough)."
 #  error "You must build your code with position independent code if Qt was built with -reduce-relocations. "\
    ^~~~~
cpp.req: WARNING: /usr/src/tmp/packagekit-qt-buildroot/usr/include/packagekitqt5/PackageKit/details.h: cpp failed
In file included from /usr/include/qt5/QtCore/qatomic.h:46,
                 from /usr/include/qt5/QtCore/qrefcount.h:43,
                 from /usr/include/qt5/QtCore/qbytearray.h:44,
                 from /usr/include/qt5/QtCore/qstring.h:49,
                 from /usr/include/qt5/QtCore/qobject.h:47,
                 from /usr/include/qt5/QtCore/QObject:1,
                 from /usr/src/tmp/packagekit-qt-buildroot/usr/include/packagekitqt5/PackageKit/offline.h:23:
/usr/include/qt5/QtCore/qbasicatomic.h:61:4: error: #error "Qt requires C++11 support"
 #  error "Qt requires C++11 support"
    ^~~~~
In file included from /usr/include/qt5/QtCore/qstring.h:49,
                 from /usr/include/qt5/QtCore/qobject.h:47,
                 from /usr/include/qt5/QtCore/QObject:1,
                 from /usr/src/tmp/packagekit-qt-buildroot/usr/include/packagekitqt5/PackageKit/offline.h:23:
/usr/include/qt5/QtCore/qbytearray.h:52:10: fatal error: string: No such file or directory
 #include <string>
          ^~~~~~~~
compilation terminated.
cpp.req: /usr/src/tmp/packagekit-qt-buildroot/usr/include/packagekitqt5/PackageKit/offline.h: cpp failed, trying c++ mode
In file included from /usr/include/qt5/QtCore/qnamespace.h:43,
                 from /usr/include/qt5/QtCore/qobjectdefs.h:48,
                 from /usr/include/qt5/QtCore/qobject.h:46,
                 from /usr/include/qt5/QtCore/QObject:1,
                 from /usr/src/tmp/packagekit-qt-buildroot/usr/include/packagekitqt5/PackageKit/offline.h:23:
/usr/include/qt5/QtCore/qglobal.h:1177:4: error: #error "You must build your code with position independent code if Qt was built with -reduce-relocations. " "Compile your code with -fPIC (-fPIE is not enough)."
 #  error "You must build your code with position independent code if Qt was built with -reduce-relocations. "\
    ^~~~~
cpp.req: WARNING: /usr/src/tmp/packagekit-qt-buildroot/usr/include/packagekitqt5/PackageKit/offline.h: cpp failed
In file included from /usr/include/qt5/QtCore/qatomic.h:46,
                 from /usr/include/qt5/QtCore/qmetatype.h:45,
                 from /usr/include/qt5/QtCore/QMetaType:1,
                 from /usr/src/tmp/packagekit-qt-buildroot/usr/include/packagekitqt5/PackageKit/bitfield.h:25:
/usr/include/qt5/QtCore/qbasicatomic.h:61:4: error: #error "Qt requires C++11 support"
 #  error "Qt requires C++11 support"
    ^~~~~
In file included from /usr/include/qt5/QtCore/qmetatype.h:46,
                 from /usr/include/qt5/QtCore/QMetaType:1,
                 from /usr/src/tmp/packagekit-qt-buildroot/usr/include/packagekitqt5/PackageKit/bitfield.h:25:
/usr/include/qt5/QtCore/qbytearray.h:52:10: fatal error: string: No such file or directory
 #include <string>
          ^~~~~~~~
compilation terminated.
cpp.req: /usr/src/tmp/packagekit-qt-buildroot/usr/include/packagekitqt5/PackageKit/bitfield.h: cpp failed, trying c++ mode
In file included from /usr/include/qt5/QtCore/QtGlobal:1,
                 from /usr/src/tmp/packagekit-qt-buildroot/usr/include/packagekitqt5/PackageKit/bitfield.h:24:
/usr/include/qt5/QtCore/qglobal.h:1177:4: error: #error "You must build your code with position independent code if Qt was built with -reduce-relocations. " "Compile your code with -fPIC (-fPIE is not enough)."
 #  error "You must build your code with position independent code if Qt was built with -reduce-relocations. "\
    ^~~~~
cpp.req: WARNING: /usr/src/tmp/packagekit-qt-buildroot/usr/include/packagekitqt5/PackageKit/bitfield.h: cpp failed
In file included from /usr/include/qt5/QtCore/qatomic.h:46,
                 from /usr/include/qt5/QtCore/qrefcount.h:43,
                 from /usr/include/qt5/QtCore/qbytearray.h:44,
                 from /usr/include/qt5/QtCore/qstring.h:49,
                 from /usr/include/qt5/QtCore/qobject.h:47,
                 from /usr/include/qt5/QtCore/QObject:1,
                 from /usr/src/tmp/packagekit-qt-buildroot/usr/include/packagekitqt5/PackageKit/transaction.h:25:
/usr/include/qt5/QtCore/qbasicatomic.h:61:4: error: #error "Qt requires C++11 support"
 #  error "Qt requires C++11 support"
    ^~~~~
In file included from /usr/include/qt5/QtCore/qstring.h:49,
                 from /usr/include/qt5/QtCore/qobject.h:47,
                 from /usr/include/qt5/QtCore/QObject:1,
                 from /usr/src/tmp/packagekit-qt-buildroot/usr/include/packagekitqt5/PackageKit/transaction.h:25:
/usr/include/qt5/QtCore/qbytearray.h:52:10: fatal error: string: No such file or directory
 #include <string>
          ^~~~~~~~
compilation terminated.
cpp.req: /usr/src/tmp/packagekit-qt-buildroot/usr/include/packagekitqt5/PackageKit/transaction.h: cpp failed, trying c++ mode
In file included from /usr/include/qt5/QtCore/qnamespace.h:43,
                 from /usr/include/qt5/QtCore/qobjectdefs.h:48,
                 from /usr/include/qt5/QtCore/qobject.h:46,
                 from /usr/include/qt5/QtCore/QObject:1,
                 from /usr/src/tmp/packagekit-qt-buildroot/usr/include/packagekitqt5/PackageKit/transaction.h:25:
/usr/include/qt5/QtCore/qglobal.h:1177:4: error: #error "You must build your code with position independent code if Qt was built with -reduce-relocations. " "Compile your code with -fPIC (-fPIE is not enough)."
 #  error "You must build your code with position independent code if Qt was built with -reduce-relocations. "\
    ^~~~~
cpp.req: WARNING: /usr/src/tmp/packagekit-qt-buildroot/usr/include/packagekitqt5/PackageKit/transaction.h: cpp failed
Provides: PackageKit-Qt5-devel = 1.0.1-alt2, pkgconfig(packagekitqt5) = 1.0.1
Requires: /usr/lib/libpackagekitqt5.so.1, /usr/lib/pkgconfig, pkgconfig(Qt5Core), pkgconfig(Qt5DBus), qt5-base-devel
Finding debuginfo files (using /usr/lib/rpm/find-debuginfo-files)
Executing: /bin/sh -e /usr/src/tmp/rpm-tmp.xa2CPx
Processing files: libpackagekitqt5_1-debuginfo-1.0.1-alt2
Finding Provides (using /usr/lib/rpm/find-provides)
Executing: /bin/sh -e /usr/src/tmp/rpm-tmp.NrYsKC
find-provides: running scripts (debuginfo)
Finding Requires (using /usr/lib/rpm/find-requires)
Executing: /bin/sh -e /usr/src/tmp/rpm-tmp.DzBDnU
find-requires: running scripts (debuginfo)
Provides: debug(libpackagekitqt5.so.1)
Requires: libpackagekitqt5_1 = 1.0.1-alt2, debug(libQt5Core.so.5), debug(libQt5DBus.so.5), debug(libc.so.6), debug(libgcc_s.so.1), debug(libstdc++.so.6)
Adding to packagekit-qt-devel a strict dependency on libpackagekitqt5_1
Removing 1 extra deps from packagekit-qt-devel due to dependency on libpackagekitqt5_1
Wrote: /usr/src/RPM/RPMS/i586/libpackagekitqt5_1-1.0.1-alt2.i586.rpm
Wrote: /usr/src/RPM/RPMS/i586/packagekit-qt-devel-1.0.1-alt2.i586.rpm
Wrote: /usr/src/RPM/RPMS/i586/libpackagekitqt5_1-debuginfo-1.0.1-alt2.i586.rpm
92.63user 6.50system 1:24.34elapsed 117%CPU (0avgtext+0avgdata 209476maxresident)k
0inputs+0outputs (0major+1161740minor)pagefaults 0swaps
133.17user 17.00system 2:24.69elapsed 103%CPU (0avgtext+0avgdata 209476maxresident)k
3496inputs+0outputs (0major+1880427minor)pagefaults 0swaps
--- libpackagekitqt5_1-1.0.1-alt2.i586.rpm.repo	2018-12-27 08:17:23.000000000 +0000
+++ libpackagekitqt5_1-1.0.1-alt2.i586.rpm.hasher	2019-01-24 07:40:24.980831382 +0000
@@ -20,3 +20,2 @@
 Provides: libpackagekitqt5.so.1 = set:ldeoheiZlKORjy9KOYWqdKTWW4AnqHfa4dyF6ZiAJq0xUxruIyNkh6goX1xJCdM2wYmTb8AXNDKQlIZmC9Y1RdLX1RWT3VTZtFZAKbq1Iuz7CZxBZleSTHegtPZt9a4ZqJjrKtUWaJM4l5cbhgpBs1F1YEuL9WMzatpanMOni9dcyCjGjZuHIA142tOlLE6thQeszeZHtB8IcW51CuZhlJ8HDtIZb1LZj8RmduEBD08HDLTEP0wXESqteZ4c08ZcDDymuVpbvCIZhSxL8qDf0RJEg7Z4DsBgOfjawtc61bmZbSvWaP2i6XfcGZcUtQuRO2P6kXwEzmyvqKZ2AECsaPwQKzm6PF468JWZlVGNwo1XTsSskUp0fskETtRQWudf2gKcAZ4nQGD7jJi80LlfJBPBYtTZgFJUhs0XxHOlh5eau3lK8Kah67LrUzABSSPpm6wwUK2e2
-Provides: .sisyphus.218660.100.1.1-libpackagekitqt5_1-1.0.1-alt2  
 Provides: libpackagekitqt5_1 = 1.0.1-alt2
--- libpackagekitqt5_1-debuginfo-1.0.1-alt2.i586.rpm.repo	2018-12-27 08:17:23.000000000 +0000
+++ libpackagekitqt5_1-debuginfo-1.0.1-alt2.i586.rpm.hasher	2019-01-24 07:40:25.021830216 +0000
@@ -32,3 +32,3 @@
 /usr/src/debug/PackageKit-Qt-1.0.1/src/transactionprivate.h	100644	
-Requires: .sisyphus.218660.100.1.1-libpackagekitqt5_1-1.0.1-alt2  
+Requires: libpackagekitqt5_1 = 1.0.1-alt2
 Requires: debug(libQt5Core.so.5)  
--- packagekit-qt-devel-1.0.1-alt2.i586.rpm.repo	2018-12-27 08:17:23.000000000 +0000
+++ packagekit-qt-devel-1.0.1-alt2.i586.rpm.hasher	2019-01-24 07:40:25.051829363 +0000
@@ -24,3 +24,3 @@
 Requires: qt5-base-devel  
-Requires: .sisyphus.218660.100.1.1-libpackagekitqt5_1-1.0.1-alt2  
+Requires: libpackagekitqt5_1 = 1.0.1-alt2
 Requires: rpmlib(PayloadIsLzma)