<86>Jan 15 08:24:25 userdel[128935]: delete user 'rooter'
<86>Jan 15 08:24:25 userdel[128935]: removed group 'rooter' owned by 'rooter'
<86>Jan 15 08:24:25 userdel[128935]: removed shadow group 'rooter' owned by 'rooter'
<86>Jan 15 08:24:25 groupadd[128952]: group added to /etc/group: name=rooter, GID=639
<86>Jan 15 08:24:25 groupadd[128952]: group added to /etc/gshadow: name=rooter
<86>Jan 15 08:24:25 groupadd[128952]: new group: name=rooter, GID=639
<86>Jan 15 08:24:25 useradd[128965]: new user: name=rooter, UID=639, GID=639, home=/root, shell=/bin/bash
<86>Jan 15 08:24:25 userdel[128988]: delete user 'builder'
<86>Jan 15 08:24:25 userdel[128988]: removed group 'builder' owned by 'builder'
<86>Jan 15 08:24:25 userdel[128988]: removed shadow group 'builder' owned by 'builder'
<86>Jan 15 08:24:25 groupadd[129003]: group added to /etc/group: name=builder, GID=640
<86>Jan 15 08:24:25 groupadd[129003]: group added to /etc/gshadow: name=builder
<86>Jan 15 08:24:25 groupadd[129003]: new group: name=builder, GID=640
<86>Jan 15 08:24:25 useradd[129017]: new user: name=builder, UID=640, GID=640, home=/usr/src, shell=/bin/bash
warning: Macro %cmake not found
warning: Macro %cmake_build not found
warning: Macro %cmakeinstall_std not found
<13>Jan 15 08:24:29 rpmi: libexpat-2.2.4-alt1 1503305345 installed
<13>Jan 15 08:24:29 rpmi: libxkbcommon-0.8.2-alt1 1533800181 installed
<13>Jan 15 08:24:29 rpmi: libglvnd-7:1.1.0-alt3 sisyphus.215982.100 1541498632 installed
<13>Jan 15 08:24:29 rpmi: qt5-base-common-5.11.3-alt1 sisyphus.217836.100 1545040818 installed
<13>Jan 15 08:24:29 rpmi: qt5-tools-common-5.11.3-alt1 sisyphus.217836.400 1545130608 installed
<13>Jan 15 08:24:29 rpmi: libmtdev-1.1.5-alt1 1399539297 installed
<13>Jan 15 08:24:29 rpmi: libpng16-1.6.35-alt1 sisyphus.214397.100 1539159349 installed
<13>Jan 15 08:24:29 rpmi: libICE-1.0.9-alt1 1409902721 installed
<13>Jan 15 08:24:29 rpmi: libwayland-server-1.16.0-alt1 1535614871 installed
<13>Jan 15 08:24:29 rpmi: libidn2-2.1.0-alt1 sisyphus.219245.100 1547229449 installed
<13>Jan 15 08:24:29 rpmi: libSM-1.2.3-alt1 sisyphus.215747.100 1540812795 installed
<13>Jan 15 08:24:29 rpmi: rpm-macros-qt5-5.11.3-alt1 sisyphus.217836.100 1545040569 installed
<13>Jan 15 08:24:29 rpmi: libOpenGL-7:1.1.0-alt3 sisyphus.215982.100 1541498632 installed
<13>Jan 15 08:24:29 rpmi: libGLES-7:1.1.0-alt3 sisyphus.215982.100 1541498632 installed
<13>Jan 15 08:24:29 rpmi: xxd-4:8.1.26-alt1 1528475306 installed
<13>Jan 15 08:24:29 rpmi: python-modules-curses-2.7.15-alt1 sisyphus.217364.100 1544022423 installed
<13>Jan 15 08:24:29 rpmi: libsqlite3-3.26.0-alt1 sisyphus.219274.100 1547430858 installed
<13>Jan 15 08:24:29 rpmi: libts-1.0-alt1.qa1 1366249315 installed
<13>Jan 15 08:24:29 rpmi: libproxy-0.4.15-alt2 sisyphus.214008.100 1538585336 installed
<13>Jan 15 08:24:29 rpmi: libpcre2-10.32-alt1 sisyphus.212994.100 1536866761 installed
<13>Jan 15 08:24:29 rpmi: libjpeg-2:1.5.1-alt1 1498218318 installed
<13>Jan 15 08:24:29 rpmi: libwacom-data-0.32-alt1 sisyphus.216114.100 1541407217 installed
<13>Jan 15 08:24:29 rpmi: udev-rules-1:240-alt4 sisyphus.219244.100 1547241418 installed
<13>Jan 15 08:24:30 rpmi: libicu63-1:6.3.1-alt1 sisyphus.215328.100 1540049988 installed
<13>Jan 15 08:24:30 rpmi: libqt5-core-5.11.3-alt1 sisyphus.217836.100 1545040818 installed
<13>Jan 15 08:24:30 rpmi: libqt5-xml-5.11.3-alt1 sisyphus.217836.100 1545040818 installed
<13>Jan 15 08:24:30 rpmi: libqt5-sql-5.11.3-alt1 sisyphus.217836.100 1545040818 installed
<13>Jan 15 08:24:30 rpmi: libqt5-concurrent-5.11.3-alt1 sisyphus.217836.100 1545040818 installed
<13>Jan 15 08:24:30 rpmi: libqt5-test-5.11.3-alt1 sisyphus.217836.100 1545040818 installed
<13>Jan 15 08:24:30 rpmi: libgudev-1:232-alt3 1523738518 installed
<13>Jan 15 08:24:30 rpmi: libwacom-0.32-alt1 sisyphus.216114.100 1541407221 installed
<13>Jan 15 08:24:30 rpmi: libgraphite2-1.3.13-alt1 sisyphus.218545.100 1545686511 installed
<13>Jan 15 08:24:30 rpmi: libharfbuzz-2.2.0-alt1 sisyphus.218134.500 1545261518 installed
<13>Jan 15 08:24:30 rpmi: libfreetype-2.9.1-alt1.S1 1530781053 installed
<13>Jan 15 08:24:30 rpmi: fontconfig-2.13.1-alt1 sisyphus.215917.100 1540973886 installed
Updating fonts cache: <29>Jan 15 08:24:31 fontconfig: Updating fonts cache: succeeded
[ DONE ]
<13>Jan 15 08:24:31 rpmi: libgdbm-1.8.3-alt10 1454943334 installed
<13>Jan 15 08:24:31 rpmi: libevdev-1.6.0-alt1 sisyphus.215605.100 1540547069 installed
<13>Jan 15 08:24:31 rpmi: libinput-1.12.5-alt1 sisyphus.219035.100 1546885462 installed
<13>Jan 15 08:24:31 rpmi: liblz4-1:1.8.3-alt2 sisyphus.217095.200 1547082375 installed
<13>Jan 15 08:24:31 rpmi: libgpg-error-1.31-alt1.S1 1529015802 installed
<13>Jan 15 08:24:31 rpmi: libgcrypt20-1.8.3-alt4 sisyphus.218050.200 1545223289 installed
<13>Jan 15 08:24:31 rpmi: libsystemd-1:240-alt4 sisyphus.219244.100 1547241502 installed
<13>Jan 15 08:24:31 rpmi: libdbus-1.12.12-alt1 sisyphus.217336.100 1544000923 installed
<13>Jan 15 08:24:31 rpmi: libavahi-0.6.32-alt1 1500485702 installed
<13>Jan 15 08:24:31 rpmi: libqt5-dbus-5.11.3-alt1 sisyphus.217836.100 1545040818 installed
<13>Jan 15 08:24:31 rpmi: xorg-proto-devel-2018.4-alt3 1527685079 installed
<13>Jan 15 08:24:31 rpmi: libxshmfence-1.2-alt2 1518613552 installed
<13>Jan 15 08:24:31 rpmi: libX11-locales-3:1.6.7-alt1 sisyphus.214413.200 1539171080 installed
<13>Jan 15 08:24:31 rpmi: libXdmcp-1.1.1-alt1 1334617701 installed
<13>Jan 15 08:24:31 rpmi: libXau-1.0.8-alt1 1369565808 installed
<13>Jan 15 08:24:31 rpmi: libxcb-1.13.1-alt1 sisyphus.214413.100 1539170896 installed
<13>Jan 15 08:24:32 rpmi: libX11-3:1.6.7-alt1 sisyphus.214413.200 1539171143 installed
<13>Jan 15 08:24:32 rpmi: libXext-1.3.3-alt1 1409902959 installed
<13>Jan 15 08:24:32 rpmi: libXxf86vm-1.1.4-alt2 1527672187 installed
<13>Jan 15 08:24:32 rpmi: libXi-1.7.9-alt1.S1 1515755342 installed
<13>Jan 15 08:24:32 rpmi: libXdamage-1.1.3-alt4 1297162593 installed
<13>Jan 15 08:24:32 rpmi: libXfixes-5.0.3-alt1 sisyphus.216396.300 1542022162 installed
<13>Jan 15 08:24:32 rpmi: libXrender-0.9.8-alt1 1371312112 installed
<13>Jan 15 08:24:34 rpmi: libxcb-devel-1.13.1-alt1 sisyphus.214413.100 1539170896 installed
<13>Jan 15 08:24:34 rpmi: libX11-devel-3:1.6.7-alt1 sisyphus.214413.200 1539171143 installed
<13>Jan 15 08:24:34 rpmi: libxcbutil-icccm-0.4.1-alt1 1396161557 installed
<13>Jan 15 08:24:34 rpmi: libxcbutil-1:0.4.0-alt1 1413392888 installed
<13>Jan 15 08:24:34 rpmi: libxcbutil-image-0.4.0-alt1 1446204182 installed
<13>Jan 15 08:24:34 rpmi: libxcbutil-keysyms-0.4.0-alt1 1446204124 installed
<13>Jan 15 08:24:34 rpmi: libxcb-render-util-0.3.9-alt3 sisyphus.213915.600 1538554008 installed
<13>Jan 15 08:24:34 rpmi: libxkbcommon-x11-0.8.2-alt1 1533800181 installed
<13>Jan 15 08:24:34 rpmi: libwayland-client-1.16.0-alt1 1535614871 installed
<13>Jan 15 08:24:34 rpmi: libpciaccess-1:0.14-alt1 1528969252 installed
<13>Jan 15 08:24:34 rpmi: libdrm-1:2.4.96-alt1 sisyphus.215486.100 1540374027 installed
<13>Jan 15 08:24:34 rpmi: libGLX-mesa-4:18.3.1-alt1 sisyphus.218704.100 1545992861 installed
<13>Jan 15 08:24:34 rpmi: libgbm-4:18.3.1-alt1 sisyphus.218704.100 1545992861 installed
<13>Jan 15 08:24:34 rpmi: libEGL-mesa-4:18.3.1-alt1 sisyphus.218704.100 1545992861 installed
<13>Jan 15 08:24:34 rpmi: libEGL-7:1.1.0-alt3 sisyphus.215982.100 1541498632 installed
<13>Jan 15 08:24:34 rpmi: libGLX-7:1.1.0-alt3 sisyphus.215982.100 1541498632 installed
<13>Jan 15 08:24:34 rpmi: libGL-7:1.1.0-alt3 sisyphus.215982.100 1541498632 installed
<13>Jan 15 08:24:34 rpmi: libglvnd-devel-7:1.1.0-alt3 sisyphus.215982.100 1541498632 installed
<13>Jan 15 08:24:34 rpmi: libEGL-devel-4:18.3.1-alt1 sisyphus.218704.100 1545992861 installed
<13>Jan 15 08:24:34 rpmi: libGL-devel-4:18.3.1-alt1 sisyphus.218704.100 1545992861 installed
<13>Jan 15 08:24:34 rpmi: gcc-c++-common-1.4.23-alt1 sisyphus.218115.200 1545282875 installed
<13>Jan 15 08:24:35 rpmi: libstdc++8-devel-8.2.1-alt3 sisyphus.219333.200 1547468342 installed
<13>Jan 15 08:24:36 rpmi: gcc8-c++-8.2.1-alt3 sisyphus.219333.200 1547468342 installed
<13>Jan 15 08:24:36 rpmi: gcc-c++-8-alt1 sisyphus.214000.40 1542664775 installed
<13>Jan 15 08:24:36 rpmi: libuv-1.23.2-alt1 sisyphus.217108.100 1543612230 installed
<13>Jan 15 08:24:36 rpmi: librhash-1.3.5-alt2 1505156279 installed
<13>Jan 15 08:24:36 rpmi: libjsoncpp19-1.8.4-alt2.S1 1518769525 installed
<13>Jan 15 08:24:36 rpmi: publicsuffix-list-dafsa-20181106-alt1 sisyphus.216228.100 1541611754 installed
<13>Jan 15 08:24:36 rpmi: libpsl-0.20.2-alt2 sisyphus.216228.200 1541611889 installed
<13>Jan 15 08:24:36 rpmi: libnghttp2-1.34.0-alt1 sisyphus.214524.100 1539249634 installed
<13>Jan 15 08:24:36 rpmi: libverto-0.3.0-alt1_5 1525957714 installed
<13>Jan 15 08:24:36 rpmi: libkeyutils-1.6-alt2 sisyphus.217337.100 1544003161 installed
<13>Jan 15 08:24:36 rpmi: libcom_err-1.44.5-alt1 sisyphus.218838.100 1546206118 installed
<13>Jan 15 08:24:36 rpmi: libbrotlicommon-1.0.7-alt1 sisyphus.215491.100 1540428597 installed
<13>Jan 15 08:24:36 rpmi: libbrotlidec-1.0.7-alt1 sisyphus.215491.100 1540428597 installed
<13>Jan 15 08:24:36 rpmi: libnettle6-3.4.1-alt1 sisyphus.217427.100 1544107917 installed
<13>Jan 15 08:24:36 rpmi: libarchive13-3.3.1-alt2 sisyphus.219343.100 1547461970 installed
<13>Jan 15 08:24:36 rpmi: rpm-macros-cmake-3.13.1-alt1 sisyphus.217317.100 1544006298 installed
<13>Jan 15 08:24:36 rpmi: cmake-modules-3.13.1-alt1 sisyphus.217317.100 1544006285 installed
<13>Jan 15 08:24:37 rpmi: llvm6.0-libs-6.0.0-alt0.13.rel sisyphus.218952.100 1546597025 installed
<13>Jan 15 08:24:38 rpmi: clang6.0-libs-6.0.0-alt0.13.rel sisyphus.218952.100 1546597025 installed
<13>Jan 15 08:24:38 rpmi: libtasn1-4.13-alt2 1521133850 installed
<13>Jan 15 08:24:38 rpmi: libp11-kit-0.23.9-alt5 1525798298 installed
<13>Jan 15 08:24:38 rpmi: rpm-macros-alternatives-0.5.0-alt1 sisyphus.219012.300 1546745004 installed
<13>Jan 15 08:24:38 rpmi: alternatives-0.5.0-alt1 sisyphus.219012.300 1546745004 installed
<13>Jan 15 08:24:38 rpmi: ca-certificates-2018.11.12-alt1 sisyphus.216395.300 1542114035 installed
<13>Jan 15 08:24:38 rpmi: ca-trust-0.1.1-alt2 1515595785 installed
<13>Jan 15 08:24:38 rpmi: p11-kit-trust-0.23.9-alt5 1525798298 installed
<13>Jan 15 08:24:38 rpmi: libcrypto1.1-1.1.0j-alt1 sisyphus.216647.100 1542743878 installed
<13>Jan 15 08:24:38 rpmi: libssl1.1-1.1.0j-alt1 sisyphus.216647.100 1542743878 installed
<86>Jan 15 08:24:38 groupadd[36236]: group added to /etc/group: name=_keytab, GID=499
<86>Jan 15 08:24:38 groupadd[36236]: group added to /etc/gshadow: name=_keytab
<86>Jan 15 08:24:38 groupadd[36236]: new group: name=_keytab, GID=499
<13>Jan 15 08:24:38 rpmi: libkrb5-1.16.3-alt1 sisyphus.219042.100 1547045815 installed
<13>Jan 15 08:24:38 rpmi: libqt5-network-5.11.3-alt1 sisyphus.217836.100 1545040818 installed
<13>Jan 15 08:24:38 rpmi: libqt5-eglfsdeviceintegration-5.11.3-alt1 sisyphus.217836.100 1545040818 installed
<13>Jan 15 08:24:38 rpmi: libqt5-xcbqpa-5.11.3-alt1 sisyphus.217836.100 1545040818 installed
<13>Jan 15 08:24:38 rpmi: libqt5-eglfskmssupport-5.11.3-alt1 sisyphus.217836.100 1545040818 installed
<13>Jan 15 08:24:39 rpmi: libqt5-gui-5.11.3-alt1 sisyphus.217836.100 1545040818 installed
<13>Jan 15 08:24:39 rpmi: libqt5-widgets-5.11.3-alt1 sisyphus.217836.100 1545040818 installed
<13>Jan 15 08:24:39 rpmi: libqt5-designer-5.11.3-alt1 sisyphus.217836.400 1545130650 installed
<13>Jan 15 08:24:39 rpmi: libqt5-designercomponents-5.11.3-alt1 sisyphus.217836.400 1545130650 installed
<13>Jan 15 08:24:39 rpmi: libqt5-help-5.11.3-alt1 sisyphus.217836.400 1545130650 installed
<13>Jan 15 08:24:39 rpmi: qt5-tools-5.11.3-alt1 sisyphus.217836.400 1545130650 installed
<13>Jan 15 08:24:39 rpmi: libqt5-opengl-5.11.3-alt1 sisyphus.217836.100 1545040818 installed
<86>Jan 15 08:24:39 groupadd[38476]: group added to /etc/group: name=sasl, GID=498
<86>Jan 15 08:24:39 groupadd[38476]: group added to /etc/gshadow: name=sasl
<86>Jan 15 08:24:39 groupadd[38476]: new group: name=sasl, GID=498
<13>Jan 15 08:24:39 rpmi: libsasl2-3-2.1.27-alt1 sisyphus.218476.200 1545647755 installed
<13>Jan 15 08:24:39 rpmi: libldap-2.4.46-alt1 1535562135 installed
<13>Jan 15 08:24:39 rpmi: libcurl-7.63.0-alt1 sisyphus.217831.100 1544762811 installed
<13>Jan 15 08:24:39 rpmi: libcups-2.2.6-alt1 1510070343 installed
<13>Jan 15 08:24:39 rpmi: libqt5-printsupport-5.11.3-alt1 sisyphus.217836.100 1545040818 installed
<13>Jan 15 08:24:39 rpmi: libtirpc-1.0.3-alt1 1532008017 installed
<13>Jan 15 08:24:39 rpmi: libnsl2-1.1.0-alt1_1 1511548749 installed
<13>Jan 15 08:24:39 rpmi: python-modules-compiler-2.7.15-alt1 sisyphus.217364.100 1544022423 installed
<13>Jan 15 08:24:39 rpmi: python-modules-email-2.7.15-alt1 sisyphus.217364.100 1544022423 installed
<13>Jan 15 08:24:39 rpmi: python-modules-unittest-2.7.15-alt1 sisyphus.217364.100 1544022423 installed
<13>Jan 15 08:24:39 rpmi: python-modules-nis-2.7.15-alt1 sisyphus.217364.100 1544022423 installed
<13>Jan 15 08:24:39 rpmi: python-modules-encodings-2.7.15-alt1 sisyphus.217364.100 1544022423 installed
<13>Jan 15 08:24:40 rpmi: python-modules-2.7.15-alt1 sisyphus.217364.100 1544022423 installed
<13>Jan 15 08:24:40 rpmi: python-modules-xml-2.7.15-alt1 sisyphus.217364.100 1544022423 installed
<13>Jan 15 08:24:40 rpmi: python-modules-hotshot-2.7.15-alt1 sisyphus.217364.100 1544022423 installed
<13>Jan 15 08:24:40 rpmi: python-modules-bsddb-2.7.15-alt1 sisyphus.217364.100 1544022423 installed
<13>Jan 15 08:24:40 rpmi: python-modules-ctypes-2.7.15-alt1 sisyphus.217364.100 1544022423 installed
<13>Jan 15 08:24:40 rpmi: python-modules-multiprocessing-2.7.15-alt1 sisyphus.217364.100 1544022423 installed
<13>Jan 15 08:24:40 rpmi: python-modules-logging-2.7.15-alt1 sisyphus.217364.100 1544022423 installed
<13>Jan 15 08:24:40 rpmi: python-2.7.15-alt1 sisyphus.217364.100 1544022423 installed
<13>Jan 15 08:24:40 rpmi: python-modules-distutils-2.7.15-alt1 sisyphus.217364.100 1544022423 installed
<13>Jan 15 08:24:40 rpmi: python-modules-json-2.7.15-alt1 sisyphus.217364.100 1544022423 installed
<13>Jan 15 08:24:40 rpmi: qt5-base-devel-5.11.3-alt1 sisyphus.217836.100 1545040818 installed
<13>Jan 15 08:24:40 rpmi: qt5-tools-devel-5.11.3-alt1 sisyphus.217836.400 1545130650 installed
<13>Jan 15 08:24:41 rpmi: cmake-3.13.1-alt1 sisyphus.217317.100 1544006298 installed
<13>Jan 15 08:24:41 rpmi: lxqt-build-tools-0.5.0-alt1.1 1535179092 installed
Building target platforms: i586
Building for target i586
Wrote: /usr/src/in/nosrpm/libsysstat-0.4.1-alt1.1.nosrc.rpm
Installing libsysstat-0.4.1-alt1.1.src.rpm
Building target platforms: i586
Building for target i586
Executing(%prep): /bin/sh -e /usr/src/tmp/rpm-tmp.48756
+ umask 022
+ /bin/mkdir -p /usr/src/RPM/BUILD
+ cd /usr/src/RPM/BUILD
+ cd /usr/src/RPM/BUILD
+ rm -rf libsysstat-0.4.1
+ echo 'Source #0 (libsysstat-0.4.1.tar):'
Source #0 (libsysstat-0.4.1.tar):
+ /bin/tar -xf /usr/src/RPM/SOURCES/libsysstat-0.4.1.tar
+ cd libsysstat-0.4.1
+ /bin/chmod -c -Rf u+rwX,go-w .
+ exit 0
Executing(%build): /bin/sh -e /usr/src/tmp/rpm-tmp.48756
+ umask 022
+ /bin/mkdir -p /usr/src/RPM/BUILD
+ cd /usr/src/RPM/BUILD
+ cd libsysstat-0.4.1
+ mkdir -p BUILD
+ __cmake
+ pushd BUILD
~/RPM/BUILD/libsysstat-0.4.1/BUILD ~/RPM/BUILD/libsysstat-0.4.1
+ cmake .. -DCMAKE_SKIP_RPATH:BOOL=ON -DCMAKE_SKIP_INSTALL_RPATH:BOOL=yes '-DCMAKE_C_FLAGS:STRING=-pipe -frecord-gcc-switches -Wall -g -O2 -march=i586 -mtune=generic' '-DCMAKE_CXX_FLAGS:STRING=-pipe -frecord-gcc-switches -Wall -g -O2 -march=i586 -mtune=generic' '-DCMAKE_Fortran_FLAGS:STRING=-pipe -frecord-gcc-switches -Wall -g -O2 -march=i586 -mtune=generic' -DCMAKE_INSTALL_PREFIX=/usr -DINCLUDE_INSTALL_DIR:PATH=/usr/include -DLIB_INSTALL_DIR:PATH=/usr/lib -DSYSCONF_INSTALL_DIR:PATH=/etc -DSHARE_INSTALL_PREFIX:PATH=/usr/share -DLIB_DESTINATION=lib -DLIB_SUFFIX=
-- The C compiler identification is GNU 8.2.1
-- The CXX compiler identification is GNU 8.2.1
-- Check for working C compiler: /usr/bin/cc
-- Check for working C compiler: /usr/bin/cc -- works
-- Detecting C compiler ABI info
-- Detecting C compiler ABI info - done
-- Detecting C compile features
-- Detecting C compile features - done
-- Check for working CXX compiler: /usr/bin/c++
-- Check for working CXX compiler: /usr/bin/c++ -- works
-- Detecting CXX compiler ABI info
-- Detecting CXX compiler ABI info - done
-- Detecting CXX compile features
-- Detecting CXX compile features - done
-- Building libsysstat with Qt 5.11.3
-- Performing Test COMPILER_SUPPORTS_CXX11
-- Performing Test COMPILER_SUPPORTS_CXX11 - Success
-- Performing Test COMPILER_SUPPORTS_CXX0X
-- Performing Test COMPILER_SUPPORTS_CXX0X - Success
-- Configuring done
-- Generating done
CMake Warning:
  Manually-specified variables were not used by the project:

    CMAKE_Fortran_FLAGS
    CMAKE_SKIP_INSTALL_RPATH
    INCLUDE_INSTALL_DIR
    LIB_DESTINATION
    LIB_INSTALL_DIR
    LIB_SUFFIX
    SHARE_INSTALL_PREFIX
    SYSCONF_INSTALL_DIR


-- Build files have been written to: /usr/src/RPM/BUILD/libsysstat-0.4.1/BUILD
+ popd
~/RPM/BUILD/libsysstat-0.4.1
+ make -j8 -C BUILD
make[2]: Entering directory '/usr/src/RPM/BUILD/libsysstat-0.4.1/BUILD'
Scanning dependencies of target sysstat-qt5_autogen
make[2]: Leaving directory '/usr/src/RPM/BUILD/libsysstat-0.4.1/BUILD'
make[2]: Entering directory '/usr/src/RPM/BUILD/libsysstat-0.4.1/BUILD'
[ 12%] Automatic MOC for target sysstat-qt5
make[2]: Leaving directory '/usr/src/RPM/BUILD/libsysstat-0.4.1/BUILD'
make[1]: Entering directory '/usr/src/RPM/BUILD/libsysstat-0.4.1/BUILD'
[ 12%] Built target sysstat-qt5_autogen
make[1]: Leaving directory '/usr/src/RPM/BUILD/libsysstat-0.4.1/BUILD'
make[2]: Entering directory '/usr/src/RPM/BUILD/libsysstat-0.4.1/BUILD'
Scanning dependencies of target sysstat-qt5
make[2]: Leaving directory '/usr/src/RPM/BUILD/libsysstat-0.4.1/BUILD'
make[2]: Entering directory '/usr/src/RPM/BUILD/libsysstat-0.4.1/BUILD'
[ 25%] Building CXX object CMakeFiles/sysstat-qt5.dir/version.cpp.o
make[2]: Leaving directory '/usr/src/RPM/BUILD/libsysstat-0.4.1/BUILD'
make[2]: Entering directory '/usr/src/RPM/BUILD/libsysstat-0.4.1/BUILD'
[ 37%] Building CXX object CMakeFiles/sysstat-qt5.dir/cpustat.cpp.o
make[2]: Leaving directory '/usr/src/RPM/BUILD/libsysstat-0.4.1/BUILD'
make[2]: Entering directory '/usr/src/RPM/BUILD/libsysstat-0.4.1/BUILD'
[ 87%] Building CXX object CMakeFiles/sysstat-qt5.dir/sysstat-qt5_autogen/mocs_compilation.cpp.o
make[2]: Leaving directory '/usr/src/RPM/BUILD/libsysstat-0.4.1/BUILD'
make[2]: Entering directory '/usr/src/RPM/BUILD/libsysstat-0.4.1/BUILD'
[ 75%] Building CXX object CMakeFiles/sysstat-qt5.dir/netstat.cpp.o
make[2]: Leaving directory '/usr/src/RPM/BUILD/libsysstat-0.4.1/BUILD'
make[2]: Entering directory '/usr/src/RPM/BUILD/libsysstat-0.4.1/BUILD'
[ 50%] Building CXX object CMakeFiles/sysstat-qt5.dir/basestat.cpp.o
make[2]: Leaving directory '/usr/src/RPM/BUILD/libsysstat-0.4.1/BUILD'
make[2]: Entering directory '/usr/src/RPM/BUILD/libsysstat-0.4.1/BUILD'
[ 62%] Building CXX object CMakeFiles/sysstat-qt5.dir/memstat.cpp.o
make[2]: Leaving directory '/usr/src/RPM/BUILD/libsysstat-0.4.1/BUILD'
make[2]: Entering directory '/usr/src/RPM/BUILD/libsysstat-0.4.1/BUILD'
[100%] Linking CXX shared library libsysstat-qt5.so
make[2]: Leaving directory '/usr/src/RPM/BUILD/libsysstat-0.4.1/BUILD'
make[1]: Entering directory '/usr/src/RPM/BUILD/libsysstat-0.4.1/BUILD'
[100%] Built target sysstat-qt5
make[1]: Leaving directory '/usr/src/RPM/BUILD/libsysstat-0.4.1/BUILD'
+ exit 0
Executing(%install): /bin/sh -e /usr/src/tmp/rpm-tmp.14780
+ umask 022
+ /bin/mkdir -p /usr/src/RPM/BUILD
+ cd /usr/src/RPM/BUILD
+ /bin/chmod -Rf u+rwX -- /usr/src/tmp/libsysstat-buildroot
+ :
+ /bin/rm -rf -- /usr/src/tmp/libsysstat-buildroot
+ cd libsysstat-0.4.1
+ make 'INSTALL=/bin/install -p' install DESTDIR=/usr/src/tmp/libsysstat-buildroot -C BUILD
make: Entering directory '/usr/src/RPM/BUILD/libsysstat-0.4.1/BUILD'
make[1]: Entering directory '/usr/src/RPM/BUILD/libsysstat-0.4.1/BUILD'
make[2]: Entering directory '/usr/src/RPM/BUILD/libsysstat-0.4.1/BUILD'
make[2]: Leaving directory '/usr/src/RPM/BUILD/libsysstat-0.4.1/BUILD'
make[2]: Entering directory '/usr/src/RPM/BUILD/libsysstat-0.4.1/BUILD'
[ 12%] Automatic MOC for target sysstat-qt5
make[2]: Leaving directory '/usr/src/RPM/BUILD/libsysstat-0.4.1/BUILD'
[ 12%] Built target sysstat-qt5_autogen
make[2]: Entering directory '/usr/src/RPM/BUILD/libsysstat-0.4.1/BUILD'
make[2]: Leaving directory '/usr/src/RPM/BUILD/libsysstat-0.4.1/BUILD'
[100%] Built target sysstat-qt5
make[1]: Leaving directory '/usr/src/RPM/BUILD/libsysstat-0.4.1/BUILD'
Install the project...
-- Install configuration: "Release"
-- Installing: /usr/src/tmp/libsysstat-buildroot/usr/lib/libsysstat-qt5.so.0.4.1
-- Installing: /usr/src/tmp/libsysstat-buildroot/usr/lib/libsysstat-qt5.so.0
-- Installing: /usr/src/tmp/libsysstat-buildroot/usr/lib/libsysstat-qt5.so
-- Installing: /usr/src/tmp/libsysstat-buildroot/usr/include/sysstat-qt5/version.h
-- Installing: /usr/src/tmp/libsysstat-buildroot/usr/include/sysstat-qt5/sysstat_global.h
-- Installing: /usr/src/tmp/libsysstat-buildroot/usr/include/sysstat-qt5/basestat.h
-- Installing: /usr/src/tmp/libsysstat-buildroot/usr/include/sysstat-qt5/cpustat.h
-- Installing: /usr/src/tmp/libsysstat-buildroot/usr/include/sysstat-qt5/memstat.h
-- Installing: /usr/src/tmp/libsysstat-buildroot/usr/include/sysstat-qt5/netstat.h
-- Installing: /usr/src/tmp/libsysstat-buildroot/usr/include/sysstat-qt5/SysStat/Version
-- Installing: /usr/src/tmp/libsysstat-buildroot/usr/include/sysstat-qt5/SysStat/Global
-- Installing: /usr/src/tmp/libsysstat-buildroot/usr/include/sysstat-qt5/SysStat/BaseStat
-- Installing: /usr/src/tmp/libsysstat-buildroot/usr/include/sysstat-qt5/SysStat/CpuStat
-- Installing: /usr/src/tmp/libsysstat-buildroot/usr/include/sysstat-qt5/SysStat/MemStat
-- Installing: /usr/src/tmp/libsysstat-buildroot/usr/include/sysstat-qt5/SysStat/NetStat
-- Installing: /usr/src/tmp/libsysstat-buildroot/usr/lib/pkgconfig/sysstat-qt5.pc
-- Installing: /usr/src/tmp/libsysstat-buildroot/usr/share/cmake/sysstat-qt5/sysstat-qt5-config.cmake
-- Installing: /usr/src/tmp/libsysstat-buildroot/usr/share/cmake/sysstat-qt5/sysstat-qt5-config-version.cmake
-- Installing: /usr/src/tmp/libsysstat-buildroot/usr/share/cmake/sysstat-qt5/sysstat-qt5-targets.cmake
-- Installing: /usr/src/tmp/libsysstat-buildroot/usr/share/cmake/sysstat-qt5/sysstat-qt5-targets-release.cmake
make: Leaving directory '/usr/src/RPM/BUILD/libsysstat-0.4.1/BUILD'
+ /usr/lib/rpm/brp-alt
Cleaning files in /usr/src/tmp/libsysstat-buildroot (auto)
mode of './usr/lib/libsysstat-qt5.so.0.4.1' changed from 0755 (rwxr-xr-x) to 0644 (rw-r--r--)
Verifying and fixing files in /usr/src/tmp/libsysstat-buildroot (binconfig,pkgconfig,libtool,desktop)
/usr/lib/pkgconfig/sysstat-qt5.pc: Cflags: '-I${includedir} -I${includedir}/sysstat-qt5' --> '-I${includedir}/sysstat-qt5'
/usr/lib/pkgconfig/sysstat-qt5.pc: Libs: '-L${libdir} -lsysstat-qt5' --> '-lsysstat-qt5'
Checking contents of files in /usr/src/tmp/libsysstat-buildroot/ (default)
Compressing files in /usr/src/tmp/libsysstat-buildroot (auto)
Adjusting library links in /usr/src/tmp/libsysstat-buildroot
./usr/lib:
	libsysstat-qt5.so.0 -> libsysstat-qt5.so.0.4.1
Verifying ELF objects in /usr/src/tmp/libsysstat-buildroot (arch=normal,fhs=normal,lfs=relaxed,lint=relaxed,rpath=normal,stack=normal,textrel=normal,unresolved=normal)
verify-elf: WARNING: ./usr/lib/libsysstat-qt5.so.0.4.1: uses non-LFS functions: open
Hardlinking identical .pyc and .pyo files
Processing files: libsysstat-0.4.1-alt1.1
Finding Provides (using /usr/lib/rpm/find-provides)
Executing: /bin/sh -e /usr/src/tmp/rpm-tmp.Mus7U1
find-provides: running scripts (alternatives,debuginfo,lib,pam,perl,pkgconfig,python,shell)
Finding Requires (using /usr/lib/rpm/find-requires)
Executing: /bin/sh -e /usr/src/tmp/rpm-tmp.7CWRzb
find-requires: running scripts (cpp,debuginfo,files,lib,pam,perl,pkgconfig,pkgconfiglib,python,rpmlib,shebang,shell,static,symlinks)
Provides: libsysstat-qt5.so.0 = set:kdzfPrw9nmhR5of6EQ8FrZB4waMcI4MGD6swSCnq9zTbXXb3A6acwK2z562x4ZcmLBDJj72QncPM0t1i6rZ0Y62FhuMR3wmP72I7k3ZAxSaWBmGpxChPgkPQUc9eBt8bz435bu3Yqy5Sj1s
Requires: libQt5Core.so.5 >= set:qktOFLOwFyMqmRUZu2p3xjloOZ8ArgIG2xZ8yiHWRhM9jRa649fjRmAmRgoszD5rZ4jlOtQtoNlVqNi7Qe6rb159k0z0umbhvq7CffirmmZ4uGpGu0IZHEXxrzjzuoZ0PL0ngZ9WREStlazSkIH9nyUBb5rrbJtabWtq2hrwwB8Vq6dpnIhytPh7EvuIotY0j81fiP79, libQt5Core.so.5(Qt_5), libQt5Core.so.5(Qt_5.11), libc.so.6(GLIBC_2.0), libc.so.6(GLIBC_2.1.3), libgcc_s.so.1(GLIBC_2.0), libstdc++.so.6(CXXABI_1.3), libstdc++.so.6(GLIBCXX_3.4), rtld(GNU_HASH)
Requires(rpmlib): rpmlib(SetVersions)
Finding debuginfo files (using /usr/lib/rpm/find-debuginfo-files)
Executing: /bin/sh -e /usr/src/tmp/rpm-tmp.swyegu
Creating libsysstat-debuginfo package
Processing files: libsysstat-devel-0.4.1-alt1.1
Finding Provides (using /usr/lib/rpm/find-provides)
Executing: /bin/sh -e /usr/src/tmp/rpm-tmp.8w0oo1
find-provides: running scripts (alternatives,debuginfo,lib,pam,perl,pkgconfig,python,shell)
Finding Requires (using /usr/lib/rpm/find-requires)
Executing: /bin/sh -e /usr/src/tmp/rpm-tmp.tLGI6S
find-requires: running scripts (cpp,debuginfo,files,lib,pam,perl,pkgconfig,pkgconfiglib,python,rpmlib,shebang,shell,static,symlinks)
In file included from /usr/include/qt5/QtCore/qatomic.h:46,
                 from /usr/include/qt5/QtCore/qrefcount.h:43,
                 from /usr/include/qt5/QtCore/qbytearray.h:44,
                 from /usr/include/qt5/QtCore/qstring.h:49,
                 from /usr/include/qt5/QtCore/qobject.h:47,
                 from /usr/include/qt5/QtCore/QObject:1,
                 from /usr/src/tmp/libsysstat-buildroot/usr/include/sysstat-qt5/cpustat.h:31:
/usr/include/qt5/QtCore/qbasicatomic.h:61:4: error: #error "Qt requires C++11 support"
 #  error "Qt requires C++11 support"
    ^~~~~
In file included from /usr/include/qt5/QtCore/qstring.h:49,
                 from /usr/include/qt5/QtCore/qobject.h:47,
                 from /usr/include/qt5/QtCore/QObject:1,
                 from /usr/src/tmp/libsysstat-buildroot/usr/include/sysstat-qt5/cpustat.h:31:
/usr/include/qt5/QtCore/qbytearray.h:52:10: fatal error: string: No such file or directory
 #include <string>
          ^~~~~~~~
compilation terminated.
cpp.req: /usr/src/tmp/libsysstat-buildroot/usr/include/sysstat-qt5/cpustat.h: cpp failed, trying c++ mode
In file included from /usr/include/qt5/QtCore/qnamespace.h:43,
                 from /usr/include/qt5/QtCore/qobjectdefs.h:48,
                 from /usr/include/qt5/QtCore/qobject.h:46,
                 from /usr/include/qt5/QtCore/QObject:1,
                 from /usr/src/tmp/libsysstat-buildroot/usr/include/sysstat-qt5/cpustat.h:31:
/usr/include/qt5/QtCore/qglobal.h:1177:4: error: #error "You must build your code with position independent code if Qt was built with -reduce-relocations. " "Compile your code with -fPIC (-fPIE is not enough)."
 #  error "You must build your code with position independent code if Qt was built with -reduce-relocations. "\
    ^~~~~
cpp.req: WARNING: /usr/src/tmp/libsysstat-buildroot/usr/include/sysstat-qt5/cpustat.h: cpp failed
In file included from /usr/include/qt5/QtCore/qatomic.h:46,
                 from /usr/include/qt5/QtCore/qrefcount.h:43,
                 from /usr/include/qt5/QtCore/qbytearray.h:44,
                 from /usr/include/qt5/QtCore/qstring.h:49,
                 from /usr/include/qt5/QtCore/qobject.h:47,
                 from /usr/include/qt5/QtCore/QObject:1,
                 from /usr/src/tmp/libsysstat-buildroot/usr/include/sysstat-qt5/memstat.h:31:
/usr/include/qt5/QtCore/qbasicatomic.h:61:4: error: #error "Qt requires C++11 support"
 #  error "Qt requires C++11 support"
    ^~~~~
In file included from /usr/include/qt5/QtCore/qstring.h:49,
                 from /usr/include/qt5/QtCore/qobject.h:47,
                 from /usr/include/qt5/QtCore/QObject:1,
                 from /usr/src/tmp/libsysstat-buildroot/usr/include/sysstat-qt5/memstat.h:31:
/usr/include/qt5/QtCore/qbytearray.h:52:10: fatal error: string: No such file or directory
 #include <string>
          ^~~~~~~~
compilation terminated.
cpp.req: /usr/src/tmp/libsysstat-buildroot/usr/include/sysstat-qt5/memstat.h: cpp failed, trying c++ mode
In file included from /usr/include/qt5/QtCore/qnamespace.h:43,
                 from /usr/include/qt5/QtCore/qobjectdefs.h:48,
                 from /usr/include/qt5/QtCore/qobject.h:46,
                 from /usr/include/qt5/QtCore/QObject:1,
                 from /usr/src/tmp/libsysstat-buildroot/usr/include/sysstat-qt5/memstat.h:31:
/usr/include/qt5/QtCore/qglobal.h:1177:4: error: #error "You must build your code with position independent code if Qt was built with -reduce-relocations. " "Compile your code with -fPIC (-fPIE is not enough)."
 #  error "You must build your code with position independent code if Qt was built with -reduce-relocations. "\
    ^~~~~
cpp.req: WARNING: /usr/src/tmp/libsysstat-buildroot/usr/include/sysstat-qt5/memstat.h: cpp failed
In file included from /usr/include/qt5/QtCore/qatomic.h:46,
                 from /usr/include/qt5/QtCore/qrefcount.h:43,
                 from /usr/include/qt5/QtCore/qbytearray.h:44,
                 from /usr/include/qt5/QtCore/qstring.h:49,
                 from /usr/include/qt5/QtCore/qobject.h:47,
                 from /usr/include/qt5/QtCore/QObject:1,
                 from /usr/src/tmp/libsysstat-buildroot/usr/include/sysstat-qt5/netstat.h:31:
/usr/include/qt5/QtCore/qbasicatomic.h:61:4: error: #error "Qt requires C++11 support"
 #  error "Qt requires C++11 support"
    ^~~~~
In file included from /usr/include/qt5/QtCore/qstring.h:49,
                 from /usr/include/qt5/QtCore/qobject.h:47,
                 from /usr/include/qt5/QtCore/QObject:1,
                 from /usr/src/tmp/libsysstat-buildroot/usr/include/sysstat-qt5/netstat.h:31:
/usr/include/qt5/QtCore/qbytearray.h:52:10: fatal error: string: No such file or directory
 #include <string>
          ^~~~~~~~
compilation terminated.
cpp.req: /usr/src/tmp/libsysstat-buildroot/usr/include/sysstat-qt5/netstat.h: cpp failed, trying c++ mode
In file included from /usr/include/qt5/QtCore/qnamespace.h:43,
                 from /usr/include/qt5/QtCore/qobjectdefs.h:48,
                 from /usr/include/qt5/QtCore/qobject.h:46,
                 from /usr/include/qt5/QtCore/QObject:1,
                 from /usr/src/tmp/libsysstat-buildroot/usr/include/sysstat-qt5/netstat.h:31:
/usr/include/qt5/QtCore/qglobal.h:1177:4: error: #error "You must build your code with position independent code if Qt was built with -reduce-relocations. " "Compile your code with -fPIC (-fPIE is not enough)."
 #  error "You must build your code with position independent code if Qt was built with -reduce-relocations. "\
    ^~~~~
cpp.req: WARNING: /usr/src/tmp/libsysstat-buildroot/usr/include/sysstat-qt5/netstat.h: cpp failed
In file included from /usr/include/qt5/QtCore/qatomic.h:46,
                 from /usr/include/qt5/QtCore/qrefcount.h:43,
                 from /usr/include/qt5/QtCore/qbytearray.h:44,
                 from /usr/include/qt5/QtCore/qstring.h:49,
                 from /usr/include/qt5/QtCore/qobject.h:47,
                 from /usr/include/qt5/QtCore/QObject:1,
                 from /usr/src/tmp/libsysstat-buildroot/usr/include/sysstat-qt5/basestat.h:31:
/usr/include/qt5/QtCore/qbasicatomic.h:61:4: error: #error "Qt requires C++11 support"
 #  error "Qt requires C++11 support"
    ^~~~~
In file included from /usr/include/qt5/QtCore/qstring.h:49,
                 from /usr/include/qt5/QtCore/qobject.h:47,
                 from /usr/include/qt5/QtCore/QObject:1,
                 from /usr/src/tmp/libsysstat-buildroot/usr/include/sysstat-qt5/basestat.h:31:
/usr/include/qt5/QtCore/qbytearray.h:52:10: fatal error: string: No such file or directory
 #include <string>
          ^~~~~~~~
compilation terminated.
cpp.req: /usr/src/tmp/libsysstat-buildroot/usr/include/sysstat-qt5/basestat.h: cpp failed, trying c++ mode
In file included from /usr/include/qt5/QtCore/qnamespace.h:43,
                 from /usr/include/qt5/QtCore/qobjectdefs.h:48,
                 from /usr/include/qt5/QtCore/qobject.h:46,
                 from /usr/include/qt5/QtCore/QObject:1,
                 from /usr/src/tmp/libsysstat-buildroot/usr/include/sysstat-qt5/basestat.h:31:
/usr/include/qt5/QtCore/qglobal.h:1177:4: error: #error "You must build your code with position independent code if Qt was built with -reduce-relocations. " "Compile your code with -fPIC (-fPIE is not enough)."
 #  error "You must build your code with position independent code if Qt was built with -reduce-relocations. "\
    ^~~~~
cpp.req: WARNING: /usr/src/tmp/libsysstat-buildroot/usr/include/sysstat-qt5/basestat.h: cpp failed
Provides: pkgconfig(sysstat-qt5) = 0.4.1
Requires: libsysstat = 0.4.1, /usr/lib/libsysstat-qt5.so.0, /usr/lib/pkgconfig, pkgconfig(Qt5Core), qt5-base-devel
Finding debuginfo files (using /usr/lib/rpm/find-debuginfo-files)
Executing: /bin/sh -e /usr/src/tmp/rpm-tmp.i65zkT
Processing files: libsysstat-debuginfo-0.4.1-alt1.1
Finding Provides (using /usr/lib/rpm/find-provides)
Executing: /bin/sh -e /usr/src/tmp/rpm-tmp.okNGTd
find-provides: running scripts (debuginfo)
Finding Requires (using /usr/lib/rpm/find-requires)
Executing: /bin/sh -e /usr/src/tmp/rpm-tmp.rjLV6N
find-requires: running scripts (debuginfo)
Provides: debug(libsysstat-qt5.so.0)
Requires: libsysstat = 0.4.1-alt1.1, debug(libQt5Core.so.5), debug(libc.so.6), debug(libgcc_s.so.1), debug(libstdc++.so.6)
Adding to libsysstat-devel a strict dependency on libsysstat
Removing 1 extra deps from libsysstat-devel due to dependency on libsysstat
Wrote: /usr/src/RPM/RPMS/i586/libsysstat-0.4.1-alt1.1.i586.rpm
Wrote: /usr/src/RPM/RPMS/i586/libsysstat-devel-0.4.1-alt1.1.i586.rpm
Wrote: /usr/src/RPM/RPMS/i586/libsysstat-debuginfo-0.4.1-alt1.1.i586.rpm
13.96user 1.91system 0:22.78elapsed 69%CPU (0avgtext+0avgdata 95924maxresident)k
0inputs+0outputs (0major+711053minor)pagefaults 0swaps
31.99user 5.96system 0:51.46elapsed 73%CPU (0avgtext+0avgdata 121596maxresident)k
32inputs+0outputs (0major+1237149minor)pagefaults 0swaps