<86>Jan  5 09:40:14 userdel[57535]: delete user 'rooter'
<86>Jan  5 09:40:14 groupadd[57553]: group added to /etc/group: name=rooter, GID=633
<86>Jan  5 09:40:14 groupadd[57553]: group added to /etc/gshadow: name=rooter
<86>Jan  5 09:40:14 groupadd[57553]: new group: name=rooter, GID=633
<86>Jan  5 09:40:14 useradd[57573]: new user: name=rooter, UID=633, GID=633, home=/root, shell=/bin/bash
<86>Jan  5 09:40:14 userdel[57604]: delete user 'builder'
<86>Jan  5 09:40:14 userdel[57604]: removed group 'builder' owned by 'builder'
<86>Jan  5 09:40:14 userdel[57604]: removed shadow group 'builder' owned by 'builder'
<86>Jan  5 09:40:14 groupadd[57642]: group added to /etc/group: name=builder, GID=634
<86>Jan  5 09:40:14 groupadd[57642]: new group: name=builder, GID=634
<86>Jan  5 09:40:14 useradd[57657]: new user: name=builder, UID=634, GID=634, home=/usr/src, shell=/bin/bash
<13>Jan  5 09:40:21 rpmi: libjpeg-2:1.5.1-alt1 1498218318 installed
<13>Jan  5 09:40:21 rpmi: libpng16-1.6.35-alt1 sisyphus.214397.100 1539159349 installed
<13>Jan  5 09:40:21 rpmi: libexpat-2.2.4-alt1 1503305345 installed
<13>Jan  5 09:40:21 rpmi: libtiff5-4.0.3-alt1 1348347501 installed
<13>Jan  5 09:40:21 rpmi: perl-Try-Tiny-0.30-alt1 1514318058 installed
<13>Jan  5 09:40:21 rpmi: perl-libnet-1:3.11-alt1 1511423541 installed
<13>Jan  5 09:40:21 rpmi: libpcap0.8-2:1.1.1-alt3 1298589613 installed
<13>Jan  5 09:40:21 rpmi: perl-Module-Runtime-0.016-alt1 1509549848 installed
<13>Jan  5 09:40:21 rpmi: perl-HTTP-Date-6.02-alt1 1348645274 installed
<13>Jan  5 09:40:21 rpmi: perl-Term-ANSIColor-4.06-alt1 1479407083 installed
<13>Jan  5 09:40:21 rpmi: sgml-common-0.6.3-alt15 1423664786 installed
<13>Jan  5 09:40:21 rpmi: libgdbm-1.8.3-alt10 1454943334 installed
<13>Jan  5 09:40:21 rpmi: libpcapnav-0.8-alt1_16 1507677519 installed
<13>Jan  5 09:40:21 rpmi: libnspr-1:4.20-alt1 sisyphus.216395.100 1542113039 installed
<13>Jan  5 09:40:21 rpmi: tex-common-0.2-alt4 1244804096 installed
<13>Jan  5 09:40:21 rpmi: libsqlite3-3.25.2-alt2 sisyphus.215082.100 1539700318 installed
<13>Jan  5 09:40:21 rpmi: libpaper-1.1.24-alt4 1315383465 installed
<13>Jan  5 09:40:21 rpmi: libopenjpeg2.0-2.3.0-alt2 sisyphus.216213.100 1541598437 installed
<13>Jan  5 09:40:21 rpmi: libICE-1.0.9-alt1 1409902721 installed
<13>Jan  5 09:40:21 rpmi: libSM-1.2.3-alt1 sisyphus.215747.100 1540812795 installed
<13>Jan  5 09:40:21 rpmi: psutils-2:1.23-alt2 sisyphus.216379.100 1541920784 installed
<13>Jan  5 09:40:21 rpmi: perl-Dist-CheckConflicts-0.11-alt1 1397076608 installed
<13>Jan  5 09:40:21 rpmi: perl-Module-Implementation-0.09-alt1 1418836057 installed
<13>Jan  5 09:40:21 rpmi: libjasper-2.0.14-alt1 1530105217 installed
<13>Jan  5 09:40:21 rpmi: libtcl-8.6.8-alt1 1518663643 installed
<13>Jan  5 09:40:21 rpmi: python-module-sphinxcontrib-2.1.1-alt2.1.2 1526455698 installed
<13>Jan  5 09:40:22 rpmi: libopenblas-0.2.20-alt1 1527005646 installed
<13>Jan  5 09:40:22 rpmi: perl-IO-stringy-2.111-alt1 1432302202 installed
<13>Jan  5 09:40:22 rpmi: perl-MRO-Compat-0.13-alt1 1491292748 installed
<13>Jan  5 09:40:22 rpmi: perl-Devel-StackTrace-1:2.03-alt1 1511420922 installed
<13>Jan  5 09:40:22 rpmi: perl-Sub-Exporter-Progressive-0.001013-alt1 1479395404 installed
<13>Jan  5 09:40:22 rpmi: perl-Unicode-Normalize-1:5.26.2-alt2 1534850821 installed
<13>Jan  5 09:40:22 rpmi: perl-File-Which-1.23-alt1 sisyphus.218871.100 1546337313 installed
<13>Jan  5 09:40:22 rpmi: perl-Tie-RefHash-1.39-alt1 1316492563 installed
<13>Jan  5 09:40:22 rpmi: perl-TimeDate-2.30-alt1 1374766201 installed
<13>Jan  5 09:40:22 rpmi: perl-IO-Socket-IP-0.39-alt1 1494508514 installed
<13>Jan  5 09:40:22 rpmi: perl-LWP-MediaTypes-6.02-alt1 1329754558 installed
<13>Jan  5 09:40:22 rpmi: perl-Compress-Raw-Zlib-2.083-alt1 sisyphus.218843.100 1546249306 installed
<13>Jan  5 09:40:22 rpmi: perl-HTML-Tagset-3.20-alt2 1317725093 installed
<13>Jan  5 09:40:22 rpmi: libidn2-2.0.5-alt1 1526923875 installed
<13>Jan  5 09:40:22 rpmi: libxapian-1.4.5-alt3 sisyphus.215025.100 1539610704 installed
<13>Jan  5 09:40:22 rpmi: python-sphinx-objects.inv-1:2.3.8.20181220-alt1 sisyphus.218261.100 1545348338 installed
<13>Jan  5 09:40:22 rpmi: xml-utils-1:2.9.4.0.12.e905-alt1.1 1525115767 installed
<13>Jan  5 09:40:22 rpmi: docbook-dtds-4.5-alt1 1223476557 installed
<13>Jan  5 09:40:22 rpmi: glib-1.2.10-alt20 1461002535 installed
<13>Jan  5 09:40:22 rpmi: liblcms2-2.9-alt1 1516411892 installed
<13>Jan  5 09:40:22 rpmi: libjbig-2.1-alt1 1401380926 installed
<13>Jan  5 09:40:22 rpmi: ed-1:0.2-alt10 1449768440 installed
<13>Jan  5 09:40:22 rpmi: libwebp7-1.0.1-alt1 sisyphus.216740.100 1542890911 installed
<13>Jan  5 09:40:22 rpmi: libpixman-3:0.34.0-alt1 1480491657 installed
<13>Jan  5 09:40:22 rpmi: libglvnd-7:1.1.0-alt3 sisyphus.215982.100 1541498632 installed
<13>Jan  5 09:40:22 rpmi: libwayland-server-1.16.0-alt1 1535614871 installed
<13>Jan  5 09:40:22 rpmi: ilmbase12-common-2.2.0-alt1.1 1434452921 installed
<13>Jan  5 09:40:22 rpmi: libiex12-2.2.0-alt1.1 1434452921 installed
<13>Jan  5 09:40:22 rpmi: libilmthread12-2.2.0-alt1.1 1434452921 installed
<13>Jan  5 09:40:22 rpmi: libhalf12-2.2.0-alt1.1 1434452921 installed
<13>Jan  5 09:40:22 rpmi: libnetdude-0.11-alt2_16 1511642104 installed
<13>Jan  5 09:40:22 rpmi: docbook-style-xsl-1.79.1-alt2 sisyphus.213665.100 1537949315 installed
<13>Jan  5 09:40:22 rpmi: perl-autodie-2.29-alt1 1445013559 installed
<13>Jan  5 09:40:22 rpmi: perl-File-HomeDir-1.004-alt1 1525450444 installed
<13>Jan  5 09:40:22 rpmi: perl-unicore-1:5.26.2-alt2 1534850660 installed
<13>Jan  5 09:40:22 rpmi: perl-Net-IDN-Encode-2.401-alt1 sisyphus.213503.100 1537609149 installed
<13>Jan  5 09:40:22 rpmi: perl-Devel-GlobalDestruction-1:0.14-alt1 1479389769 installed
<13>Jan  5 09:40:22 rpmi: perl-Role-Tiny-2.000006-alt1 1513709006 installed
<13>Jan  5 09:40:22 rpmi: perl-OLE-Storage_Lite-0.19-alt2 1291028388 installed
<13>Jan  5 09:40:22 rpmi: tcl-8.6.8-alt1 1518663643 installed
<13>Jan  5 09:40:22 rpmi: libgdbm-devel-1.8.3-alt10 1454943334 installed
<13>Jan  5 09:40:22 rpmi: perl-Data-Dump-1.23-alt1 1444601978 installed
<13>Jan  5 09:40:22 rpmi: perl-File-Listing-6.04-alt1 1329758996 installed
<13>Jan  5 09:40:22 rpmi: libpcap-devel-2:1.1.1-alt3 1298589613 installed
<13>Jan  5 09:40:22 rpmi: chrooted-0.3.9-alt1 1524554183 installed
<13>Jan  5 09:40:22 rpmi: chrooted-resolv-0.3.1-alt2 1176155250 installed
<13>Jan  5 09:40:22 rpmi: perl-Algorithm-Diff-1.1903-alt1 1418755800 installed
<13>Jan  5 09:40:22 rpmi: t1utils-1.41-alt1 1502978415 installed
<13>Jan  5 09:40:22 rpmi: libqqwing-1.3.4-alt2 1436192940 installed
<13>Jan  5 09:40:22 rpmi: qqwing-1.3.4-alt2 1436192940 installed
<13>Jan  5 09:40:22 rpmi: python-module-imagesize-0.7.1-alt1 1461387704 installed
<13>Jan  5 09:40:22 rpmi: python-module-google-0.4.2-alt2.1 1517733343 installed
<13>Jan  5 09:40:22 rpmi: python-module-enum34-1.1.6-alt3 1527251693 installed
<13>Jan  5 09:40:22 rpmi: libxblas-1.0.248-alt1.1 1496143682 installed
<13>Jan  5 09:40:22 rpmi: libquadmath0-8.2.1-alt2 sisyphus.218691.100 1545948777 installed
<13>Jan  5 09:40:22 rpmi: libgfortran4-7.3.1-alt7 sisyphus.214000.100 1542667145 installed
<13>Jan  5 09:40:23 rpmi: liblapack-1:3.8.0-alt1 1527158339 installed
<13>Jan  5 09:40:23 rpmi: libnumpy-1:1.15.4-alt1 sisyphus.218638.200 1545948948 installed
<13>Jan  5 09:40:23 rpmi: perl-Text-Unidecode-1.30-alt1 1480505027 installed
<13>Jan  5 09:40:23 rpmi: perl-Unicode-Map-0.112-alt7 1530370831 installed
<13>Jan  5 09:40:23 rpmi: perl-Digest-Perl-MD5-1.9-alt1 1394057208 installed
<13>Jan  5 09:40:23 rpmi: perl-Crypt-RC4-2.02-alt1 1319549646 installed
<13>Jan  5 09:40:23 rpmi: perl-Math-Complex-1.59-alt1 1334229876 installed
<13>Jan  5 09:40:23 rpmi: perl-XML-RegExp-0.04-alt1 1348526543 installed
<13>Jan  5 09:40:23 rpmi: perl-DBI-1.642-alt1 sisyphus.215860.100 1540963448 installed
<13>Jan  5 09:40:23 rpmi: perl-Package-Stash-XS-0.29-alt1 sisyphus.218846.100 1546250440 installed
<13>Jan  5 09:40:23 rpmi: perl-Package-Stash-0.38-alt1 sisyphus.218845.100 1546250118 installed
<13>Jan  5 09:40:23 rpmi: perl-Sub-Identify-0.14-alt1.1 1513353208 installed
<13>Jan  5 09:40:23 rpmi: perl-Variable-Magic-0.62-alt1.1 1513353175 installed
<13>Jan  5 09:40:23 rpmi: perl-B-Hooks-EndOfScope-0.24-alt1 1524680298 installed
<13>Jan  5 09:40:23 rpmi: perl-namespace-clean-0.27-alt1 1464272543 installed
<13>Jan  5 09:40:23 rpmi: perl-namespace-autoclean-0.28-alt1 1444994071 installed
<13>Jan  5 09:40:23 rpmi: perl-Sub-Quote-2.005001-alt1 1524683989 installed
<13>Jan  5 09:40:23 rpmi: perl-Class-Data-Inheritable-0.08-alt2 1316996762 installed
<13>Jan  5 09:40:23 rpmi: perl-Exception-Class-1.44-alt1 1513614520 installed
<13>Jan  5 09:40:23 rpmi: perl-PadWalker-2.3-alt1.1 1513353104 installed
<13>Jan  5 09:40:23 rpmi: perl-Devel-Caller-2.06-alt2.1.1.1.1 1513353240 installed
<13>Jan  5 09:40:23 rpmi: perl-Devel-LexAlias-0.05-alt2_17 1531757320 installed
<13>Jan  5 09:40:23 rpmi: perl-Eval-Closure-0.14-alt1 1465147597 installed
<13>Jan  5 09:40:23 rpmi: perl-Params-ValidationCompiler-0.30-alt1 1533170707 installed
<13>Jan  5 09:40:23 rpmi: perl-Mail-Sendmail-0.80-alt1 1504118031 installed
<13>Jan  5 09:40:23 rpmi: perl-Mail-Sender-1:0.903-alt1 1479576662 installed
<13>Jan  5 09:40:23 rpmi: perl-Email-Date-Format-1.005-alt1 1413796337 installed
<13>Jan  5 09:40:23 rpmi: ppp-common-0.5.1-alt1 1244040597 installed
<13>Jan  5 09:40:23 rpmi: sendmail-common-1.7-alt3 1353029717 installed
<13>Jan  5 09:40:23 rpmi: perl-Locale-Maketext-Simple-0.21-alt3 1321333616 installed
<13>Jan  5 09:40:23 rpmi: perl-IPC-System-Simple-1.25-alt2_1 1388863478 installed
<13>Jan  5 09:40:23 rpmi: perl-Term-Cap-1.17-alt1 1445018869 installed
<13>Jan  5 09:40:23 rpmi: perl-Pod-Escapes-1.07-alt1 1418767892 installed
<13>Jan  5 09:40:23 rpmi: perl-File-Copy-Recursive-0.44-alt1 1525447381 installed
<13>Jan  5 09:40:23 rpmi: perl-Digest-SHA1-2.13-alt5.1.1.1.1 1513357544 installed
<13>Jan  5 09:40:23 rpmi: less-481-alt2 1477575586 installed
<13>Jan  5 09:40:23 rpmi: perl-Compress-Raw-Bzip2-2.083-alt1 sisyphus.218842.100 1546248695 installed
<13>Jan  5 09:40:23 rpmi: libdb4.7-devel-4.7.25-alt9 1490438479 installed
<13>Jan  5 09:40:23 rpmi: perl-devel-1:5.26.2-alt2 1534850821 installed
<13>Jan  5 09:40:23 rpmi: perl-Test-Fatal-0.014-alt1 1418768336 installed
<13>Jan  5 09:40:23 rpmi: perl-Specio-0.43-alt1 sisyphus.215861.100 1540964587 installed
<13>Jan  5 09:40:23 rpmi: mailx-8.1.2-alt7 1366314832 installed
<13>Jan  5 09:40:23 rpmi: sharutils-4.6.3-alt1.1.qa2.1 1449219807 installed
<13>Jan  5 09:40:23 rpmi: ncompress-4.2.4.4-alt1 1366160442 installed
<13>Jan  5 09:40:23 rpmi: libpng12-1.2.50-alt2 1347753435 installed
<13>Jan  5 09:40:23 rpmi: xorg-rgb-1.0.4-alt1.qa1 1366268679 installed
<13>Jan  5 09:40:23 rpmi: libnetpbm-10.35.97-alt1.qa1 sisyphus.214808.100 1539731139 installed
<13>Jan  5 09:40:23 rpmi: hd2u-1.0.3-alt2 1400842666 installed
<13>Jan  5 09:40:23 rpmi: libyaml2-0.2.1-alt1 sisyphus.214707.100 1539464411 installed
<13>Jan  5 09:40:23 rpmi: libruby-2.5.1-alt4 sisyphus.209945.120 1537061465 installed
<13>Jan  5 09:40:23 rpmi: perl-Filter-1.59-alt1 1533737242 installed
<13>Jan  5 09:40:23 rpmi: perl-Encode-2.98-alt1 1525447819 installed
<13>Jan  5 09:40:23 rpmi: perl-URI-1.74-alt1 1525446424 installed
<13>Jan  5 09:40:23 rpmi: perl-HTML-Parser-3.72-alt1.1.1 1513340808 installed
<13>Jan  5 09:40:23 rpmi: perl-IO-Compress-2.083-alt1 sisyphus.218844.100 1546249771 installed
<13>Jan  5 09:40:23 rpmi: perl-Net-HTTP-6.18-alt1 1526560501 installed
<13>Jan  5 09:40:23 rpmi: perl-WWW-RobotRules-6.02-alt1 1329756211 installed
<13>Jan  5 09:40:23 rpmi: perl-Encode-Locale-1.05-alt1 1444608613 installed
<13>Jan  5 09:40:23 rpmi: perl-IO-HTML-1.001-alt1 1404821752 installed
<13>Jan  5 09:40:23 rpmi: perl-HTTP-Message-6.18-alt1 1528288416 installed
<13>Jan  5 09:40:23 rpmi: perl-HTTP-Cookies-6.04-alt1 1504116575 installed
<13>Jan  5 09:40:23 rpmi: perl-HTTP-Negotiate-6.01-alt1 1329760563 installed
<13>Jan  5 09:40:23 rpmi: perl-libwww-6.36-alt1 sisyphus.215515.100 1540400896 installed
<13>Jan  5 09:40:23 rpmi: perl-XML-Parser-2.44-alt2.1.1 1513346417 installed
<13>Jan  5 09:40:23 rpmi: perl-XML-DOM-1.46-alt1 1474815568 installed
<13>Jan  5 09:40:23 rpmi: perl-XML-XPath-1.44-alt1 sisyphus.215541.100 1540451758 installed
<13>Jan  5 09:40:23 rpmi: perl-HTML-Form-6.03-alt1_18 1531781634 installed
<13>Jan  5 09:40:23 rpmi: perl-XML-Writer-0.625-alt1 1402417374 installed
<13>Jan  5 09:40:23 rpmi: hwinfo-utils-21.23-alt1 1449144049 installed
<13>Jan  5 09:40:23 rpmi: perl-Pod-Simple-3.35-alt1 1482098090 installed
<13>Jan  5 09:40:23 rpmi: perl-Pod-Usage-1.69-alt1 1464274721 installed
<13>Jan  5 09:40:23 rpmi: perl-podlators-4.11-alt1 1525935408 installed
<13>Jan  5 09:40:23 rpmi: perl-HTML-Tree-5.07-alt1 1506480309 installed
<13>Jan  5 09:40:23 rpmi: perl-HTML-Formatter-2.16-alt1 1482105372 installed
<13>Jan  5 09:40:23 rpmi: perl-WWW-Mechanize-1.90-alt1 sisyphus.216667.100 1542752034 installed
<13>Jan  5 09:40:23 rpmi: perl-MIME-Types-2.17-alt1 1517533413 installed
<13>Jan  5 09:40:23 rpmi: perl-Text-CSV_XS-1.38-alt1 sisyphus.218829.100 1546189124 installed
<13>Jan  5 09:40:23 rpmi: perl-Spreadsheet-ParseExcel-1:0.65-alt1 1395677487 installed
<13>Jan  5 09:40:23 rpmi: perl-MIME-Charset-1.012.2-alt1 1494353584 installed
<13>Jan  5 09:40:23 rpmi: perl-YAML-Tiny-1.73-alt1 1520430664 installed
<13>Jan  5 09:40:23 rpmi: libkpathsea6-2018-alt2_7 sisyphus.217374.100 1544051367 installed
<13>Jan  5 09:40:23 rpmi: libptexenc1-2018-alt2_7 sisyphus.217374.100 1544051367 installed
<13>Jan  5 09:40:23 rpmi: libsynctex1-2018-alt2_7 sisyphus.217374.100 1544051367 installed
<13>Jan  5 09:40:23 rpmi: libtexlua5-2018-alt2_7 sisyphus.217374.100 1544051367 installed
<13>Jan  5 09:40:23 rpmi: zziplib-0.13.69-alt1 1523001476 installed
<13>Jan  5 09:40:23 rpmi: publicsuffix-list-dafsa-20181106-alt1 sisyphus.216228.100 1541611754 installed
<13>Jan  5 09:40:23 rpmi: libpsl-0.20.2-alt2 sisyphus.216228.200 1541611889 installed
<13>Jan  5 09:40:23 rpmi: libnghttp2-1.34.0-alt1 sisyphus.214524.100 1539249634 installed
<13>Jan  5 09:40:23 rpmi: libbrotlicommon-1.0.7-alt1 sisyphus.215491.100 1540428597 installed
<13>Jan  5 09:40:23 rpmi: libbrotlidec-1.0.7-alt1 sisyphus.215491.100 1540428597 installed
<13>Jan  5 09:40:24 rpmi: poppler-data-0.4.9-alt1 sisyphus.216033.100 1541141723 installed
<13>Jan  5 09:40:24 rpmi: libicu63-1:6.3.1-alt1 sisyphus.215328.100 1540049988 installed
<13>Jan  5 09:40:24 rpmi: libteckit-2.5.1-alt2.1 1319227325 installed
<13>Jan  5 09:40:24 rpmi: libteckit-utils-2.5.1-alt2.1 1319227325 installed
<13>Jan  5 09:40:24 rpmi: libOpenSP-1.5.2-alt3.qa1 1365943435 installed
<13>Jan  5 09:40:25 rpmi: openjade-1.3.2-alt14 1507625375 installed
<13>Jan  5 09:40:25 rpmi: docbook-style-dsssl-1.79-alt3 1324062818 installed
<13>Jan  5 09:40:25 rpmi: highlight-3.38-alt1 1499785557 installed
<13>Jan  5 09:40:25 rpmi: python-modules-curses-2.7.15-alt1 sisyphus.217364.100 1544022423 installed
<13>Jan  5 09:40:25 rpmi: gcc-c++-common-1.4.23-alt1 sisyphus.218115.200 1545282875 installed
<13>Jan  5 09:40:25 rpmi: libstdc++8-devel-8.2.1-alt2 sisyphus.218691.100 1545948777 installed
<13>Jan  5 09:40:26 rpmi: gcc8-c++-8.2.1-alt2 sisyphus.218691.100 1545948777 installed
<13>Jan  5 09:40:26 rpmi: libdialog-1.3.20171209-alt1 1529583087 installed
<13>Jan  5 09:40:26 rpmi: dialog-1.3.20171209-alt1 1529583087 installed
<13>Jan  5 09:40:26 rpmi: libwmflite-0.2.8.4-alt13 1506519339 installed
<13>Jan  5 09:40:26 rpmi: libltdl7-2.4.2-alt7 sisyphus.216946.100 1543650637 installed
<13>Jan  5 09:40:26 rpmi: liblqr-0.4.2-alt1 1383038438 installed
<13>Jan  5 09:40:26 rpmi: libgomp1-8.2.1-alt2 sisyphus.218691.100 1545948777 installed
<13>Jan  5 09:40:26 rpmi: djvu-common-3.5.25.3-alt1 1365826139 installed
<13>Jan  5 09:40:26 rpmi: libdjvu-3.5.25.3-alt1 1365826139 installed
<13>Jan  5 09:40:26 rpmi: libgts-0.7.6-alt2.drc20130205 1360123649 installed
<13>Jan  5 09:40:26 rpmi: libgtk+2-locales-2.24.32-alt2 1518699309 installed
<13>Jan  5 09:40:26 rpmi: libverto-0.3.0-alt1_5 1525957714 installed
<13>Jan  5 09:40:26 rpmi: libkeyutils-1.6-alt2 sisyphus.217337.100 1544003161 installed
<13>Jan  5 09:40:26 rpmi: libtasn1-4.13-alt2 1521133850 installed
<13>Jan  5 09:40:26 rpmi: rpm-macros-alternatives-0.4.5-alt1.1 1404382149 installed
<13>Jan  5 09:40:26 rpmi: alternatives-0.4.5-alt1.1 1404382149 installed
<13>Jan  5 09:40:27 rpmi: libnss-3.40.1-alt1 sisyphus.218259.100 1545764952 installed
<13>Jan  5 09:40:27 rpmi: nss-utils-3.40.1-alt1 sisyphus.218259.100 1545764952 installed
<13>Jan  5 09:40:27 rpmi: netpbm-10.35.97-alt1.qa1 sisyphus.214808.100 1539731139 installed
<13>Jan  5 09:40:27 rpmi: gambit-4.9.1-alt3 sisyphus.216954.640 1543343554 installed
<13>Jan  5 09:40:27 rpmi: foomatic-db-engine-4.0.12-alt1 1449527983 installed
<13>Jan  5 09:40:27 rpmi: libp11-kit-0.23.9-alt5 1525798298 installed
<13>Jan  5 09:40:27 rpmi: ca-certificates-2018.11.12-alt1 sisyphus.216395.300 1542114035 installed
<13>Jan  5 09:40:27 rpmi: ca-trust-0.1.1-alt2 1515595785 installed
<13>Jan  5 09:40:27 rpmi: p11-kit-trust-0.23.9-alt5 1525798298 installed
<13>Jan  5 09:40:27 rpmi: libcrypto1.1-1.1.0j-alt1 sisyphus.216647.100 1542743878 installed
<13>Jan  5 09:40:27 rpmi: libssl1.1-1.1.0j-alt1 sisyphus.216647.100 1542743878 installed
<13>Jan  5 09:40:28 rpmi: libpython3-3.6.5-alt1.1 1535734576 installed
<13>Jan  5 09:40:28 rpmi: rpm-build-python3-0.1.13.1-alt2 1535450458 installed
<13>Jan  5 09:40:28 rpmi: tests-for-installed-python3-pkgs-0.1.13.1-alt2 1535450458 installed
<13>Jan  5 09:40:28 rpmi: python3-3.6.5-alt1.1 1535734576 installed
<13>Jan  5 09:40:28 rpmi: python3-base-3.6.5-alt1.1 1535734576 installed
<13>Jan  5 09:40:28 rpmi: python3-module-six-1.11.0-alt2 1535611135 installed
<13>Jan  5 09:40:28 rpmi: python3-module-pkg_resources-1:40.5.0-alt1 sisyphus.216029.100 1541106477 installed
<13>Jan  5 09:40:28 rpmi: libcrypto10-1.0.2q-alt1 sisyphus.218116.300 1545346652 installed
<13>Jan  5 09:40:28 rpmi: python3-module-idna-2.7-alt1 1530720902 installed
<13>Jan  5 09:40:28 rpmi: libssl10-1.0.2q-alt1 sisyphus.218116.300 1545346652 installed
<13>Jan  5 09:40:29 rpmi: ruby-stdlibs-2.5.1-alt4 sisyphus.209945.120 1537061465 installed
<13>Jan  5 09:40:29 rpmi: ruby-2.5.1-alt4 sisyphus.209945.120 1537061465 installed
<13>Jan  5 09:40:29 rpmi: python3-module-ntlm-1.1.0-alt1.1.1.1 1460405346 installed
<13>Jan  5 09:40:29 rpmi: python3-module-anytree-2.4.3-alt1 1521929586 installed
<13>Jan  5 09:40:29 rpmi: python3-module-more-itertools-5.0.0-alt1 sisyphus.218699.100 1545980609 installed
<13>Jan  5 09:40:29 rpmi: python3-module-genshi-0.7-alt1.1.1.1 1460400448 installed
<13>Jan  5 09:40:29 rpmi: python3-module-webencodings-0.5.1-alt1.1 1517943573 installed
<13>Jan  5 09:40:29 rpmi: python3-module-chardet-3.0.4-alt1 1506613818 installed
<13>Jan  5 09:40:29 rpmi: python3-module-ndg-0.4.2-alt1.qa1 1531457735 installed
<13>Jan  5 09:40:29 rpmi: python3-module-pycparser-2.19-alt1 sisyphus.216095.100 1541345023 installed
<13>Jan  5 09:40:29 rpmi: python3-module-cffi-1.10.0-alt1.1 1525117736 installed
<13>Jan  5 09:40:29 rpmi: python3-module-asn1crypto-0.24.0-alt1 1521037480 installed
<13>Jan  5 09:40:29 rpmi: python3-module-cryptography-2.4.2-alt1 sisyphus.216799.200 1543487260 installed
<13>Jan  5 09:40:29 rpmi: python3-module-OpenSSL-18.0.0-alt1 1532996168 installed
<13>Jan  5 09:40:29 rpmi: python3-module-ndg-httpsclient-0.4.2-alt1.qa1 1531457735 installed
<13>Jan  5 09:40:29 rpmi: python3-module-urllib3-2:1.24.1-alt2 sisyphus.218529.100 1545673498 installed
<13>Jan  5 09:40:29 rpmi: python3-module-requests-2.21.0-alt1 sisyphus.218511.200 1545669878 installed
<13>Jan  5 09:40:29 rpmi: python3-module-pytz-1:2016.10-alt1 1484291011 installed
<13>Jan  5 09:40:29 rpmi: python3-module-babel-1:2.4.0-alt1.1 1517644530 installed
<13>Jan  5 09:40:29 rpmi: python3-module-imagesize-0.7.1-alt1 1461387704 installed
<13>Jan  5 09:40:29 rpmi: python3-module-markupsafe-0.23-alt1.2.1.1 1525118834 installed
<13>Jan  5 09:40:29 rpmi: python3-module-jinja2-2.10-alt1 1521724576 installed
<13>Jan  5 09:40:29 rpmi: python3-module-atomicwrites-1.2.1-alt1 sisyphus.214347.100 1539076636 installed
<13>Jan  5 09:40:29 rpmi: python3-module-attrs-18.2.0-alt1 sisyphus.214354.100 1539088435 installed
<13>Jan  5 09:40:29 rpmi: python3-module-pluggy-0.8.0-alt1 sisyphus.215346.100 1540073015 installed
<13>Jan  5 09:40:30 rpmi: python3-module-py-1.7.0-alt1 sisyphus.214414.220 1539670883 installed
<13>Jan  5 09:40:30 rpmi: python3-module-pytest-3.10.1-alt1 sisyphus.218100.300 1545832616 installed
<13>Jan  5 09:40:30 rpmi: python3-module-snowballstemmer-1.2.0-alt2.1 1457859319 installed
<13>Jan  5 09:40:30 rpmi: python3-module-whoosh-2.7.4-alt1 1527698183 installed
<13>Jan  5 09:40:30 rpmi: python3-module-xapian-1.4.5-alt2.qa1 1531484078 installed
<13>Jan  5 09:40:30 rpmi: python3-modules-sqlite3-3.6.5-alt1.1 1535734576 installed
<13>Jan  5 09:40:30 rpmi: python3-module-SQLAlchemy-1.0.12-alt1.1 1525119509 installed
<13>Jan  5 09:40:30 rpmi: perl-Net-SSLeay-1.85-alt1.1 1535797032 installed
<13>Jan  5 09:40:30 rpmi: perl-IO-Socket-SSL-2.060-alt1 sisyphus.213414.100 1537479277 installed
<13>Jan  5 09:40:30 rpmi: perl-Net-HTTPS-6.18-alt1 1526560501 installed
<13>Jan  5 09:40:30 rpmi: perl-LWP-Protocol-https-6.07-alt1 1494527383 installed
<13>Jan  5 09:40:30 rpmi: perl-Net-SMTP-SSL-1.04-alt1 1479470835 installed
<13>Jan  5 09:40:30 rpmi: perl-MailTools-2.20-alt1 1517533205 installed
<13>Jan  5 09:40:30 rpmi: perl-MIME-Lite-3.030-alt1 1383865152 installed
<13>Jan  5 09:40:30 rpmi: perl-Log-Dispatch-2.68-alt2 sisyphus.218872.100 1546338428 installed
<13>Jan  5 09:40:30 rpmi: perl-Log-Log4perl-1.49-alt1 1489613295 installed
<13>Jan  5 09:40:30 rpmi: libcom_err-1.44.5-alt1 sisyphus.218838.100 1546206118 installed
<86>Jan  5 09:40:30 groupadd[124948]: group added to /etc/group: name=_keytab, GID=499
<86>Jan  5 09:40:30 groupadd[124948]: group added to /etc/gshadow: name=_keytab
<86>Jan  5 09:40:30 groupadd[124948]: new group: name=_keytab, GID=499
<13>Jan  5 09:40:30 rpmi: libkrb5-1.16.2-alt2 sisyphus.216877.200 1543483297 installed
<13>Jan  5 09:40:30 rpmi: libtirpc-1.0.3-alt1 1532008017 installed
<13>Jan  5 09:40:30 rpmi: libnsl2-1.1.0-alt1_1 1511548749 installed
<13>Jan  5 09:40:30 rpmi: python-modules-compiler-2.7.15-alt1 sisyphus.217364.100 1544022423 installed
<13>Jan  5 09:40:30 rpmi: python-modules-email-2.7.15-alt1 sisyphus.217364.100 1544022423 installed
<13>Jan  5 09:40:30 rpmi: python-modules-unittest-2.7.15-alt1 sisyphus.217364.100 1544022423 installed
<13>Jan  5 09:40:30 rpmi: python-modules-encodings-2.7.15-alt1 sisyphus.217364.100 1544022423 installed
<13>Jan  5 09:40:30 rpmi: python-modules-2.7.15-alt1 sisyphus.217364.100 1544022423 installed
<13>Jan  5 09:40:30 rpmi: python-modules-nis-2.7.15-alt1 sisyphus.217364.100 1544022423 installed
<13>Jan  5 09:40:30 rpmi: python-modules-xml-2.7.15-alt1 sisyphus.217364.100 1544022423 installed
<13>Jan  5 09:40:30 rpmi: python-module-six-1.11.0-alt2 1535611135 installed
<13>Jan  5 09:40:31 rpmi: python-modules-ctypes-2.7.15-alt1 sisyphus.217364.100 1544022423 installed
<13>Jan  5 09:40:31 rpmi: python-module-pkg_resources-1:40.5.0-alt1 sisyphus.216029.100 1541106477 installed
<13>Jan  5 09:40:31 rpmi: python-modules-json-2.7.15-alt1 sisyphus.217364.100 1544022423 installed
<13>Jan  5 09:40:31 rpmi: python-modules-multiprocessing-2.7.15-alt1 sisyphus.217364.100 1544022423 installed
<13>Jan  5 09:40:31 rpmi: python-modules-logging-2.7.15-alt1 sisyphus.217364.100 1544022423 installed
<13>Jan  5 09:40:31 rpmi: python-modules-hotshot-2.7.15-alt1 sisyphus.217364.100 1544022423 installed
<13>Jan  5 09:40:31 rpmi: python-module-py-1.7.0-alt1 sisyphus.214414.220 1539670883 installed
<13>Jan  5 09:40:31 rpmi: python-module-chardet-3.0.4-alt1 1506613818 installed
<13>Jan  5 09:40:31 rpmi: python-tools-2to3-2.7.15-alt1 sisyphus.217364.100 1544022423 installed
<13>Jan  5 09:40:31 rpmi: python-module-future-0.16.0-alt2 1500998941 installed
<13>Jan  5 09:40:31 rpmi: python-module-pyglet-1.3.0-alt4.a1.hg20150730.1.1.1 1460413686 installed
<13>Jan  5 09:40:31 rpmi: python-module-whoosh-2.7.4-alt1 1527697941 installed
<13>Jan  5 09:40:31 rpmi: python-module-webencodings-0.5.1-alt1.1 1517943573 installed
<13>Jan  5 09:40:31 rpmi: python-module-more-itertools-5.0.0-alt1 sisyphus.218699.100 1545980609 installed
<13>Jan  5 09:40:31 rpmi: python-modules-bsddb-2.7.15-alt1 sisyphus.217364.100 1544022423 installed
<13>Jan  5 09:40:31 rpmi: python-2.7.15-alt1 sisyphus.217364.100 1544022423 installed
<13>Jan  5 09:40:31 rpmi: python-strict-2.7.15-alt1 sisyphus.217364.100 1544022396 installed
<13>Jan  5 09:40:31 rpmi: python-modules-distutils-2.7.15-alt1 sisyphus.217364.100 1544022423 installed
<13>Jan  5 09:40:31 rpmi: python-module-idna-2.7-alt1 1530720902 installed
<13>Jan  5 09:40:31 rpmi: python-module-4Suite-XML-1.0.2-alt4 sisyphus.213628.100 1537973311 installed
<13>Jan  5 09:40:31 rpmi: python-module-attrs-18.2.0-alt1 sisyphus.214354.100 1539088435 installed
<13>Jan  5 09:40:31 rpmi: python-module-pycparser-2.19-alt1 sisyphus.216095.100 1541345023 installed
<13>Jan  5 09:40:31 rpmi: python-module-cffi-1.10.0-alt1.1 1525117736 installed
<13>Jan  5 09:40:31 rpmi: python-module-asn1crypto-0.24.0-alt1 1521037480 installed
<13>Jan  5 09:40:31 rpmi: python-module-ntlm-1.1.0-alt1.1.1.1 1460405346 installed
<13>Jan  5 09:40:31 rpmi: python-module-pytz-1:2016.10-alt1 1484291011 installed
<13>Jan  5 09:40:32 rpmi: python-module-babel-1:2.4.0-alt1.1 1517644530 installed
<13>Jan  5 09:40:32 rpmi: python-module-PyStemmer-1.0.1-alt1.2.1 1321388303 installed
<13>Jan  5 09:40:32 rpmi: python-module-snowballstemmer-1.2.0-alt2.1 1457859319 installed
<13>Jan  5 09:40:32 rpmi: python-module-funcsigs-1.0.2-alt1.1 1517699355 installed
<13>Jan  5 09:40:32 rpmi: python-module-scandir-1.9.0-alt1 1535455370 installed
<13>Jan  5 09:40:32 rpmi: python-module-pathlib2-2.3.3-alt1 sisyphus.218098.100 1545218863 installed
<13>Jan  5 09:40:32 rpmi: python-module-atomicwrites-1.2.1-alt1 sisyphus.214347.100 1539076636 installed
<13>Jan  5 09:40:32 rpmi: python-module-simplejson-3.15.0-alt1.qa1 sisyphus.214917.100 1539845528 installed
<13>Jan  5 09:40:32 rpmi: python-module-ndg-0.4.2-alt1.qa1 1531457735 installed
<13>Jan  5 09:40:32 rpmi: python-module-ipaddress-1.0.18-alt1.1 1517713372 installed
<13>Jan  5 09:40:32 rpmi: python-module-cryptography-2.4.2-alt1 sisyphus.216799.200 1543487260 installed
<13>Jan  5 09:40:32 rpmi: python-module-OpenSSL-18.0.0-alt1 1532996168 installed
<13>Jan  5 09:40:32 rpmi: python-module-ndg-httpsclient-0.4.2-alt1.qa1 1531457735 installed
<13>Jan  5 09:40:32 rpmi: python-module-backports-3.5.0.1-alt1.1.1 1517645428 installed
<13>Jan  5 09:40:32 rpmi: python-module-backports.ssl_match_hostname-3.5.0.1-alt1.1.1 1517645428 installed
<13>Jan  5 09:40:32 rpmi: python-module-urllib3-2:1.24.1-alt2 sisyphus.218529.100 1545673498 installed
<13>Jan  5 09:40:32 rpmi: python-module-requests-2.21.0-alt1 sisyphus.218511.200 1545669878 installed
<13>Jan  5 09:40:32 rpmi: python-module-typing-3.6.4-alt1 1517577671 installed
<13>Jan  5 09:40:32 rpmi: python-module-markupsafe-0.23-alt1.2.1.1 1525118834 installed
<13>Jan  5 09:40:32 rpmi: python-module-jinja2-2.10-alt1 1521724576 installed
<13>Jan  5 09:40:32 rpmi: python-modules-sqlite3-2.7.15-alt1 sisyphus.217364.100 1544022423 installed
<13>Jan  5 09:40:32 rpmi: python-module-SQLAlchemy-1.0.12-alt1.1 1525119509 installed
<13>Jan  5 09:40:32 rpmi: python-module-mpmath-0.19-alt1.git20150621.1.1.1.1 1496417680 installed
<13>Jan  5 09:40:32 rpmi: python-module-sympy-tests-1:1.1.1-alt1.1 1517989815 installed
<13>Jan  5 09:40:33 rpmi: python-module-sympy-1:1.1.1-alt1.1 1517989815 installed
<13>Jan  5 09:40:33 rpmi: python-module-pluggy-0.8.0-alt1 sisyphus.215346.100 1540073015 installed
<13>Jan  5 09:40:33 rpmi: python-module-pytest-3.10.1-alt1 sisyphus.218100.300 1545832616 installed
<13>Jan  5 09:40:33 rpmi: python-module-numpy-1:1.15.4-alt1 sisyphus.218638.200 1545948948 installed
<13>Jan  5 09:40:33 rpmi: python-module-numpy-testing-1:1.15.4-alt1 sisyphus.218638.200 1545948948 installed
<13>Jan  5 09:40:33 rpmi: python-module-xapian-1.4.5-alt2.qa1 1531484078 installed
<86>Jan  5 09:40:33 groupadd[1573]: group added to /etc/group: name=sasl, GID=498
<86>Jan  5 09:40:33 groupadd[1573]: group added to /etc/gshadow: name=sasl
<86>Jan  5 09:40:33 groupadd[1573]: new group: name=sasl, GID=498
<13>Jan  5 09:40:33 rpmi: libsasl2-3-2.1.27-alt1 sisyphus.218476.200 1545647755 installed
<13>Jan  5 09:40:33 rpmi: libldap-2.4.46-alt1 1535562135 installed
<13>Jan  5 09:40:33 rpmi: libcurl-7.63.0-alt1 sisyphus.217831.100 1544762811 installed
<13>Jan  5 09:40:33 rpmi: liblz4-1:1.8.3-alt1 sisyphus.213737.100 1538009686 installed
<13>Jan  5 09:40:33 rpmi: libgpg-error-1.31-alt1.S1 1529015802 installed
<13>Jan  5 09:40:33 rpmi: libgcrypt20-1.8.3-alt4 sisyphus.218050.200 1545223289 installed
<13>Jan  5 09:40:33 rpmi: libxslt-1.1.32-alt2 1517429984 installed
<13>Jan  5 09:40:33 rpmi: python3-module-cssselect-0.9.1-alt1.2 1526980827 installed
<13>Jan  5 09:40:33 rpmi: python3-module-html5lib-1:0.999999999-alt4.qa1 sisyphus.214868.100 1539741045 installed
<13>Jan  5 09:40:34 rpmi: python3-module-lxml-4.2.5-alt1 sisyphus.218580.100 1545825029 installed
<13>Jan  5 09:40:34 rpmi: python3-module-docutils-0.14-alt2 1535729778 installed
<13>Jan  5 09:40:34 rpmi: python-module-cssselect-0.9.1-alt1.2 1526980827 installed
<13>Jan  5 09:40:34 rpmi: python-module-html5lib-1:0.999999999-alt4.qa1 sisyphus.214868.100 1539741045 installed
<13>Jan  5 09:40:34 rpmi: python-module-lxml-4.2.5-alt1 sisyphus.218580.100 1545825029 installed
<13>Jan  5 09:40:34 rpmi: python-module-docutils-0.14-alt2 1535729778 installed
<13>Jan  5 09:40:34 rpmi: xsltproc-1.1.32-alt2 1517429984 installed
<13>Jan  5 09:40:34 rpmi: python-module-alabaster-0.7.6-alt3 1526385201 installed
<13>Jan  5 09:40:34 rpmi: python-module-sphinxcontrib-websupport-1.0.1-alt3.qa1 sisyphus.214922.100 1539851266 installed
<13>Jan  5 09:40:34 rpmi: python-module-sphinx-1:1.6.5-alt3 sisyphus.213215.100 1537280252 installed
<13>Jan  5 09:40:34 rpmi: python-module-Pygments-2.2.0-alt2 1526455576 installed
<13>Jan  5 09:40:34 rpmi: python3-module-alabaster-0.7.6-alt3 1526385201 installed
<13>Jan  5 09:40:34 rpmi: python3-module-sphinxcontrib-websupport-1.0.1-alt3.qa1 sisyphus.214922.100 1539851266 installed
<13>Jan  5 09:40:34 rpmi: python3-module-sphinx-1:1.6.5-alt3 sisyphus.213215.100 1537280252 installed
<13>Jan  5 09:40:35 rpmi: python3-module-Pygments-2.2.0-alt2 1526455576 installed
<13>Jan  5 09:40:35 rpmi: gtk-doc-1.29-alt2 sisyphus.217088.100 1543518451 installed
<13>Jan  5 09:40:35 rpmi: libsystemd-1:240-alt2 sisyphus.218943.100 1546556223 installed
<13>Jan  5 09:40:35 rpmi: libdbus-1.12.12-alt1 sisyphus.217336.100 1544000923 installed
<13>Jan  5 09:40:35 rpmi: libavahi-0.6.32-alt1 1500485702 installed
<13>Jan  5 09:40:35 rpmi: libcups-2.2.6-alt1 1510070343 installed
<13>Jan  5 09:40:35 rpmi: icon-theme-hicolor-0.17-alt1 1505715846 installed
<13>Jan  5 09:40:35 rpmi: libgdk-pixbuf-locales-2.38.0-alt2 sisyphus.213523.100 1537685512 installed
<13>Jan  5 09:40:35 rpmi: shared-mime-info-1.10-alt1.1 1530525599 installed
<13>Jan  5 09:40:35 rpmi: gsettings-desktop-schemas-data-3.28.1-alt1 sisyphus.212587.100 1536082062 installed
<13>Jan  5 09:40:35 rpmi: libgio-2.58.2-alt1 sisyphus.218134.100 1545260937 installed
<13>Jan  5 09:40:35 rpmi: gsettings-desktop-schemas-3.28.1-alt1 sisyphus.212587.100 1536082066 installed
<13>Jan  5 09:40:35 rpmi: libgdk-pixbuf-2.38.0-alt2 sisyphus.213523.100 1537685557 installed
<13>Jan  5 09:40:35 rpmi: gtk-update-icon-cache-3.24.2-alt2 sisyphus.218466.100 1545601989 installed
<13>Jan  5 09:40:35 rpmi: libatk-locales-2.30.0-alt1 sisyphus.212779.100 1536768328 installed
<13>Jan  5 09:40:35 rpmi: libatk-2.30.0-alt1 sisyphus.212779.100 1536768334 installed
<13>Jan  5 09:40:35 rpmi: libdatrie-0.2.9-alt1_6 1511686676 installed
<13>Jan  5 09:40:35 rpmi: libthai-0.1.28-alt1_1 sisyphus.214516.100 1539257851 installed
<13>Jan  5 09:40:35 rpmi: libsombok-2.4.0-alt1_8 sisyphus.214514.100 1539257353 installed
<13>Jan  5 09:40:35 rpmi: perl-Unicode-LineBreak-2019.001-alt1 sisyphus.218776.100 1546088375 installed
<13>Jan  5 09:40:35 rpmi: libfribidi-1.0.5-alt1 1532424345 installed
<13>Jan  5 09:40:35 rpmi: libxshmfence-1.2-alt2 1518613552 installed
<13>Jan  5 09:40:35 rpmi: libwayland-client-1.16.0-alt1 1535614871 installed
<13>Jan  5 09:40:35 rpmi: libpciaccess-1:0.14-alt1 1528969252 installed
<13>Jan  5 09:40:35 rpmi: libdrm-1:2.4.96-alt1 sisyphus.215486.100 1540374027 installed
<13>Jan  5 09:40:35 rpmi: libgbm-4:18.3.1-alt1 sisyphus.218704.100 1545992861 installed
<13>Jan  5 09:40:35 rpmi: libgraphite2-1.3.13-alt1 sisyphus.218545.100 1545686511 installed
<13>Jan  5 09:40:35 rpmi: libharfbuzz-2.2.0-alt1 sisyphus.218134.500 1545261518 installed
<13>Jan  5 09:40:35 rpmi: libfreetype-2.9.1-alt1.S1 1530781053 installed
<13>Jan  5 09:40:35 rpmi: fontconfig-2.13.1-alt1 sisyphus.215917.100 1540973886 installed
Updating fonts cache: <29>Jan  5 09:40:36 fontconfig: Updating fonts cache: succeeded
[ DONE ]
<13>Jan  5 09:40:36 rpmi: libgs-9.26-alt1 sisyphus.217431.100 1544113958 installed
<13>Jan  5 09:40:37 rpmi: fonts-type1-urw-3:1.0.7pre44-alt2 1419342366 installed
<13>Jan  5 09:40:38 rpmi: ghostscript-common-9.26-alt1 sisyphus.217431.100 1544113898 installed
<13>Jan  5 09:40:38 rpmi: ghostscript-classic-9.26-alt1 sisyphus.217431.100 1544113958 installed
<13>Jan  5 09:40:38 rpmi: libpoppler82-0.71.0-alt2 sisyphus.216206.200 1541601085 installed
<13>Jan  5 09:40:38 rpmi: ttf2pt1-3.4.4-alt1.qa1 1366267507 installed
<13>Jan  5 09:40:38 rpmi: libX11-locales-3:1.6.7-alt1 sisyphus.214413.200 1539171080 installed
<13>Jan  5 09:40:38 rpmi: libXdmcp-1.1.1-alt1 1334617701 installed
<13>Jan  5 09:40:38 rpmi: libXau-1.0.8-alt1 1369565808 installed
<13>Jan  5 09:40:38 rpmi: libxcb-1.13.1-alt1 sisyphus.214413.100 1539170896 installed
<13>Jan  5 09:40:38 rpmi: libX11-3:1.6.7-alt1 sisyphus.214413.200 1539171143 installed
<13>Jan  5 09:40:38 rpmi: libXext-1.3.3-alt1 1409902959 installed
<13>Jan  5 09:40:38 rpmi: libXrender-0.9.8-alt1 1371312112 installed
<13>Jan  5 09:40:38 rpmi: libXt-1.1.4-alt1 1369984722 installed
<13>Jan  5 09:40:38 rpmi: libXmu-1.1.2-alt1 1391072530 installed
<13>Jan  5 09:40:38 rpmi: libXft-2.3.2-alt1 1409902660 installed
<13>Jan  5 09:40:38 rpmi: libXfixes-5.0.3-alt1 sisyphus.216396.300 1542022162 installed
<13>Jan  5 09:40:38 rpmi: libXpm-3.5.11-alt1 1391072398 installed
<13>Jan  5 09:40:38 rpmi: libgd3-2.2.5-alt2.S1 1525496226 installed
<13>Jan  5 09:40:38 rpmi: libXdamage-1.1.3-alt4 1297162593 installed
<13>Jan  5 09:40:38 rpmi: libXaw-1.0.12-alt1 1391072624 installed
<13>Jan  5 09:40:38 rpmi: libXcursor-1.1.15-alt1.S1 1512373366 installed
<13>Jan  5 09:40:39 rpmi: perl-Tk-804.034-alt1.1 1513447202 installed
<13>Jan  5 09:40:39 rpmi: libtk-8.6.8-alt1 1518663864 installed
<13>Jan  5 09:40:39 rpmi: tk-8.6.8-alt1 1518663864 installed
<13>Jan  5 09:40:39 rpmi: xset-1.2.4-alt1 sisyphus.213358.100 1537438594 installed
<13>Jan  5 09:40:39 rpmi: libXrandr-1.5.0-alt1 1431936189 installed
<13>Jan  5 09:40:39 rpmi: libXxf86vm-1.1.4-alt2 1527672187 installed
<13>Jan  5 09:40:39 rpmi: libGLX-mesa-4:18.3.1-alt1 sisyphus.218704.100 1545992861 installed
<13>Jan  5 09:40:39 rpmi: libEGL-mesa-4:18.3.1-alt1 sisyphus.218704.100 1545992861 installed
<13>Jan  5 09:40:39 rpmi: libEGL-7:1.1.0-alt3 sisyphus.215982.100 1541498632 installed
<13>Jan  5 09:40:39 rpmi: libGLX-7:1.1.0-alt3 sisyphus.215982.100 1541498632 installed
<13>Jan  5 09:40:39 rpmi: libGL-7:1.1.0-alt3 sisyphus.215982.100 1541498632 installed
<13>Jan  5 09:40:39 rpmi: libcairo-1:1.16.0-alt1 sisyphus.215566.100 1540457683 installed
<13>Jan  5 09:40:39 rpmi: libpango-1.42.4-alt1 1534787259 installed
<13>Jan  5 09:40:39 rpmi: ghostscript-utils-9.26-alt1 sisyphus.217431.100 1544113898 installed
<13>Jan  5 09:40:40 rpmi: texlive-2018-alt2_7 sisyphus.217374.100 1544051367 installed
<13>Jan  5 09:40:51 rpmi: texlive-collection-basic-2018-alt1_5 sisyphus.215114.200 1539918315 installed
<13>Jan  5 09:40:52 rpmi: liblasi-1.1.2-alt1.qa1 1460141148 installed
<13>Jan  5 09:40:52 rpmi: librsvg-1:2.44.11-alt1 sisyphus.218812.100 1546157474 installed
<13>Jan  5 09:40:52 rpmi: libXi-1.7.9-alt1.S1 1515755342 installed
<13>Jan  5 09:40:52 rpmi: libXinerama-1.1.3-alt2 1527671619 installed
<13>Jan  5 09:40:52 rpmi: libXcomposite-0.4.3-alt3 1297306936 installed
<13>Jan  5 09:40:52 rpmi: libgtk+2-2.24.32-alt2 1518699309 installed
<13>Jan  5 09:40:52 rpmi: libgraphviz-2.40.1-alt4 1534164028 installed
<13>Jan  5 09:40:52 rpmi: xprop-1.2.3-alt1 sisyphus.213300.100 1537401932 installed
<13>Jan  5 09:40:52 rpmi: xdg-utils-1.1.3-alt5 sisyphus.216143.100 1541504685 installed
<13>Jan  5 09:40:52 rpmi: texlive-texmf-2018-alt1_5 sisyphus.215114.200 1539918315 installed
<13>Jan  5 09:42:26 rpmi: texlive-dist-2018-alt1_5 sisyphus.215114.200 1539918315 installed
<13>Jan  5 09:42:26 rpmi: openexr22-common-2.2.0-alt1.1 1434453376 installed
<13>Jan  5 09:42:26 rpmi: libilmimf22-2.2.0-alt1.1 1434453376 installed
<13>Jan  5 09:42:26 rpmi: libImageMagick6.6-6.9.10.16-alt1 sisyphus.217812.100 1544714798 installed
<13>Jan  5 09:42:26 rpmi: ImageMagick-tools-6.9.10.16-alt1 sisyphus.217812.100 1544714798 installed
<13>Jan  5 09:42:27 rpmi: dblatex-0.3.10-alt2 sisyphus.213935.100 1538494563 installed
<13>Jan  5 09:42:27 rpmi: gtk-doc-mkpdf-1.29-alt2 sisyphus.217088.100 1543518451 installed
<13>Jan  5 09:42:27 rpmi: tcpdump-1:4.1.1-alt3 1298589696 installed
<86>Jan  5 09:42:27 groupadd[47148]: group added to /etc/group: name=tcpdump, GID=497
<86>Jan  5 09:42:27 groupadd[47148]: group added to /etc/gshadow: name=tcpdump
<86>Jan  5 09:42:27 groupadd[47148]: new group: name=tcpdump, GID=497
<86>Jan  5 09:42:27 useradd[47200]: new user: name=tcpdump, UID=499, GID=497, home=/dev/null, shell=/dev/null
<13>Jan  5 09:42:27 rpmi: gcc-c++-8-alt1 sisyphus.214000.40 1542664775 installed
<13>Jan  5 09:42:27 rpmi: libpcapnav-devel-0.8-alt1_16 1507677519 installed
<13>Jan  5 09:42:27 rpmi: libnetdude-devel-0.11-alt2_16 1511642104 installed
<13>Jan  5 09:42:27 rpmi: glib-devel-1.2.10-alt20 1461002535 installed
<13>Jan  5 09:42:27 rpmi: libmagic-devel-4.26-alt13 1490157142 installed
Building target platforms: i586
Building for target i586
Wrote: /usr/src/in/nosrpm/libnetdude-0.11-alt2_16.nosrc.rpm
Installing libnetdude-0.11-alt2_16.src.rpm
Building target platforms: i586
Building for target i586
Executing(%prep): /bin/sh -e /usr/src/tmp/rpm-tmp.3545
+ umask 022
+ /bin/mkdir -p /usr/src/RPM/BUILD
+ cd /usr/src/RPM/BUILD
+ cd /usr/src/RPM/BUILD
+ rm -rf libnetdude-0.11
+ echo 'Source #0 (libnetdude-0.11.tar.gz):'
Source #0 (libnetdude-0.11.tar.gz):
+ /bin/gzip -dc /usr/src/RPM/SOURCES/libnetdude-0.11.tar.gz
+ /bin/tar -xf -
+ cd libnetdude-0.11
+ /bin/chmod -c -Rf u+rwX,go-w .
+ echo 'Patch #0 (libnetdude-0.11-format-security.patch):'
Patch #0 (libnetdude-0.11-format-security.patch):
+ /usr/bin/patch -p1
patching file src/libnd_tcpdump.c
+ sed -e s,###loc###,libnetdude/0.11, /usr/src/RPM/SOURCES/libnetdude-lndtool-wrapper.sh
+ exit 0
Executing(%build): /bin/sh -e /usr/src/tmp/rpm-tmp.45664
+ umask 022
+ /bin/mkdir -p /usr/src/RPM/BUILD
+ cd /usr/src/RPM/BUILD
+ cd libnetdude-0.11
+ CFLAGS='-pipe -frecord-gcc-switches -Wall -g -O2 -march=i586 -mtune=generic'
+ export CFLAGS
+ CXXFLAGS='-pipe -frecord-gcc-switches -Wall -g -O2 -march=i586 -mtune=generic'
+ export CXXFLAGS
+ FFLAGS='-pipe -frecord-gcc-switches -Wall -g -O2 -march=i586 -mtune=generic'
+ export FFLAGS
+ '[' -n '' ']'
++ printf %s '-pipe -frecord-gcc-switches -Wall -g -O2 -march=i586 -mtune=generic'
++ sed -r 's/(^|[[:space:]]+)-[^m][^[:space:]]*//g'
+ ASFLAGS=' -march=i586 -mtune=generic'
+ export ASFLAGS
+ export lt_cv_deplibs_check_method=pass_all
+ lt_cv_deplibs_check_method=pass_all
+ readlink -e -- ./configure
+ xargs -ri dirname -- '{}'
+ xargs -ri find '{}' -type f '(' -name config.sub -or -name config.guess ')' -printf '%h/\n'
+ sort -u
+ xargs -rn1 install -pm755 -- /usr/share/gnu-config/config.sub /usr/share/gnu-config/config.guess
+ ./configure --build=i586-alt-linux --host=i586-alt-linux --prefix=/usr --exec-prefix=/usr --bindir=/usr/bin --sbindir=/usr/sbin --sysconfdir=/etc --datadir=/usr/share --includedir=/usr/include --libdir=/usr/lib --libexecdir=/usr/lib --localstatedir=/var --sharedstatedir=/var/lib --mandir=/usr/share/man --infodir=/usr/share/info --disable-dependency-tracking --without-included-gettext --disable-static --datadir=/usr/lib --with-html-dir=/usr/share/gtk-doc/html/libnetdude/
checking for a BSD-compatible install... /bin/install -c
checking whether build environment is sane... yes
checking for a thread-safe mkdir -p... /bin/mkdir -p
checking for gawk... gawk
checking whether make sets $(MAKE)... yes
shtool:echo:Warning: unable to determine terminal sequence for bold mode
shtool:echo:Warning: unable to determine terminal sequence for bold mode
checking for i586-alt-linux-gcc... i586-alt-linux-gcc
checking for C compiler default output file name... a.out
checking whether the C compiler works... yes
checking whether we are cross compiling... no
checking for suffix of executables... 
checking for suffix of object files... o
checking whether we are using the GNU C compiler... yes
checking whether i586-alt-linux-gcc accepts -g... yes
checking for i586-alt-linux-gcc option to accept ISO C89... none needed
checking for style of include used by make... GNU
checking dependency style of i586-alt-linux-gcc... none
checking whether make sets $(MAKE)... (cached) yes
checking build system type... i586-alt-linux-gnu
checking host system type... i586-alt-linux-gnu
checking for a sed that does not truncate output... /bin/sed
checking for grep that handles long lines and -e... /bin/grep
checking for egrep... /bin/grep -E
checking for ld used by i586-alt-linux-gcc... /usr/bin/ld
checking if the linker (/usr/bin/ld) is GNU ld... yes
checking for /usr/bin/ld option to reload object files... -r
checking for BSD-compatible nm... /usr/bin/nm -B
checking whether ln -s works... yes
checking how to recognize dependent libraries... (cached) pass_all
checking how to run the C preprocessor... i586-alt-linux-gcc -E
checking for ANSI C header files... yes
checking for sys/types.h... yes
checking for sys/stat.h... yes
checking for stdlib.h... yes
checking for string.h... yes
checking for memory.h... yes
checking for strings.h... yes
checking for inttypes.h... yes
checking for stdint.h... yes
checking for unistd.h... yes
checking dlfcn.h usability... yes
checking dlfcn.h presence... yes
checking for dlfcn.h... yes
checking for i586-alt-linux-g++... i586-alt-linux-g++
checking whether we are using the GNU C++ compiler... yes
checking whether i586-alt-linux-g++ accepts -g... yes
checking dependency style of i586-alt-linux-g++... none
checking how to run the C++ preprocessor... i586-alt-linux-g++ -E
checking for i586-alt-linux-g77... no
checking for i586-alt-linux-xlf... no
checking for i586-alt-linux-f77... no
checking for i586-alt-linux-frt... no
checking for i586-alt-linux-pgf77... no
checking for i586-alt-linux-cf77... no
checking for i586-alt-linux-fort77... no
checking for i586-alt-linux-fl32... no
checking for i586-alt-linux-af77... no
checking for i586-alt-linux-xlf90... no
checking for i586-alt-linux-f90... no
checking for i586-alt-linux-pgf90... no
checking for i586-alt-linux-pghpf... no
checking for i586-alt-linux-epcf90... no
checking for i586-alt-linux-gfortran... no
checking for i586-alt-linux-g95... no
checking for i586-alt-linux-xlf95... no
checking for i586-alt-linux-f95... no
checking for i586-alt-linux-fort... no
checking for i586-alt-linux-ifort... no
checking for i586-alt-linux-ifc... no
checking for i586-alt-linux-efc... no
checking for i586-alt-linux-pgf95... no
checking for i586-alt-linux-lf95... no
checking for i586-alt-linux-ftn... no
checking for g77... no
checking for xlf... no
checking for f77... no
checking for frt... no
checking for pgf77... no
checking for cf77... no
checking for fort77... no
checking for fl32... no
checking for af77... no
checking for xlf90... no
checking for f90... no
checking for pgf90... no
checking for pghpf... no
checking for epcf90... no
checking for gfortran... no
checking for g95... no
checking for xlf95... no
checking for f95... no
checking for fort... no
checking for ifort... no
checking for ifc... no
checking for efc... no
checking for pgf95... no
checking for lf95... no
checking for ftn... no
checking whether we are using the GNU Fortran 77 compiler... no
checking whether  accepts -g... no
checking the maximum length of command line arguments... 1572864
checking command to parse /usr/bin/nm -B output from i586-alt-linux-gcc object... ok
checking for objdir... .libs
checking for i586-alt-linux-ar... no
checking for ar... ar
checking for i586-alt-linux-ranlib... no
checking for ranlib... ranlib
checking for i586-alt-linux-strip... no
checking for strip... strip
checking if i586-alt-linux-gcc supports -fno-rtti -fno-exceptions... no
checking for i586-alt-linux-gcc option to produce PIC... -fPIC
checking if i586-alt-linux-gcc PIC flag -fPIC works... yes
checking if i586-alt-linux-gcc static flag -static works... no
checking if i586-alt-linux-gcc supports -c -o file.o... yes
checking whether the i586-alt-linux-gcc linker (/usr/bin/ld) supports shared libraries... yes
checking whether -lc should be explicitly linked in... no
checking dynamic linker characteristics... GNU/Linux ld.so
checking how to hardcode library paths into programs... immediate
checking whether stripping libraries is possible... yes
checking for shl_load... no
checking for shl_load in -ldld... no
checking for dlopen... no
checking for dlopen in -ldl... yes
checking whether a program can dlopen itself... yes
checking whether a statically linked program can dlopen itself... yes
checking if libtool supports shared libraries... yes
checking whether to build shared libraries... yes
checking whether to build static libraries... no
configure: creating libtool
appending configuration tag "CXX" to libtool
checking for ld used by i586-alt-linux-g++... /usr/bin/ld
checking if the linker (/usr/bin/ld) is GNU ld... yes
checking whether the i586-alt-linux-g++ linker (/usr/bin/ld) supports shared libraries... yes
checking for i586-alt-linux-g++ option to produce PIC... -fPIC
checking if i586-alt-linux-g++ PIC flag -fPIC works... yes
checking if i586-alt-linux-g++ static flag -static works... no
checking if i586-alt-linux-g++ supports -c -o file.o... yes
checking whether the i586-alt-linux-g++ linker (/usr/bin/ld) supports shared libraries... yes
checking dynamic linker characteristics... GNU/Linux ld.so
checking how to hardcode library paths into programs... immediate
appending configuration tag "F77" to libtool
checking host system type... (cached) i586-alt-linux-gnu
checking whether byte ordering is bigendian... no
checking for special C compiler options needed for large files... no
checking for _FILE_OFFSET_BITS value needed for large files... 64
checking for glib-config... /usr/bin/glib-config
checking for glib... yes
checking for pcapnav-config... /usr/bin/pcapnav-config
checking for pcapnav... yes
checking for tcpdump... /usr/sbin/tcpdump
checking magic.h usability... yes
checking magic.h presence... yes
checking for magic.h... yes
checking for magic_open in -lmagic... yes
checking for gtkdoc-mkdb... true
checking gtk-doc version (1.29) >= 0.6... yes
configure: creating ./config.status
config.status: creating Makefile
config.status: creating src/Makefile
config.status: creating tools/Makefile
config.status: creating tools/lndtool.c
config.status: creating protocols/Makefile
config.status: creating protocols/arp/Makefile
config.status: creating protocols/ether/Makefile
config.status: creating protocols/fddi/Makefile
config.status: creating protocols/802.11/Makefile
config.status: creating protocols/icmp/Makefile
config.status: creating protocols/ip/Makefile
config.status: creating protocols/linux-sll/Makefile
config.status: creating protocols/snap/Makefile
config.status: creating protocols/tcp/Makefile
config.status: creating protocols/udp/Makefile
config.status: creating protocols/vlan/Makefile
config.status: creating plugins/Makefile
config.status: creating plugins/ChecksumFix/Makefile
config.status: creating plugins/BPF-Filter/Makefile
config.status: creating test/Makefile
config.status: creating docs/Makefile
config.status: creating config.h
config.status: executing depfiles commands
=== configuring in libltdl (/usr/src/RPM/BUILD/libnetdude-0.11/libltdl)
configure: running /bin/sh ./configure '--prefix=/usr'  '--build=i586-alt-linux' '--host=i586-alt-linux' '--exec-prefix=/usr' '--bindir=/usr/bin' '--sbindir=/usr/sbin' '--sysconfdir=/etc' '--datadir=/usr/share' '--includedir=/usr/include' '--libdir=/usr/lib' '--libexecdir=/usr/lib' '--localstatedir=/var' '--sharedstatedir=/var/lib' '--mandir=/usr/share/man' '--infodir=/usr/share/info' '--disable-dependency-tracking' '--without-included-gettext' '--disable-static' '--datadir=/usr/lib' '--with-html-dir=/usr/share/gtk-doc/html/libnetdude/' 'build_alias=i586-alt-linux' 'host_alias=i586-alt-linux' 'CFLAGS=-pipe -frecord-gcc-switches -Wall -g -O2 -march=i586 -mtune=generic' 'CXXFLAGS=-pipe -frecord-gcc-switches -Wall -g -O2 -march=i586 -mtune=generic' 'FFLAGS=-pipe -frecord-gcc-switches -Wall -g -O2 -march=i586 -mtune=generic' '--enable-ltdl-convenience' --cache-file=/dev/null --srcdir=.
checking for a BSD-compatible install... /bin/install -c
checking whether build environment is sane... yes
checking for a thread-safe mkdir -p... /bin/mkdir -p
checking for gawk... gawk
checking whether make sets $(MAKE)... yes
checking for i586-alt-linux-gcc... i586-alt-linux-gcc
checking for C compiler default output file name... a.out
checking whether the C compiler works... yes
checking whether we are cross compiling... no
checking for suffix of executables... 
checking for suffix of object files... o
checking whether we are using the GNU C compiler... yes
checking whether i586-alt-linux-gcc accepts -g... yes
checking for i586-alt-linux-gcc option to accept ISO C89... none needed
checking for style of include used by make... GNU
checking dependency style of i586-alt-linux-gcc... none
checking for an ANSI C-conforming const... yes
checking for inline... inline
checking build system type... i586-alt-linux-gnu
checking host system type... i586-alt-linux-gnu
checking for a sed that does not truncate output... /bin/sed
checking for grep that handles long lines and -e... /bin/grep
checking for egrep... /bin/grep -E
checking for ld used by i586-alt-linux-gcc... /usr/bin/ld
checking if the linker (/usr/bin/ld) is GNU ld... yes
checking for /usr/bin/ld option to reload object files... -r
checking for BSD-compatible nm... /usr/bin/nm -B
checking whether ln -s works... yes
checking how to recognize dependent libraries... (cached) pass_all
checking how to run the C preprocessor... i586-alt-linux-gcc -E
checking for ANSI C header files... yes
checking for sys/types.h... yes
checking for sys/stat.h... yes
checking for stdlib.h... yes
checking for string.h... yes
checking for memory.h... yes
checking for strings.h... yes
checking for inttypes.h... yes
checking for stdint.h... yes
checking for unistd.h... yes
checking dlfcn.h usability... yes
checking dlfcn.h presence... yes
checking for dlfcn.h... yes
checking for i586-alt-linux-g++... i586-alt-linux-g++
checking whether we are using the GNU C++ compiler... yes
checking whether i586-alt-linux-g++ accepts -g... yes
checking dependency style of i586-alt-linux-g++... none
checking how to run the C++ preprocessor... i586-alt-linux-g++ -E
checking for i586-alt-linux-g77... no
checking for i586-alt-linux-xlf... no
checking for i586-alt-linux-f77... no
checking for i586-alt-linux-frt... no
checking for i586-alt-linux-pgf77... no
checking for i586-alt-linux-cf77... no
checking for i586-alt-linux-fort77... no
checking for i586-alt-linux-fl32... no
checking for i586-alt-linux-af77... no
checking for i586-alt-linux-xlf90... no
checking for i586-alt-linux-f90... no
checking for i586-alt-linux-pgf90... no
checking for i586-alt-linux-pghpf... no
checking for i586-alt-linux-epcf90... no
checking for i586-alt-linux-gfortran... no
checking for i586-alt-linux-g95... no
checking for i586-alt-linux-xlf95... no
checking for i586-alt-linux-f95... no
checking for i586-alt-linux-fort... no
checking for i586-alt-linux-ifort... no
checking for i586-alt-linux-ifc... no
checking for i586-alt-linux-efc... no
checking for i586-alt-linux-pgf95... no
checking for i586-alt-linux-lf95... no
checking for i586-alt-linux-ftn... no
checking for g77... no
checking for xlf... no
checking for f77... no
checking for frt... no
checking for pgf77... no
checking for cf77... no
checking for fort77... no
checking for fl32... no
checking for af77... no
checking for xlf90... no
checking for f90... no
checking for pgf90... no
checking for pghpf... no
checking for epcf90... no
checking for gfortran... no
checking for g95... no
checking for xlf95... no
checking for f95... no
checking for fort... no
checking for ifort... no
checking for ifc... no
checking for efc... no
checking for pgf95... no
checking for lf95... no
checking for ftn... no
checking whether we are using the GNU Fortran 77 compiler... no
checking whether  accepts -g... no
checking the maximum length of command line arguments... 1572864
checking command to parse /usr/bin/nm -B output from i586-alt-linux-gcc object... ok
checking for objdir... .libs
checking for i586-alt-linux-ar... no
checking for ar... ar
checking for i586-alt-linux-ranlib... no
checking for ranlib... ranlib
checking for i586-alt-linux-strip... no
checking for strip... strip
checking if i586-alt-linux-gcc supports -fno-rtti -fno-exceptions... no
checking for i586-alt-linux-gcc option to produce PIC... -fPIC
checking if i586-alt-linux-gcc PIC flag -fPIC works... yes
checking if i586-alt-linux-gcc static flag -static works... no
checking if i586-alt-linux-gcc supports -c -o file.o... yes
checking whether the i586-alt-linux-gcc linker (/usr/bin/ld) supports shared libraries... yes
checking whether -lc should be explicitly linked in... no
checking dynamic linker characteristics... GNU/Linux ld.so
checking how to hardcode library paths into programs... immediate
checking whether stripping libraries is possible... yes
checking if libtool supports shared libraries... yes
checking whether to build shared libraries... yes
checking whether to build static libraries... no
configure: creating libtool
appending configuration tag "CXX" to libtool
checking for ld used by i586-alt-linux-g++... /usr/bin/ld
checking if the linker (/usr/bin/ld) is GNU ld... yes
checking whether the i586-alt-linux-g++ linker (/usr/bin/ld) supports shared libraries... yes
checking for i586-alt-linux-g++ option to produce PIC... -fPIC
checking if i586-alt-linux-g++ PIC flag -fPIC works... yes
checking if i586-alt-linux-g++ static flag -static works... no
checking if i586-alt-linux-g++ supports -c -o file.o... yes
checking whether the i586-alt-linux-g++ linker (/usr/bin/ld) supports shared libraries... yes
checking dynamic linker characteristics... GNU/Linux ld.so
checking how to hardcode library paths into programs... immediate
appending configuration tag "F77" to libtool
checking for dirent.h that defines DIR... yes
checking for library containing opendir... none required
checking which extension is used for loadable modules... .so
checking which variable specifies run-time library path... LD_LIBRARY_PATH
checking for the default library search path... /usr/lib /lib /usr/lib/nsl 
checking for objdir... .libs
checking whether libtool supports -dlopen/-dlpreopen... yes
checking for shl_load... no
checking for shl_load in -ldld... no
checking for dlopen in -ldl... yes
checking for dlerror... yes
checking for _ prefix in compiled symbols... no
checking whether deplibs are loaded by dlopen... yes
checking argz.h usability... yes
checking argz.h presence... yes
checking for argz.h... yes
checking for error_t... yes
checking for argz_append... yes
checking for argz_create_sep... yes
checking for argz_insert... yes
checking for argz_next... yes
checking for argz_stringify... yes
checking assert.h usability... yes
checking assert.h presence... yes
checking for assert.h... yes
checking ctype.h usability... yes
checking ctype.h presence... yes
checking for ctype.h... yes
checking errno.h usability... yes
checking errno.h presence... yes
checking for errno.h... yes
checking malloc.h usability... yes
checking malloc.h presence... yes
checking for malloc.h... yes
checking for memory.h... (cached) yes
checking for stdlib.h... (cached) yes
checking stdio.h usability... yes
checking stdio.h presence... yes
checking for stdio.h... yes
checking for unistd.h... (cached) yes
checking dl.h usability... no
checking dl.h presence... no
checking for dl.h... no
checking sys/dl.h usability... no
checking sys/dl.h presence... no
checking for sys/dl.h... no
checking dld.h usability... no
checking dld.h presence... no
checking for dld.h... no
checking mach-o/dyld.h usability... no
checking mach-o/dyld.h presence... no
checking for mach-o/dyld.h... no
checking for string.h... (cached) yes
checking for strchr... yes
checking for strrchr... yes
checking for memcpy... yes
checking for memmove... yes
checking for strcmp... yes
checking for closedir... yes
checking for opendir... yes
checking for readdir... yes
configure: creating ./config.status
config.status: creating Makefile
config.status: creating config.h
config.status: executing depfiles commands

         libnetdude Configuration Summary
====================================================

  libpcapnav configuration: pcapnav-config
  Debugging enabled:        no

  Setup finished. Now run:

  $ make
  # make install

  (or use gmake when make on your platform isn't GNU make)

+ make -j8
make  all-recursive
Making all in libltdl
make  all-am
make[3]: Entering directory '/usr/src/RPM/BUILD/libnetdude-0.11/libltdl'
/bin/sh ./libtool --tag=CC   --mode=compile i586-alt-linux-gcc -DHAVE_CONFIG_H -I.     -pipe -frecord-gcc-switches -Wall -g -O2 -march=i586 -mtune=generic -c -o ltdl.lo ltdl.c
mkdir .libs
 i586-alt-linux-gcc -DHAVE_CONFIG_H -I. -pipe -frecord-gcc-switches -Wall -g -O2 -march=i586 -mtune=generic -c ltdl.c  -fPIC -DPIC -o .libs/ltdl.o
ltdl.c: In function 'try_dlopen':
ltdl.c:3220:14: warning: the address of 'sys_search_path' will always evaluate as 'true' [-Waddress]
    if (!file && sys_search_path)
              ^~
ltdl.c: In function 'lt_dlopenext':
ltdl.h:89:24: warning: the address of 'archive_ext' will always evaluate as 'true' [-Waddress]
 #define LT_STRLEN(s) (((s) && (s)[0]) ? strlen (s) : 0)
                        ^
ltdl.c:252:48: note: in definition of macro 'LT_EMALLOC'
 #define LT_EMALLOC(tp, n) ((tp *) lt_emalloc ((n) * sizeof(tp)))
                                                ^
ltdl.c:3514:33: note: in expansion of macro 'LT_STRLEN'
   tmp = LT_EMALLOC (char, len + LT_STRLEN (archive_ext) + 1);
                                 ^~~~~~~~~
In file included from ltdl.c:129:
ltdl.h:89:24: warning: the address of 'shlib_ext' will always evaluate as 'true' [-Waddress]
 #define LT_STRLEN(s) (((s) && (s)[0]) ? strlen (s) : 0)
                        ^
ltdl.c:3535:7: note: in expansion of macro 'LT_STRLEN'
   if (LT_STRLEN (shlib_ext) > LT_STRLEN (archive_ext))
       ^~~~~~~~~
ltdl.h:89:24: warning: the address of 'archive_ext' will always evaluate as 'true' [-Waddress]
 #define LT_STRLEN(s) (((s) && (s)[0]) ? strlen (s) : 0)
                        ^
ltdl.c:3535:31: note: in expansion of macro 'LT_STRLEN'
   if (LT_STRLEN (shlib_ext) > LT_STRLEN (archive_ext))
                               ^~~~~~~~~
ltdl.h:89:24: warning: the address of 'shlib_ext' will always evaluate as 'true' [-Waddress]
 #define LT_STRLEN(s) (((s) && (s)[0]) ? strlen (s) : 0)
                        ^
ltdl.c:252:48: note: in definition of macro 'LT_EMALLOC'
 #define LT_EMALLOC(tp, n) ((tp *) lt_emalloc ((n) * sizeof(tp)))
                                                ^
ltdl.c:3538:37: note: in expansion of macro 'LT_STRLEN'
       tmp = LT_EMALLOC (char, len + LT_STRLEN (shlib_ext) + 1);
                                     ^~~~~~~~~
make[3]: Leaving directory '/usr/src/RPM/BUILD/libnetdude-0.11/libltdl'
make[3]: Entering directory '/usr/src/RPM/BUILD/libnetdude-0.11/libltdl'
/bin/sh ./libtool --tag=CC   --mode=link i586-alt-linux-gcc  -pipe -frecord-gcc-switches -Wall -g -O2 -march=i586 -mtune=generic   -o libltdlc.la  ltdl.lo -ldl 
ar cru .libs/libltdlc.a .libs/ltdl.o
ranlib .libs/libltdlc.a
creating libltdlc.la
(cd .libs && rm -f libltdlc.la && ln -s ../libltdlc.la libltdlc.la)
make[3]: Leaving directory '/usr/src/RPM/BUILD/libnetdude-0.11/libltdl'
Making all in src
make[2]: Entering directory '/usr/src/RPM/BUILD/libnetdude-0.11/src'
/bin/sh ../libtool --tag=CC   --mode=compile i586-alt-linux-gcc -DHAVE_CONFIG_H -I. -I.. -I.. -I../libltdl -I/usr/include/glib-1.2 -I/usr/lib/glib/include -std=gnu89 -I/usr/include -W -Wall     -pipe -frecord-gcc-switches -Wall -g -O2 -march=i586 -mtune=generic -c -o libnd_debug.lo libnd_debug.c
mkdir .libs
 i586-alt-linux-gcc -DHAVE_CONFIG_H -I. -I.. -I.. -I../libltdl -I/usr/include/glib-1.2 -I/usr/lib/glib/include -std=gnu89 -I/usr/include -W -Wall -pipe -frecord-gcc-switches -Wall -g -O2 -march=i586 -mtune=generic -c libnd_debug.c  -fPIC -DPIC -o .libs/libnd_debug.o
make[2]: Leaving directory '/usr/src/RPM/BUILD/libnetdude-0.11/src'
make[2]: Entering directory '/usr/src/RPM/BUILD/libnetdude-0.11/src'
/bin/sh ../libtool --tag=CC   --mode=compile i586-alt-linux-gcc -DHAVE_CONFIG_H -I. -I.. -I.. -I../libltdl -I/usr/include/glib-1.2 -I/usr/lib/glib/include -std=gnu89 -I/usr/include -W -Wall     -pipe -frecord-gcc-switches -Wall -g -O2 -march=i586 -mtune=generic -c -o libnd_globals.lo libnd_globals.c
 i586-alt-linux-gcc -DHAVE_CONFIG_H -I. -I.. -I.. -I../libltdl -I/usr/include/glib-1.2 -I/usr/lib/glib/include -std=gnu89 -I/usr/include -W -Wall -pipe -frecord-gcc-switches -Wall -g -O2 -march=i586 -mtune=generic -c libnd_globals.c  -fPIC -DPIC -o .libs/libnd_globals.o
make[2]: Leaving directory '/usr/src/RPM/BUILD/libnetdude-0.11/src'
make[2]: Entering directory '/usr/src/RPM/BUILD/libnetdude-0.11/src'
/bin/sh ../libtool --tag=CC   --mode=compile i586-alt-linux-gcc -DHAVE_CONFIG_H -I. -I.. -I.. -I../libltdl -I/usr/include/glib-1.2 -I/usr/lib/glib/include -std=gnu89 -I/usr/include -W -Wall     -pipe -frecord-gcc-switches -Wall -g -O2 -march=i586 -mtune=generic -c -o libnd_filter_registry.lo libnd_filter_registry.c
 i586-alt-linux-gcc -DHAVE_CONFIG_H -I. -I.. -I.. -I../libltdl -I/usr/include/glib-1.2 -I/usr/lib/glib/include -std=gnu89 -I/usr/include -W -Wall -pipe -frecord-gcc-switches -Wall -g -O2 -march=i586 -mtune=generic -c libnd_filter_registry.c  -fPIC -DPIC -o .libs/libnd_filter_registry.o
make[2]: Leaving directory '/usr/src/RPM/BUILD/libnetdude-0.11/src'
make[2]: Entering directory '/usr/src/RPM/BUILD/libnetdude-0.11/src'
/bin/sh ../libtool --tag=CC   --mode=compile i586-alt-linux-gcc -DHAVE_CONFIG_H -I. -I.. -I.. -I../libltdl -I/usr/include/glib-1.2 -I/usr/lib/glib/include -std=gnu89 -I/usr/include -W -Wall     -pipe -frecord-gcc-switches -Wall -g -O2 -march=i586 -mtune=generic -c -o libnd_filter_factory.lo libnd_filter_factory.c
 i586-alt-linux-gcc -DHAVE_CONFIG_H -I. -I.. -I.. -I../libltdl -I/usr/include/glib-1.2 -I/usr/lib/glib/include -std=gnu89 -I/usr/include -W -Wall -pipe -frecord-gcc-switches -Wall -g -O2 -march=i586 -mtune=generic -c libnd_filter_factory.c  -fPIC -DPIC -o .libs/libnd_filter_factory.o
make[2]: Leaving directory '/usr/src/RPM/BUILD/libnetdude-0.11/src'
make[2]: Entering directory '/usr/src/RPM/BUILD/libnetdude-0.11/src'
/bin/sh ../libtool --tag=CC   --mode=compile i586-alt-linux-gcc -DHAVE_CONFIG_H -I. -I.. -I.. -I../libltdl -I/usr/include/glib-1.2 -I/usr/lib/glib/include -std=gnu89 -I/usr/include -W -Wall     -pipe -frecord-gcc-switches -Wall -g -O2 -march=i586 -mtune=generic -c -o libnd_init.lo libnd_init.c
 i586-alt-linux-gcc -DHAVE_CONFIG_H -I. -I.. -I.. -I../libltdl -I/usr/include/glib-1.2 -I/usr/lib/glib/include -std=gnu89 -I/usr/include -W -Wall -pipe -frecord-gcc-switches -Wall -g -O2 -march=i586 -mtune=generic -c libnd_init.c  -fPIC -DPIC -o .libs/libnd_init.o
make[2]: Leaving directory '/usr/src/RPM/BUILD/libnetdude-0.11/src'
make[2]: Entering directory '/usr/src/RPM/BUILD/libnetdude-0.11/src'
/bin/sh ../libtool --tag=CC   --mode=compile i586-alt-linux-gcc -DHAVE_CONFIG_H -I. -I.. -I.. -I../libltdl -I/usr/include/glib-1.2 -I/usr/lib/glib/include -std=gnu89 -I/usr/include -W -Wall     -pipe -frecord-gcc-switches -Wall -g -O2 -march=i586 -mtune=generic -c -o libnd_filter.lo libnd_filter.c
 i586-alt-linux-gcc -DHAVE_CONFIG_H -I. -I.. -I.. -I../libltdl -I/usr/include/glib-1.2 -I/usr/lib/glib/include -std=gnu89 -I/usr/include -W -Wall -pipe -frecord-gcc-switches -Wall -g -O2 -march=i586 -mtune=generic -c libnd_filter.c  -fPIC -DPIC -o .libs/libnd_filter.o
libnd_filter.c: In function 'filter_dummy_init':
libnd_filter.c:35:31: warning: parameter 'filter' set but not used [-Wunused-but-set-parameter]
 filter_dummy_init(LND_Filter *filter, LND_Trace *trace, void *filter_data)
                   ~~~~~~~~~~~~^~~~~~
libnd_filter.c:35:50: warning: parameter 'trace' set but not used [-Wunused-but-set-parameter]
 filter_dummy_init(LND_Filter *filter, LND_Trace *trace, void *filter_data)
                                       ~~~~~~~~~~~^~~~~
libnd_filter.c:35:63: warning: parameter 'filter_data' set but not used [-Wunused-but-set-parameter]
 filter_dummy_init(LND_Filter *filter, LND_Trace *trace, void *filter_data)
                                                         ~~~~~~^~~~~~~~~~~
libnd_filter.c: In function 'filter_dummy_filter':
libnd_filter.c:42:33: warning: parameter 'filter' set but not used [-Wunused-but-set-parameter]
 filter_dummy_filter(LND_Filter *filter, LND_Packet *packet, void *filter_data)
                     ~~~~~~~~~~~~^~~~~~
libnd_filter.c:42:53: warning: parameter 'packet' set but not used [-Wunused-but-set-parameter]
 filter_dummy_filter(LND_Filter *filter, LND_Packet *packet, void *filter_data)
                                         ~~~~~~~~~~~~^~~~~~
libnd_filter.c:42:67: warning: parameter 'filter_data' set but not used [-Wunused-but-set-parameter]
 filter_dummy_filter(LND_Filter *filter, LND_Packet *packet, void *filter_data)
                                                             ~~~~~~^~~~~~~~~~~
libnd_filter.c: In function 'filter_dummy_cleanup':
libnd_filter.c:49:34: warning: parameter 'filter' set but not used [-Wunused-but-set-parameter]
 filter_dummy_cleanup(LND_Filter *filter, void *filter_data)
                      ~~~~~~~~~~~~^~~~~~
libnd_filter.c:49:48: warning: parameter 'filter_data' set but not used [-Wunused-but-set-parameter]
 filter_dummy_cleanup(LND_Filter *filter, void *filter_data)
                                          ~~~~~~^~~~~~~~~~~
libnd_filter.c: In function 'filter_dummy_free':
libnd_filter.c:57:25: warning: parameter 'filter_data' set but not used [-Wunused-but-set-parameter]
 filter_dummy_free(void *filter_data)
                   ~~~~~~^~~~~~~~~~~
make[2]: Leaving directory '/usr/src/RPM/BUILD/libnetdude-0.11/src'
make[2]: Entering directory '/usr/src/RPM/BUILD/libnetdude-0.11/src'
/bin/sh ../libtool --tag=CC   --mode=compile i586-alt-linux-gcc -DHAVE_CONFIG_H -I. -I.. -I.. -I../libltdl -I/usr/include/glib-1.2 -I/usr/lib/glib/include -std=gnu89 -I/usr/include -W -Wall     -pipe -frecord-gcc-switches -Wall -g -O2 -march=i586 -mtune=generic -c -o libnd_magic.lo libnd_magic.c
 i586-alt-linux-gcc -DHAVE_CONFIG_H -I. -I.. -I.. -I../libltdl -I/usr/include/glib-1.2 -I/usr/lib/glib/include -std=gnu89 -I/usr/include -W -Wall -pipe -frecord-gcc-switches -Wall -g -O2 -march=i586 -mtune=generic -c libnd_magic.c  -fPIC -DPIC -o .libs/libnd_magic.o
make[2]: Leaving directory '/usr/src/RPM/BUILD/libnetdude-0.11/src'
make[2]: Entering directory '/usr/src/RPM/BUILD/libnetdude-0.11/src'
/bin/sh ../libtool --tag=CC   --mode=compile i586-alt-linux-gcc -DHAVE_CONFIG_H -I. -I.. -I.. -I../libltdl -I/usr/include/glib-1.2 -I/usr/lib/glib/include -std=gnu89 -I/usr/include -W -Wall     -pipe -frecord-gcc-switches -Wall -g -O2 -march=i586 -mtune=generic -c -o libnd_dumper.lo libnd_dumper.c
 i586-alt-linux-gcc -DHAVE_CONFIG_H -I. -I.. -I.. -I../libltdl -I/usr/include/glib-1.2 -I/usr/lib/glib/include -std=gnu89 -I/usr/include -W -Wall -pipe -frecord-gcc-switches -Wall -g -O2 -march=i586 -mtune=generic -c libnd_dumper.c  -fPIC -DPIC -o .libs/libnd_dumper.o
make[2]: Leaving directory '/usr/src/RPM/BUILD/libnetdude-0.11/src'
make[2]: Entering directory '/usr/src/RPM/BUILD/libnetdude-0.11/src'
/bin/sh ../libtool --tag=CC   --mode=compile i586-alt-linux-gcc -DHAVE_CONFIG_H -I. -I.. -I.. -I../libltdl -I/usr/include/glib-1.2 -I/usr/lib/glib/include -std=gnu89 -I/usr/include -W -Wall     -pipe -frecord-gcc-switches -Wall -g -O2 -march=i586 -mtune=generic -c -o libnd_null_protocol.lo libnd_null_protocol.c
 i586-alt-linux-gcc -DHAVE_CONFIG_H -I. -I.. -I.. -I../libltdl -I/usr/include/glib-1.2 -I/usr/lib/glib/include -std=gnu89 -I/usr/include -W -Wall -pipe -frecord-gcc-switches -Wall -g -O2 -march=i586 -mtune=generic -c libnd_null_protocol.c  -fPIC -DPIC -o .libs/libnd_null_protocol.o
libnd_null_protocol.c: In function 'null_proto_init_packet':
libnd_null_protocol.c:42:36: warning: parameter 'packet' set but not used [-Wunused-but-set-parameter]
 null_proto_init_packet(LND_Packet *packet, guchar *data, guchar *data_end)
                        ~~~~~~~~~~~~^~~~~~
libnd_null_protocol.c:42:52: warning: parameter 'data' set but not used [-Wunused-but-set-parameter]
 null_proto_init_packet(LND_Packet *packet, guchar *data, guchar *data_end)
                                            ~~~~~~~~^~~~
libnd_null_protocol.c: In function 'null_proto_header_complete':
libnd_null_protocol.c:50:46: warning: parameter 'packet' set but not used [-Wunused-but-set-parameter]
 null_proto_header_complete(const LND_Packet *packet, guint nesting)
                            ~~~~~~~~~~~~~~~~~~^~~~~~
libnd_null_protocol.c:50:60: warning: parameter 'nesting' set but not used [-Wunused-but-set-parameter]
 null_proto_header_complete(const LND_Packet *packet, guint nesting)
                                                      ~~~~~~^~~~~~~
libnd_null_protocol.c: In function 'null_proto_fix_packet':
libnd_null_protocol.c:58:35: warning: parameter 'packet' set but not used [-Wunused-but-set-parameter]
 null_proto_fix_packet(LND_Packet *packet)
                       ~~~~~~~~~~~~^~~~~~
libnd_null_protocol.c: In function 'null_proto_can_fix_proceed':
libnd_null_protocol.c:65:40: warning: parameter 'packet' set but not used [-Wunused-but-set-parameter]
 null_proto_can_fix_proceed(LND_Packet *packet,
                            ~~~~~~~~~~~~^~~~~~
libnd_null_protocol.c:66:22: warning: parameter 'pd' set but not used [-Wunused-but-set-parameter]
       LND_ProtoData *pd)
       ~~~~~~~~~~~~~~~^~
libnd_null_protocol.c: In function 'null_proto_adjust_len':
libnd_null_protocol.c:74:35: warning: parameter 'packet' set but not used [-Wunused-but-set-parameter]
 null_proto_adjust_len(LND_Packet *packet, int delta)
                       ~~~~~~~~~~~~^~~~~~
libnd_null_protocol.c:74:47: warning: parameter 'delta' set but not used [-Wunused-but-set-parameter]
 null_proto_adjust_len(LND_Packet *packet, int delta)
                                           ~~~~^~~~~
libnd_null_protocol.c: In function 'null_proto_init_state':
libnd_null_protocol.c:82:34: warning: parameter 'trace' set but not used [-Wunused-but-set-parameter]
 null_proto_init_state(LND_Trace *trace)
                       ~~~~~~~~~~~^~~~~
libnd_null_protocol.c: In function 'null_proto_update_state':
libnd_null_protocol.c:89:43: warning: parameter 'packet' set but not used [-Wunused-but-set-parameter]
 null_proto_update_state(const LND_Packet *packet, int index)
                         ~~~~~~~~~~~~~~~~~~^~~~~~
libnd_null_protocol.c:89:55: warning: parameter 'index' set but not used [-Wunused-but-set-parameter]
 null_proto_update_state(const LND_Packet *packet, int index)
                                                   ~~~~^~~~~
libnd_null_protocol.c: In function 'null_proto_update_tcpdump_line':
libnd_null_protocol.c:97:50: warning: parameter 'packet' set but not used [-Wunused-but-set-parameter]
 null_proto_update_tcpdump_line(const LND_Packet *packet, char *line)
                                ~~~~~~~~~~~~~~~~~~^~~~~~
libnd_null_protocol.c:97:64: warning: parameter 'line' set but not used [-Wunused-but-set-parameter]
 null_proto_update_tcpdump_line(const LND_Packet *packet, char *line)
                                                          ~~~~~~^~~~
libnd_null_protocol.c: In function 'null_proto_free_state':
libnd_null_protocol.c:105:34: warning: parameter 'trace' set but not used [-Wunused-but-set-parameter]
 null_proto_free_state(LND_Trace *trace)
                       ~~~~~~~~~~~^~~~~
make[2]: Leaving directory '/usr/src/RPM/BUILD/libnetdude-0.11/src'
make[2]: Entering directory '/usr/src/RPM/BUILD/libnetdude-0.11/src'
/bin/sh ../libtool --tag=CC   --mode=compile i586-alt-linux-gcc -DHAVE_CONFIG_H -I. -I.. -I.. -I../libltdl -I/usr/include/glib-1.2 -I/usr/lib/glib/include -std=gnu89 -I/usr/include -W -Wall     -pipe -frecord-gcc-switches -Wall -g -O2 -march=i586 -mtune=generic -c -o libnd_packet_recycler.lo libnd_packet_recycler.c
 i586-alt-linux-gcc -DHAVE_CONFIG_H -I. -I.. -I.. -I../libltdl -I/usr/include/glib-1.2 -I/usr/lib/glib/include -std=gnu89 -I/usr/include -W -Wall -pipe -frecord-gcc-switches -Wall -g -O2 -march=i586 -mtune=generic -c libnd_packet_recycler.c  -fPIC -DPIC -o .libs/libnd_packet_recycler.o
make[2]: Leaving directory '/usr/src/RPM/BUILD/libnetdude-0.11/src'
make[2]: Entering directory '/usr/src/RPM/BUILD/libnetdude-0.11/src'
/bin/sh ../libtool --tag=CC   --mode=compile i586-alt-linux-gcc -DHAVE_CONFIG_H -I. -I.. -I.. -I../libltdl -I/usr/include/glib-1.2 -I/usr/lib/glib/include -std=gnu89 -I/usr/include -W -Wall     -pipe -frecord-gcc-switches -Wall -g -O2 -march=i586 -mtune=generic -c -o libnd_misc.lo libnd_misc.c
 i586-alt-linux-gcc -DHAVE_CONFIG_H -I. -I.. -I.. -I../libltdl -I/usr/include/glib-1.2 -I/usr/lib/glib/include -std=gnu89 -I/usr/include -W -Wall -pipe -frecord-gcc-switches -Wall -g -O2 -march=i586 -mtune=generic -c libnd_misc.c  -fPIC -DPIC -o .libs/libnd_misc.o
libnd_misc.c: In function 'libnd_misc_is_tcpdump_file':
libnd_misc.c:226:7: warning: ignoring return value of 'fread', declared with attribute warn_unused_result [-Wunused-result]
       fread((void*)&magic, sizeof(u_int32_t), 1, f);
       ^~~~~~~~~~~~~~~~~~~~~~~~~~~~~~~~~~~~~~~~~~~~~
make[2]: Leaving directory '/usr/src/RPM/BUILD/libnetdude-0.11/src'
make[2]: Entering directory '/usr/src/RPM/BUILD/libnetdude-0.11/src'
/bin/sh ../libtool --tag=CC   --mode=compile i586-alt-linux-gcc -DHAVE_CONFIG_H -I. -I.. -I.. -I../libltdl -I/usr/include/glib-1.2 -I/usr/lib/glib/include -std=gnu89 -I/usr/include -W -Wall     -pipe -frecord-gcc-switches -Wall -g -O2 -march=i586 -mtune=generic -c -o libnd_packet_iterator.lo libnd_packet_iterator.c
 i586-alt-linux-gcc -DHAVE_CONFIG_H -I. -I.. -I.. -I../libltdl -I/usr/include/glib-1.2 -I/usr/lib/glib/include -std=gnu89 -I/usr/include -W -Wall -pipe -frecord-gcc-switches -Wall -g -O2 -march=i586 -mtune=generic -c libnd_packet_iterator.c  -fPIC -DPIC -o .libs/libnd_packet_iterator.o
libnd_packet_iterator.c: In function 'libnd_pit_next':
libnd_packet_iterator.c:302:20: warning: this statement may fall through [-Wimplicit-fallthrough=]
  pit->drop_current = FALSE;
libnd_packet_iterator.c:306:7: note: here
       case LND_PACKET_IT_AREA_R:
       ^~~~
make[2]: Leaving directory '/usr/src/RPM/BUILD/libnetdude-0.11/src'
make[2]: Entering directory '/usr/src/RPM/BUILD/libnetdude-0.11/src'
/bin/sh ../libtool --tag=CC   --mode=compile i586-alt-linux-gcc -DHAVE_CONFIG_H -I. -I.. -I.. -I../libltdl -I/usr/include/glib-1.2 -I/usr/lib/glib/include -std=gnu89 -I/usr/include -W -Wall     -pipe -frecord-gcc-switches -Wall -g -O2 -march=i586 -mtune=generic -c -o libnd_protocol.lo libnd_protocol.c
 i586-alt-linux-gcc -DHAVE_CONFIG_H -I. -I.. -I.. -I../libltdl -I/usr/include/glib-1.2 -I/usr/lib/glib/include -std=gnu89 -I/usr/include -W -Wall -pipe -frecord-gcc-switches -Wall -g -O2 -march=i586 -mtune=generic -c libnd_protocol.c  -fPIC -DPIC -o .libs/libnd_protocol.o
make[2]: Leaving directory '/usr/src/RPM/BUILD/libnetdude-0.11/src'
make[2]: Entering directory '/usr/src/RPM/BUILD/libnetdude-0.11/src'
/bin/sh ../libtool --tag=CC   --mode=compile i586-alt-linux-gcc -DHAVE_CONFIG_H -I. -I.. -I.. -I../libltdl -I/usr/include/glib-1.2 -I/usr/lib/glib/include -std=gnu89 -I/usr/include -W -Wall     -pipe -frecord-gcc-switches -Wall -g -O2 -march=i586 -mtune=generic -c -o libnd_prefs.lo libnd_prefs.c
 i586-alt-linux-gcc -DHAVE_CONFIG_H -I. -I.. -I.. -I../libltdl -I/usr/include/glib-1.2 -I/usr/lib/glib/include -std=gnu89 -I/usr/include -W -Wall -pipe -frecord-gcc-switches -Wall -g -O2 -march=i586 -mtune=generic -c libnd_prefs.c  -fPIC -DPIC -o .libs/libnd_prefs.o
make[2]: Leaving directory '/usr/src/RPM/BUILD/libnetdude-0.11/src'
make[2]: Entering directory '/usr/src/RPM/BUILD/libnetdude-0.11/src'
/bin/sh ../libtool --tag=CC   --mode=compile i586-alt-linux-gcc -DHAVE_CONFIG_H -I. -I.. -I.. -I../libltdl -I/usr/include/glib-1.2 -I/usr/lib/glib/include -std=gnu89 -I/usr/include -W -Wall     -pipe -frecord-gcc-switches -Wall -g -O2 -march=i586 -mtune=generic -c -o libnd_protocol_inst.lo libnd_protocol_inst.c
 i586-alt-linux-gcc -DHAVE_CONFIG_H -I. -I.. -I.. -I../libltdl -I/usr/include/glib-1.2 -I/usr/lib/glib/include -std=gnu89 -I/usr/include -W -Wall -pipe -frecord-gcc-switches -Wall -g -O2 -march=i586 -mtune=generic -c libnd_protocol_inst.c  -fPIC -DPIC -o .libs/libnd_protocol_inst.o
make[2]: Leaving directory '/usr/src/RPM/BUILD/libnetdude-0.11/src'
make[2]: Entering directory '/usr/src/RPM/BUILD/libnetdude-0.11/src'
/bin/sh ../libtool --tag=CC   --mode=compile i586-alt-linux-gcc -DHAVE_CONFIG_H -I. -I.. -I.. -I../libltdl -I/usr/include/glib-1.2 -I/usr/lib/glib/include -std=gnu89 -I/usr/include -W -Wall     -pipe -frecord-gcc-switches -Wall -g -O2 -march=i586 -mtune=generic -c -o libnd_raw_protocol.lo libnd_raw_protocol.c
 i586-alt-linux-gcc -DHAVE_CONFIG_H -I. -I.. -I.. -I../libltdl -I/usr/include/glib-1.2 -I/usr/lib/glib/include -std=gnu89 -I/usr/include -W -Wall -pipe -frecord-gcc-switches -Wall -g -O2 -march=i586 -mtune=generic -c libnd_raw_protocol.c  -fPIC -DPIC -o .libs/libnd_raw_protocol.o
libnd_raw_protocol.c: In function 'raw_header_complete':
libnd_raw_protocol.c:87:39: warning: parameter 'packet' set but not used [-Wunused-but-set-parameter]
 raw_header_complete(const LND_Packet *packet, guint nesting)
                     ~~~~~~~~~~~~~~~~~~^~~~~~
libnd_raw_protocol.c:87:53: warning: parameter 'nesting' set but not used [-Wunused-but-set-parameter]
 raw_header_complete(const LND_Packet *packet, guint nesting)
                                               ~~~~~~^~~~~~~
make[2]: Leaving directory '/usr/src/RPM/BUILD/libnetdude-0.11/src'
make[2]: Entering directory '/usr/src/RPM/BUILD/libnetdude-0.11/src'
/bin/sh ../libtool --tag=CC   --mode=compile i586-alt-linux-gcc -DHAVE_CONFIG_H -I. -I.. -I.. -I../libltdl -I/usr/include/glib-1.2 -I/usr/lib/glib/include -std=gnu89 -I/usr/include -W -Wall     -pipe -frecord-gcc-switches -Wall -g -O2 -march=i586 -mtune=generic -c -o libnd_plugin.lo libnd_plugin.c
 i586-alt-linux-gcc -DHAVE_CONFIG_H -I. -I.. -I.. -I../libltdl -I/usr/include/glib-1.2 -I/usr/lib/glib/include -std=gnu89 -I/usr/include -W -Wall -pipe -frecord-gcc-switches -Wall -g -O2 -march=i586 -mtune=generic -c libnd_plugin.c  -fPIC -DPIC -o .libs/libnd_plugin.o
libnd_plugin.c: In function 'plugin_dummy_run':
libnd_plugin.c:75:49: warning: parameter 'trace' set but not used [-Wunused-but-set-parameter]
 static int          plugin_dummy_run(LND_Trace *trace, void *user_data)
                                      ~~~~~~~~~~~^~~~~
libnd_plugin.c:75:62: warning: parameter 'user_data' set but not used [-Wunused-but-set-parameter]
 static int          plugin_dummy_run(LND_Trace *trace, void *user_data)
                                                        ~~~~~~^~~~~~~~~
make[2]: Leaving directory '/usr/src/RPM/BUILD/libnetdude-0.11/src'
make[2]: Entering directory '/usr/src/RPM/BUILD/libnetdude-0.11/src'
/bin/sh ../libtool --tag=CC   --mode=compile i586-alt-linux-gcc -DHAVE_CONFIG_H -I. -I.. -I.. -I../libltdl -I/usr/include/glib-1.2 -I/usr/lib/glib/include -std=gnu89 -I/usr/include -W -Wall     -pipe -frecord-gcc-switches -Wall -g -O2 -march=i586 -mtune=generic -c -o libnd_protocol_registry.lo libnd_protocol_registry.c
 i586-alt-linux-gcc -DHAVE_CONFIG_H -I. -I.. -I.. -I../libltdl -I/usr/include/glib-1.2 -I/usr/lib/glib/include -std=gnu89 -I/usr/include -W -Wall -pipe -frecord-gcc-switches -Wall -g -O2 -march=i586 -mtune=generic -c libnd_protocol_registry.c  -fPIC -DPIC -o .libs/libnd_protocol_registry.o
make[2]: Leaving directory '/usr/src/RPM/BUILD/libnetdude-0.11/src'
make[2]: Entering directory '/usr/src/RPM/BUILD/libnetdude-0.11/src'
/bin/sh ../libtool --tag=CC   --mode=compile i586-alt-linux-gcc -DHAVE_CONFIG_H -I. -I.. -I.. -I../libltdl -I/usr/include/glib-1.2 -I/usr/lib/glib/include -std=gnu89 -I/usr/include -W -Wall     -pipe -frecord-gcc-switches -Wall -g -O2 -march=i586 -mtune=generic -c -o libnd_protocol_plugin.lo libnd_protocol_plugin.c
 i586-alt-linux-gcc -DHAVE_CONFIG_H -I. -I.. -I.. -I../libltdl -I/usr/include/glib-1.2 -I/usr/lib/glib/include -std=gnu89 -I/usr/include -W -Wall -pipe -frecord-gcc-switches -Wall -g -O2 -march=i586 -mtune=generic -c libnd_protocol_plugin.c  -fPIC -DPIC -o .libs/libnd_protocol_plugin.o
make[2]: Leaving directory '/usr/src/RPM/BUILD/libnetdude-0.11/src'
make[2]: Entering directory '/usr/src/RPM/BUILD/libnetdude-0.11/src'
/bin/sh ../libtool --tag=CC   --mode=compile i586-alt-linux-gcc -DHAVE_CONFIG_H -I. -I.. -I.. -I../libltdl -I/usr/include/glib-1.2 -I/usr/lib/glib/include -std=gnu89 -I/usr/include -W -Wall     -pipe -frecord-gcc-switches -Wall -g -O2 -march=i586 -mtune=generic -c -o libnd_registry.lo libnd_registry.c
 i586-alt-linux-gcc -DHAVE_CONFIG_H -I. -I.. -I.. -I../libltdl -I/usr/include/glib-1.2 -I/usr/lib/glib/include -std=gnu89 -I/usr/include -W -Wall -pipe -frecord-gcc-switches -Wall -g -O2 -march=i586 -mtune=generic -c libnd_registry.c  -fPIC -DPIC -o .libs/libnd_registry.o
libnd_registry.c: In function 'reg_cleanup_cb':
libnd_registry.c:54:39: warning: parameter 'val' set but not used [-Wunused-but-set-parameter]
 reg_cleanup_cb(gpointer key, gpointer val, gpointer user_data)
                              ~~~~~~~~~^~~
libnd_registry.c:54:53: warning: parameter 'user_data' set but not used [-Wunused-but-set-parameter]
 reg_cleanup_cb(gpointer key, gpointer val, gpointer user_data)
                                            ~~~~~~~~~^~~~~~~~~
make[2]: Leaving directory '/usr/src/RPM/BUILD/libnetdude-0.11/src'
make[2]: Entering directory '/usr/src/RPM/BUILD/libnetdude-0.11/src'
/bin/sh ../libtool --tag=CC   --mode=compile i586-alt-linux-gcc -DHAVE_CONFIG_H -I. -I.. -I.. -I../libltdl -I/usr/include/glib-1.2 -I/usr/lib/glib/include -std=gnu89 -I/usr/include -W -Wall     -pipe -frecord-gcc-switches -Wall -g -O2 -march=i586 -mtune=generic -c -o libnd_packet.lo libnd_packet.c
 i586-alt-linux-gcc -DHAVE_CONFIG_H -I. -I.. -I.. -I../libltdl -I/usr/include/glib-1.2 -I/usr/lib/glib/include -std=gnu89 -I/usr/include -W -Wall -pipe -frecord-gcc-switches -Wall -g -O2 -march=i586 -mtune=generic -c libnd_packet.c  -fPIC -DPIC -o .libs/libnd_packet.o
libnd_packet.c: In function 'packet_free_proto_data':
libnd_packet.c:58:48: warning: parameter 'user_data' set but not used [-Wunused-but-set-parameter]
 packet_free_proto_data(gpointer data, gpointer user_data)
                                       ~~~~~~~~~^~~~~~~~~
libnd_packet.c: In function 'packet_init':
libnd_packet.c:343:22: warning: variable 'used_data_end' set but not used [-Wunused-but-set-variable]
   guchar *data_end, *used_data_end;
                      ^~~~~~~~~~~~~
libnd_packet.c: In function 'libnd_packet_adjust_caplen':
libnd_packet.c:1142:15: warning: variable 'data' set but not used [-Wunused-but-set-variable]
   LND_FixData data;
               ^~~~
libnd_packet.c: In function 'libnd_packet_tell_observers':
libnd_packet.c:1227:80: warning: parameter 'data' set but not used [-Wunused-but-set-parameter]
 libnd_packet_tell_observers(LND_Packet *packet, LND_PacketObserverOp op, void *data)
                                                                          ~~~~~~^~~~
make[2]: Leaving directory '/usr/src/RPM/BUILD/libnetdude-0.11/src'
make[2]: Entering directory '/usr/src/RPM/BUILD/libnetdude-0.11/src'
/bin/sh ../libtool --tag=CC   --mode=compile i586-alt-linux-gcc -DHAVE_CONFIG_H -I. -I.. -I.. -I../libltdl -I/usr/include/glib-1.2 -I/usr/lib/glib/include -std=gnu89 -I/usr/include -W -Wall     -pipe -frecord-gcc-switches -Wall -g -O2 -march=i586 -mtune=generic -c -o libnd_tpm.lo libnd_tpm.c
 i586-alt-linux-gcc -DHAVE_CONFIG_H -I. -I.. -I.. -I../libltdl -I/usr/include/glib-1.2 -I/usr/lib/glib/include -std=gnu89 -I/usr/include -W -Wall -pipe -frecord-gcc-switches -Wall -g -O2 -march=i586 -mtune=generic -c libnd_tpm.c  -fPIC -DPIC -o .libs/libnd_tpm.o
libnd_tpm.c: In function 'libnd_tpm_load_prev_part':
libnd_tpm.c:211:20: warning: variable 'result' set but not used [-Wunused-but-set-variable]
   pcapnav_result_t result;
                    ^~~~~~
libnd_tpm.c: In function 'libnd_tpm_num_memory_packets':
libnd_tpm.c:469:4: warning: pointer targets in passing argument 3 of 'libnd_prefs_get_int_item' differ in signedness [-Wpointer-sign]
    &num_mem_packets);
    ^~~~~~~~~~~~~~~~
In file included from libnd_tpm.c:34:
./libnd_prefs.h:341:18: note: expected 'int *' but argument is of type 'guint *' {aka 'unsigned int *'}
 gboolean         libnd_prefs_get_int_item(const char *domain, const char *key, int   *result);
                  ^~~~~~~~~~~~~~~~~~~~~~~~
libnd_tpm.c: In function 'libnd_tpm_add_part':
libnd_tpm.c:527:20: warning: variable 'end_off' set but not used [-Wunused-but-set-variable]
   off_t start_off, end_off;
                    ^~~~~~~
libnd_tpm.c:527:9: warning: variable 'start_off' set but not used [-Wunused-but-set-variable]
   off_t start_off, end_off;
         ^~~~~~~~~
make[2]: Leaving directory '/usr/src/RPM/BUILD/libnetdude-0.11/src'
make[2]: Entering directory '/usr/src/RPM/BUILD/libnetdude-0.11/src'
/bin/sh ../libtool --tag=CC   --mode=compile i586-alt-linux-gcc -DHAVE_CONFIG_H -I. -I.. -I.. -I../libltdl -I/usr/include/glib-1.2 -I/usr/lib/glib/include -std=gnu89 -I/usr/include -W -Wall     -pipe -frecord-gcc-switches -Wall -g -O2 -march=i586 -mtune=generic -c -o libnd_tp.lo libnd_tp.c
 i586-alt-linux-gcc -DHAVE_CONFIG_H -I. -I.. -I.. -I../libltdl -I/usr/include/glib-1.2 -I/usr/lib/glib/include -std=gnu89 -I/usr/include -W -Wall -pipe -frecord-gcc-switches -Wall -g -O2 -march=i586 -mtune=generic -c libnd_tp.c  -fPIC -DPIC -o .libs/libnd_tp.o
libnd_tp.c: In function 'libnd_tp_sel_delete':
libnd_tp.c:953:21: warning: variable 'index' set but not used [-Wunused-but-set-variable]
   int               index;
                     ^~~~~
make[2]: Leaving directory '/usr/src/RPM/BUILD/libnetdude-0.11/src'
make[2]: Entering directory '/usr/src/RPM/BUILD/libnetdude-0.11/src'
/bin/sh ../libtool --tag=CC   --mode=compile i586-alt-linux-gcc -DHAVE_CONFIG_H -I. -I.. -I.. -I../libltdl -I/usr/include/glib-1.2 -I/usr/lib/glib/include -std=gnu89 -I/usr/include -W -Wall     -pipe -frecord-gcc-switches -Wall -g -O2 -march=i586 -mtune=generic -c -o libnd_tcpdump.lo libnd_tcpdump.c
 i586-alt-linux-gcc -DHAVE_CONFIG_H -I. -I.. -I.. -I../libltdl -I/usr/include/glib-1.2 -I/usr/lib/glib/include -std=gnu89 -I/usr/include -W -Wall -pipe -frecord-gcc-switches -Wall -g -O2 -march=i586 -mtune=generic -c libnd_tcpdump.c  -fPIC -DPIC -o .libs/libnd_tcpdump.o
libnd_tcpdump.c: In function 'libnd_tcpdump_open':
libnd_tcpdump.c:222:13: warning: variable 'options_index' set but not used [-Wunused-but-set-variable]
       int   options_index;
             ^~~~~~~~~~~~~
libnd_tcpdump.c: In function 'libnd_tcpdump_get_packet_line':
libnd_tcpdump.c:497:38: warning: pointer targets in passing argument 2 of 'libnd_misc_readline' differ in signedness [-Wpointer-sign]
       n = libnd_misc_readline(td_fd, s, MAXPATHLEN-1);
                                      ^
In file included from ./libnd.h:46,
                 from ./libnd_prefs.h:38,
                 from libnd_tcpdump.c:44:
./libnd_misc.h:76:11: note: expected 'guchar *' {aka 'unsigned char *'} but argument is of type 'char *'
 guint     libnd_misc_readline(int fd, guchar *data, guint size);
           ^~~~~~~~~~~~~~~~~~~
libnd_tcpdump.c:459:16: warning: variable 'success' set but not used [-Wunused-but-set-variable]
   gboolean     success;
                ^~~~~~~
libnd_tcpdump.c:458:23: warning: variable 'remaining' set but not used [-Wunused-but-set-variable]
   int          td_fd, remaining, n;
                       ^~~~~~~~~
make[2]: Leaving directory '/usr/src/RPM/BUILD/libnetdude-0.11/src'
make[2]: Entering directory '/usr/src/RPM/BUILD/libnetdude-0.11/src'
/bin/sh ../libtool --tag=CC   --mode=compile i586-alt-linux-gcc -DHAVE_CONFIG_H -I. -I.. -I.. -I../libltdl -I/usr/include/glib-1.2 -I/usr/lib/glib/include -std=gnu89 -I/usr/include -W -Wall     -pipe -frecord-gcc-switches -Wall -g -O2 -march=i586 -mtune=generic -c -o libnd_trace.lo libnd_trace.c
 i586-alt-linux-gcc -DHAVE_CONFIG_H -I. -I.. -I.. -I../libltdl -I/usr/include/glib-1.2 -I/usr/lib/glib/include -std=gnu89 -I/usr/include -W -Wall -pipe -frecord-gcc-switches -Wall -g -O2 -march=i586 -mtune=generic -c libnd_trace.c  -fPIC -DPIC -o .libs/libnd_trace.o
make[2]: Leaving directory '/usr/src/RPM/BUILD/libnetdude-0.11/src'
make[2]: Entering directory '/usr/src/RPM/BUILD/libnetdude-0.11/src'
/bin/sh ../libtool --tag=CC   --mode=link i586-alt-linux-gcc  -pipe -frecord-gcc-switches -Wall -g -O2 -march=i586 -mtune=generic   -o libnetdude.la -rpath /usr/lib libnd_debug.lo libnd_dumper.lo libnd_filter.lo libnd_filter_factory.lo libnd_filter_registry.lo libnd_globals.lo libnd_init.lo libnd_magic.lo libnd_misc.lo libnd_null_protocol.lo libnd_packet.lo libnd_packet_iterator.lo libnd_packet_recycler.lo libnd_plugin.lo libnd_prefs.lo libnd_protocol.lo libnd_protocol_inst.lo libnd_protocol_plugin.lo libnd_protocol_registry.lo libnd_raw_protocol.lo libnd_registry.lo libnd_tcpdump.lo libnd_tpm.lo libnd_tp.lo libnd_trace.lo ../libltdl/libltdlc.la -lglib -lpcapnav -lpcap -lmagic 
i586-alt-linux-gcc -shared  .libs/libnd_debug.o .libs/libnd_dumper.o .libs/libnd_filter.o .libs/libnd_filter_factory.o .libs/libnd_filter_registry.o .libs/libnd_globals.o .libs/libnd_init.o .libs/libnd_magic.o .libs/libnd_misc.o .libs/libnd_null_protocol.o .libs/libnd_packet.o .libs/libnd_packet_iterator.o .libs/libnd_packet_recycler.o .libs/libnd_plugin.o .libs/libnd_prefs.o .libs/libnd_protocol.o .libs/libnd_protocol_inst.o .libs/libnd_protocol_plugin.o .libs/libnd_protocol_registry.o .libs/libnd_raw_protocol.o .libs/libnd_registry.o .libs/libnd_tcpdump.o .libs/libnd_tpm.o .libs/libnd_tp.o .libs/libnd_trace.o -Wl,--whole-archive ../libltdl/.libs/libltdlc.a -Wl,--no-whole-archive  -ldl -lglib -lpcapnav -lpcap -lmagic  -march=i586 -mtune=generic -Wl,-soname -Wl,libnetdude.so.0 -o .libs/libnetdude.so.0.0.0
(cd .libs && rm -f libnetdude.so.0 && ln -s libnetdude.so.0.0.0 libnetdude.so.0)
(cd .libs && rm -f libnetdude.so && ln -s libnetdude.so.0.0.0 libnetdude.so)
creating libnetdude.la
(cd .libs && rm -f libnetdude.la && ln -s ../libnetdude.la libnetdude.la)
make[2]: Leaving directory '/usr/src/RPM/BUILD/libnetdude-0.11/src'
Making all in tools
make[2]: Entering directory '/usr/src/RPM/BUILD/libnetdude-0.11/tools'
i586-alt-linux-gcc -DHAVE_CONFIG_H -I. -I.. -I../src -I../libltdl -I/usr/include/glib-1.2 -I/usr/lib/glib/include -std=gnu89 -I/usr/include -W -Wall     -pipe -frecord-gcc-switches -Wall -g -O2 -march=i586 -mtune=generic -c lndtool.c
lndtool.c: In function 'dump_lnd_proto':
lndtool.c:55:43: warning: parameter 'user_data' set but not used [-Wunused-but-set-parameter]
 dump_lnd_proto(LND_Protocol *proto, void *user_data)
                                     ~~~~~~^~~~~~~~~
lndtool.c: In function 'dump_lnd_plugin':
lndtool.c:66:43: warning: parameter 'user_data' set but not used [-Wunused-but-set-parameter]
 dump_lnd_plugin(LND_Plugin *plugin, void *user_data)
                                     ~~~~~~^~~~~~~~~
make[2]: Leaving directory '/usr/src/RPM/BUILD/libnetdude-0.11/tools'
make[2]: Entering directory '/usr/src/RPM/BUILD/libnetdude-0.11/tools'
/bin/sh ../libtool --tag=CC   --mode=link i586-alt-linux-gcc  -pipe -frecord-gcc-switches -Wall -g -O2 -march=i586 -mtune=generic   -o lndtool lndtool.o -L../src/ -lnetdude -lmagic 
mkdir .libs
i586-alt-linux-gcc -pipe -frecord-gcc-switches -Wall -g -O2 -march=i586 -mtune=generic -o .libs/lndtool lndtool.o  -L/usr/src/RPM/BUILD/libnetdude-0.11/src /usr/src/RPM/BUILD/libnetdude-0.11/src/.libs/libnetdude.so -ldl -lglib -lpcapnav -lpcap -lmagic 
creating lndtool
make[2]: Leaving directory '/usr/src/RPM/BUILD/libnetdude-0.11/tools'
Making all in protocols
Making all in arp
make[3]: Entering directory '/usr/src/RPM/BUILD/libnetdude-0.11/protocols/arp'
/bin/sh ../../libtool --tag=CC   --mode=compile i586-alt-linux-gcc -DHAVE_CONFIG_H -I. -I../.. -I/usr/include/glib-1.2 -I/usr/lib/glib/include -std=gnu89 -I/usr/include -I../.. -I../../libltdl -I../../src -W -Wall    -pipe -frecord-gcc-switches -Wall -g -O2 -march=i586 -mtune=generic -c -o libnd_arp.lo libnd_arp.c
mkdir .libs
 i586-alt-linux-gcc -DHAVE_CONFIG_H -I. -I../.. -I/usr/include/glib-1.2 -I/usr/lib/glib/include -std=gnu89 -I/usr/include -I../.. -I../../libltdl -I../../src -W -Wall -pipe -frecord-gcc-switches -Wall -g -O2 -march=i586 -mtune=generic -c libnd_arp.c  -fPIC -DPIC -o .libs/libnd_arp.o
libnd_arp.c: In function 'arp_header_complete':
libnd_arp.c:38:18: warning: variable 'arphdr' set but not used [-Wunused-but-set-variable]
   struct arphdr *arphdr;
                  ^~~~~~
libnd_arp.c: In function 'libnd_arp_init_packet':
libnd_arp.c:101:18: warning: variable 'arphdr' set but not used [-Wunused-but-set-variable]
   struct arphdr *arphdr;
                  ^~~~~~
libnd_arp.c: In function 'libnd_arp_header_complete':
libnd_arp.c:124:59: warning: parameter 'nesting' set but not used [-Wunused-but-set-parameter]
 libnd_arp_header_complete(const LND_Packet *packet, guint nesting)
                                                     ~~~~~~^~~~~~~
make[3]: Leaving directory '/usr/src/RPM/BUILD/libnetdude-0.11/protocols/arp'
make[3]: Entering directory '/usr/src/RPM/BUILD/libnetdude-0.11/protocols/arp'
/bin/sh ../../libtool --tag=CC   --mode=link i586-alt-linux-gcc  -pipe -frecord-gcc-switches -Wall -g -O2 -march=i586 -mtune=generic -module -avoid-version  -o libnd_arp.la -rpath /usr/lib/libnetdude/0.11/protocols libnd_arp.lo  -lmagic 
i586-alt-linux-gcc -shared  .libs/libnd_arp.o  -lmagic  -march=i586 -mtune=generic -Wl,-soname -Wl,libnd_arp.so -o .libs/libnd_arp.so
creating libnd_arp.la
(cd .libs && rm -f libnd_arp.la && ln -s ../libnd_arp.la libnd_arp.la)
make[3]: Leaving directory '/usr/src/RPM/BUILD/libnetdude-0.11/protocols/arp'
Making all in ether
make[3]: Entering directory '/usr/src/RPM/BUILD/libnetdude-0.11/protocols/ether'
/bin/sh ../../libtool --tag=CC   --mode=compile i586-alt-linux-gcc -DHAVE_CONFIG_H -I. -I../.. -I/usr/include/glib-1.2 -I/usr/lib/glib/include -std=gnu89 -I/usr/include -I../.. -I../../libltdl -I../../src -W -Wall    -pipe -frecord-gcc-switches -Wall -g -O2 -march=i586 -mtune=generic -c -o libnd_ether.lo libnd_ether.c
mkdir .libs
 i586-alt-linux-gcc -DHAVE_CONFIG_H -I. -I../.. -I/usr/include/glib-1.2 -I/usr/lib/glib/include -std=gnu89 -I/usr/include -I../.. -I../../libltdl -I../../src -W -Wall -pipe -frecord-gcc-switches -Wall -g -O2 -march=i586 -mtune=generic -c libnd_ether.c  -fPIC -DPIC -o .libs/libnd_ether.o
make[3]: Leaving directory '/usr/src/RPM/BUILD/libnetdude-0.11/protocols/ether'
make[3]: Entering directory '/usr/src/RPM/BUILD/libnetdude-0.11/protocols/ether'
/bin/sh ../../libtool --tag=CC   --mode=link i586-alt-linux-gcc  -pipe -frecord-gcc-switches -Wall -g -O2 -march=i586 -mtune=generic -module -avoid-version  -o libnd_ethernet.la -rpath /usr/lib/libnetdude/0.11/protocols libnd_ether.lo  -lmagic 
i586-alt-linux-gcc -shared  .libs/libnd_ether.o  -lmagic  -march=i586 -mtune=generic -Wl,-soname -Wl,libnd_ethernet.so -o .libs/libnd_ethernet.so
creating libnd_ethernet.la
(cd .libs && rm -f libnd_ethernet.la && ln -s ../libnd_ethernet.la libnd_ethernet.la)
make[3]: Leaving directory '/usr/src/RPM/BUILD/libnetdude-0.11/protocols/ether'
Making all in fddi
make[3]: Entering directory '/usr/src/RPM/BUILD/libnetdude-0.11/protocols/fddi'
/bin/sh ../../libtool --tag=CC   --mode=compile i586-alt-linux-gcc -DHAVE_CONFIG_H -I. -I../.. -I/usr/include/glib-1.2 -I/usr/lib/glib/include -std=gnu89 -I/usr/include -I../.. -I../../libltdl -I../../src -W -Wall    -pipe -frecord-gcc-switches -Wall -g -O2 -march=i586 -mtune=generic -c -o libnd_fddi.lo libnd_fddi.c
mkdir .libs
 i586-alt-linux-gcc -DHAVE_CONFIG_H -I. -I../.. -I/usr/include/glib-1.2 -I/usr/lib/glib/include -std=gnu89 -I/usr/include -I../.. -I../../libltdl -I../../src -W -Wall -pipe -frecord-gcc-switches -Wall -g -O2 -march=i586 -mtune=generic -c libnd_fddi.c  -fPIC -DPIC -o .libs/libnd_fddi.o
make[3]: Leaving directory '/usr/src/RPM/BUILD/libnetdude-0.11/protocols/fddi'
make[3]: Entering directory '/usr/src/RPM/BUILD/libnetdude-0.11/protocols/fddi'
/bin/sh ../../libtool --tag=CC   --mode=link i586-alt-linux-gcc  -pipe -frecord-gcc-switches -Wall -g -O2 -march=i586 -mtune=generic -module -avoid-version  -o libnd_fddi.la -rpath /usr/lib/libnetdude/0.11/protocols libnd_fddi.lo  -lmagic 
i586-alt-linux-gcc -shared  .libs/libnd_fddi.o  -lmagic  -march=i586 -mtune=generic -Wl,-soname -Wl,libnd_fddi.so -o .libs/libnd_fddi.so
creating libnd_fddi.la
(cd .libs && rm -f libnd_fddi.la && ln -s ../libnd_fddi.la libnd_fddi.la)
make[3]: Leaving directory '/usr/src/RPM/BUILD/libnetdude-0.11/protocols/fddi'
Making all in 802.11
make[3]: Entering directory '/usr/src/RPM/BUILD/libnetdude-0.11/protocols/802.11'
/bin/sh ../../libtool --tag=CC   --mode=compile i586-alt-linux-gcc -DHAVE_CONFIG_H -I. -I../.. -I/usr/include/glib-1.2 -I/usr/lib/glib/include -std=gnu89 -I/usr/include -I../.. -I../../libltdl -I../../src -W -Wall    -pipe -frecord-gcc-switches -Wall -g -O2 -march=i586 -mtune=generic -c -o libnd_802_11.lo libnd_802_11.c
mkdir .libs
 i586-alt-linux-gcc -DHAVE_CONFIG_H -I. -I../.. -I/usr/include/glib-1.2 -I/usr/lib/glib/include -std=gnu89 -I/usr/include -I../.. -I../../libltdl -I../../src -W -Wall -pipe -frecord-gcc-switches -Wall -g -O2 -march=i586 -mtune=generic -c libnd_802_11.c  -fPIC -DPIC -o .libs/libnd_802_11.o
make[3]: Leaving directory '/usr/src/RPM/BUILD/libnetdude-0.11/protocols/802.11'
make[3]: Entering directory '/usr/src/RPM/BUILD/libnetdude-0.11/protocols/802.11'
/bin/sh ../../libtool --tag=CC   --mode=link i586-alt-linux-gcc  -pipe -frecord-gcc-switches -Wall -g -O2 -march=i586 -mtune=generic -module -avoid-version  -o libnd_802_11.la -rpath /usr/lib/libnetdude/0.11/protocols libnd_802_11.lo  -lmagic 
i586-alt-linux-gcc -shared  .libs/libnd_802_11.o  -lmagic  -march=i586 -mtune=generic -Wl,-soname -Wl,libnd_802_11.so -o .libs/libnd_802_11.so
creating libnd_802_11.la
(cd .libs && rm -f libnd_802_11.la && ln -s ../libnd_802_11.la libnd_802_11.la)
make[3]: Leaving directory '/usr/src/RPM/BUILD/libnetdude-0.11/protocols/802.11'
Making all in icmp
make[3]: Entering directory '/usr/src/RPM/BUILD/libnetdude-0.11/protocols/icmp'
/bin/sh ../../libtool --tag=CC   --mode=compile i586-alt-linux-gcc -DHAVE_CONFIG_H -I. -I../.. -I/usr/include/glib-1.2 -I/usr/lib/glib/include -std=gnu89 -I/usr/include -I../.. -I../../libltdl -I../../src -W -Wall    -pipe -frecord-gcc-switches -Wall -g -O2 -march=i586 -mtune=generic -c -o libnd_icmp.lo libnd_icmp.c
mkdir .libs
 i586-alt-linux-gcc -DHAVE_CONFIG_H -I. -I../.. -I/usr/include/glib-1.2 -I/usr/lib/glib/include -std=gnu89 -I/usr/include -I../.. -I../../libltdl -I../../src -W -Wall -pipe -frecord-gcc-switches -Wall -g -O2 -march=i586 -mtune=generic -c libnd_icmp.c  -fPIC -DPIC -o .libs/libnd_icmp.o
libnd_icmp.c: In function 'libnd_icmp_header_complete':
libnd_icmp.c:216:60: warning: parameter 'nesting' set but not used [-Wunused-but-set-parameter]
 libnd_icmp_header_complete(const LND_Packet *packet, guint nesting)
                                                      ~~~~~~^~~~~~~
make[3]: Leaving directory '/usr/src/RPM/BUILD/libnetdude-0.11/protocols/icmp'
make[3]: Entering directory '/usr/src/RPM/BUILD/libnetdude-0.11/protocols/icmp'
/bin/sh ../../libtool --tag=CC   --mode=link i586-alt-linux-gcc  -pipe -frecord-gcc-switches -Wall -g -O2 -march=i586 -mtune=generic -module -avoid-version  -o libnd_icmp.la -rpath /usr/lib/libnetdude/0.11/protocols libnd_icmp.lo  -lmagic 
i586-alt-linux-gcc -shared  .libs/libnd_icmp.o  -lmagic  -march=i586 -mtune=generic -Wl,-soname -Wl,libnd_icmp.so -o .libs/libnd_icmp.so
creating libnd_icmp.la
(cd .libs && rm -f libnd_icmp.la && ln -s ../libnd_icmp.la libnd_icmp.la)
make[3]: Leaving directory '/usr/src/RPM/BUILD/libnetdude-0.11/protocols/icmp'
Making all in ip
make[3]: Entering directory '/usr/src/RPM/BUILD/libnetdude-0.11/protocols/ip'
/bin/sh ../../libtool --tag=CC   --mode=compile i586-alt-linux-gcc -DHAVE_CONFIG_H -I. -I../.. -I/usr/include/glib-1.2 -I/usr/lib/glib/include -std=gnu89 -I/usr/include -I../.. -I../../libltdl -I../../src -W -Wall    -pipe -frecord-gcc-switches -Wall -g -O2 -march=i586 -mtune=generic -c -o libnd_ip.lo libnd_ip.c
mkdir .libs
 i586-alt-linux-gcc -DHAVE_CONFIG_H -I. -I../.. -I/usr/include/glib-1.2 -I/usr/lib/glib/include -std=gnu89 -I/usr/include -I../.. -I../../libltdl -I../../src -W -Wall -pipe -frecord-gcc-switches -Wall -g -O2 -march=i586 -mtune=generic -c libnd_ip.c  -fPIC -DPIC -o .libs/libnd_ip.o
libnd_ip.c: In function 'ip_fix_cb':
libnd_ip.c:181:26: warning: parameter 'packet' set but not used [-Wunused-but-set-parameter]
 ip_fix_cb(LND_Packet    *packet,
           ~~~~~~~~~~~~~~~^~~~~~
libnd_ip.c: In function 'ip_adjust_cb':
libnd_ip.c:249:29: warning: parameter 'packet' set but not used [-Wunused-but-set-parameter]
 ip_adjust_cb(LND_Packet    *packet,
              ~~~~~~~~~~~~~~~^~~~~~
make[3]: Leaving directory '/usr/src/RPM/BUILD/libnetdude-0.11/protocols/ip'
make[3]: Entering directory '/usr/src/RPM/BUILD/libnetdude-0.11/protocols/ip'
/bin/sh ../../libtool --tag=CC   --mode=link i586-alt-linux-gcc  -pipe -frecord-gcc-switches -Wall -g -O2 -march=i586 -mtune=generic -module -avoid-version  -o libnd_ip.la -rpath /usr/lib/libnetdude/0.11/protocols libnd_ip.lo  -lmagic 
i586-alt-linux-gcc -shared  .libs/libnd_ip.o  -lmagic  -march=i586 -mtune=generic -Wl,-soname -Wl,libnd_ip.so -o .libs/libnd_ip.so
creating libnd_ip.la
(cd .libs && rm -f libnd_ip.la && ln -s ../libnd_ip.la libnd_ip.la)
make[3]: Leaving directory '/usr/src/RPM/BUILD/libnetdude-0.11/protocols/ip'
Making all in linux-sll
make[3]: Entering directory '/usr/src/RPM/BUILD/libnetdude-0.11/protocols/linux-sll'
/bin/sh ../../libtool --tag=CC   --mode=compile i586-alt-linux-gcc -DHAVE_CONFIG_H -I. -I../.. -I/usr/include/glib-1.2 -I/usr/lib/glib/include -std=gnu89 -I/usr/include -I../.. -I../../libltdl -I../../src -W -Wall    -pipe -frecord-gcc-switches -Wall -g -O2 -march=i586 -mtune=generic -c -o libnd_sll.lo libnd_sll.c
mkdir .libs
 i586-alt-linux-gcc -DHAVE_CONFIG_H -I. -I../.. -I/usr/include/glib-1.2 -I/usr/lib/glib/include -std=gnu89 -I/usr/include -I../.. -I../../libltdl -I../../src -W -Wall -pipe -frecord-gcc-switches -Wall -g -O2 -march=i586 -mtune=generic -c libnd_sll.c  -fPIC -DPIC -o .libs/libnd_sll.o
libnd_sll.c: In function 'libnd_sll_header_complete':
libnd_sll.c:122:59: warning: parameter 'nesting' set but not used [-Wunused-but-set-parameter]
 libnd_sll_header_complete(const LND_Packet *packet, guint nesting)
                                                     ~~~~~~^~~~~~~
make[3]: Leaving directory '/usr/src/RPM/BUILD/libnetdude-0.11/protocols/linux-sll'
make[3]: Entering directory '/usr/src/RPM/BUILD/libnetdude-0.11/protocols/linux-sll'
/bin/sh ../../libtool --tag=CC   --mode=link i586-alt-linux-gcc  -pipe -frecord-gcc-switches -Wall -g -O2 -march=i586 -mtune=generic -module -avoid-version  -o libnd_sll.la -rpath /usr/lib/libnetdude/0.11/protocols libnd_sll.lo  -lmagic 
i586-alt-linux-gcc -shared  .libs/libnd_sll.o  -lmagic  -march=i586 -mtune=generic -Wl,-soname -Wl,libnd_sll.so -o .libs/libnd_sll.so
creating libnd_sll.la
(cd .libs && rm -f libnd_sll.la && ln -s ../libnd_sll.la libnd_sll.la)
make[3]: Leaving directory '/usr/src/RPM/BUILD/libnetdude-0.11/protocols/linux-sll'
Making all in snap
make[3]: Entering directory '/usr/src/RPM/BUILD/libnetdude-0.11/protocols/snap'
/bin/sh ../../libtool --tag=CC   --mode=compile i586-alt-linux-gcc -DHAVE_CONFIG_H -I. -I../.. -I/usr/include/glib-1.2 -I/usr/lib/glib/include -std=gnu89 -I/usr/include -I../.. -I../../libltdl -I../../src -W -Wall    -pipe -frecord-gcc-switches -Wall -g -O2 -march=i586 -mtune=generic -c -o libnd_snap.lo libnd_snap.c
mkdir .libs
 i586-alt-linux-gcc -DHAVE_CONFIG_H -I. -I../.. -I/usr/include/glib-1.2 -I/usr/lib/glib/include -std=gnu89 -I/usr/include -I../.. -I../../libltdl -I../../src -W -Wall -pipe -frecord-gcc-switches -Wall -g -O2 -march=i586 -mtune=generic -c libnd_snap.c  -fPIC -DPIC -o .libs/libnd_snap.o
make[3]: Leaving directory '/usr/src/RPM/BUILD/libnetdude-0.11/protocols/snap'
make[3]: Entering directory '/usr/src/RPM/BUILD/libnetdude-0.11/protocols/snap'
/bin/sh ../../libtool --tag=CC   --mode=link i586-alt-linux-gcc  -pipe -frecord-gcc-switches -Wall -g -O2 -march=i586 -mtune=generic -module -avoid-version  -o libnd_snap.la -rpath /usr/lib/libnetdude/0.11/protocols libnd_snap.lo  -lmagic 
i586-alt-linux-gcc -shared  .libs/libnd_snap.o  -lmagic  -march=i586 -mtune=generic -Wl,-soname -Wl,libnd_snap.so -o .libs/libnd_snap.so
creating libnd_snap.la
(cd .libs && rm -f libnd_snap.la && ln -s ../libnd_snap.la libnd_snap.la)
make[3]: Leaving directory '/usr/src/RPM/BUILD/libnetdude-0.11/protocols/snap'
Making all in tcp
make[3]: Entering directory '/usr/src/RPM/BUILD/libnetdude-0.11/protocols/tcp'
/bin/sh ../../libtool --tag=CC   --mode=compile i586-alt-linux-gcc -DHAVE_CONFIG_H -I. -I../.. -I/usr/include/glib-1.2 -I/usr/lib/glib/include -std=gnu89 -I/usr/include -I../.. -I../../libltdl -I../../src -W -Wall    -pipe -frecord-gcc-switches -Wall -g -O2 -march=i586 -mtune=generic -c -o libnd_tcp_prefs.lo libnd_tcp_prefs.c
 i586-alt-linux-gcc -DHAVE_CONFIG_H -I. -I../.. -I/usr/include/glib-1.2 -I/usr/lib/glib/include -std=gnu89 -I/usr/include -I../.. -I../../libltdl -I../../src -W -Wall -pipe -frecord-gcc-switches -Wall -g -O2 -march=i586 -mtune=generic -c libnd_tcp_prefs.c  -fPIC -DPIC -o .libs/libnd_tcp_prefs.o
libnd_tcp_prefs.c: In function 'tcp_prefs_apply_cb':
libnd_tcp_prefs.c:43:37: warning: parameter 'domain' set but not used [-Wunused-but-set-parameter]
 tcp_prefs_apply_cb(LND_PrefsDomain *domain, void *user_data)
                    ~~~~~~~~~~~~~~~~~^~~~~~
libnd_tcp_prefs.c:43:51: warning: parameter 'user_data' set but not used [-Wunused-but-set-parameter]
 tcp_prefs_apply_cb(LND_PrefsDomain *domain, void *user_data)
                                             ~~~~~~^~~~~~~~~
make[3]: Leaving directory '/usr/src/RPM/BUILD/libnetdude-0.11/protocols/tcp'
make[3]: Entering directory '/usr/src/RPM/BUILD/libnetdude-0.11/protocols/tcp'
/bin/sh ../../libtool --tag=CC   --mode=compile i586-alt-linux-gcc -DHAVE_CONFIG_H -I. -I../.. -I/usr/include/glib-1.2 -I/usr/lib/glib/include -std=gnu89 -I/usr/include -I../.. -I../../libltdl -I../../src -W -Wall    -pipe -frecord-gcc-switches -Wall -g -O2 -march=i586 -mtune=generic -c -o libnd_tcb.lo libnd_tcb.c
 i586-alt-linux-gcc -DHAVE_CONFIG_H -I. -I../.. -I/usr/include/glib-1.2 -I/usr/lib/glib/include -std=gnu89 -I/usr/include -I../.. -I../../libltdl -I../../src -W -Wall -pipe -frecord-gcc-switches -Wall -g -O2 -march=i586 -mtune=generic -c libnd_tcb.c  -fPIC -DPIC -o .libs/libnd_tcb.o
libnd_tcb.c: In function 'tcb_free_cb':
libnd_tcb.c:135:22: warning: parameter 'key' set but not used [-Wunused-but-set-parameter]
 tcb_free_cb(gpointer key, gpointer val, gpointer user_data)
             ~~~~~~~~~^~~
libnd_tcb.c:135:50: warning: parameter 'user_data' set but not used [-Wunused-but-set-parameter]
 tcb_free_cb(gpointer key, gpointer val, gpointer user_data)
                                         ~~~~~~~~~^~~~~~~~~
libnd_tcb.c: In function 'libnd_tcb_update':
libnd_tcb.c:199:19: warning: variable 'update_trace' set but not used [-Wunused-but-set-variable]
   gboolean        update_trace = FALSE;
                   ^~~~~~~~~~~~
make[3]: Leaving directory '/usr/src/RPM/BUILD/libnetdude-0.11/protocols/tcp'
make[3]: Entering directory '/usr/src/RPM/BUILD/libnetdude-0.11/protocols/tcp'
/bin/sh ../../libtool --tag=CC   --mode=compile i586-alt-linux-gcc -DHAVE_CONFIG_H -I. -I../.. -I/usr/include/glib-1.2 -I/usr/lib/glib/include -std=gnu89 -I/usr/include -I../.. -I../../libltdl -I../../src -W -Wall    -pipe -frecord-gcc-switches -Wall -g -O2 -march=i586 -mtune=generic -c -o libnd_tcp.lo libnd_tcp.c
mkdir .libs
 i586-alt-linux-gcc -DHAVE_CONFIG_H -I. -I../.. -I/usr/include/glib-1.2 -I/usr/lib/glib/include -std=gnu89 -I/usr/include -I../.. -I../../libltdl -I../../src -W -Wall -pipe -frecord-gcc-switches -Wall -g -O2 -march=i586 -mtune=generic -c libnd_tcp.c  -fPIC -DPIC -o .libs/libnd_tcp.o
libnd_tcp.c: In function 'init':
libnd_tcp.c:112:29: warning: suggest braces around empty body in an 'if' statement [-Wempty-body]
     D(("seq regex error\n"));
                             ^
libnd_tcp.c:115:29: warning: suggest braces around empty body in an 'if' statement [-Wempty-body]
     D(("ack regex error\n"));
                             ^
make[3]: Leaving directory '/usr/src/RPM/BUILD/libnetdude-0.11/protocols/tcp'
make[3]: Entering directory '/usr/src/RPM/BUILD/libnetdude-0.11/protocols/tcp'
/bin/sh ../../libtool --tag=CC   --mode=link i586-alt-linux-gcc  -pipe -frecord-gcc-switches -Wall -g -O2 -march=i586 -mtune=generic -module -avoid-version  -o libnd_tcp.la -rpath /usr/lib/libnetdude/0.11/protocols libnd_tcp.lo libnd_tcb.lo libnd_tcp_prefs.lo  -lmagic 
i586-alt-linux-gcc -shared  .libs/libnd_tcp.o .libs/libnd_tcb.o .libs/libnd_tcp_prefs.o  -lmagic  -march=i586 -mtune=generic -Wl,-soname -Wl,libnd_tcp.so -o .libs/libnd_tcp.so
creating libnd_tcp.la
(cd .libs && rm -f libnd_tcp.la && ln -s ../libnd_tcp.la libnd_tcp.la)
make[3]: Leaving directory '/usr/src/RPM/BUILD/libnetdude-0.11/protocols/tcp'
Making all in udp
make[3]: Entering directory '/usr/src/RPM/BUILD/libnetdude-0.11/protocols/udp'
/bin/sh ../../libtool --tag=CC   --mode=compile i586-alt-linux-gcc -DHAVE_CONFIG_H -I. -I../.. -I/usr/include/glib-1.2 -I/usr/lib/glib/include -std=gnu89 -I/usr/include -I../.. -I../../libltdl -I../../src -W -Wall    -pipe -frecord-gcc-switches -Wall -g -O2 -march=i586 -mtune=generic -c -o libnd_udp.lo libnd_udp.c
mkdir .libs
 i586-alt-linux-gcc -DHAVE_CONFIG_H -I. -I../.. -I/usr/include/glib-1.2 -I/usr/lib/glib/include -std=gnu89 -I/usr/include -I../.. -I../../libltdl -I../../src -W -Wall -pipe -frecord-gcc-switches -Wall -g -O2 -march=i586 -mtune=generic -c libnd_udp.c  -fPIC -DPIC -o .libs/libnd_udp.o
libnd_udp.c: In function 'libnd_udp_get_payload_length':
libnd_udp.c:338:41: warning: unused parameter 'iphdr' [-Wunused-parameter]
 libnd_udp_get_payload_length(struct ip *iphdr, struct udphdr *udphdr)
                              ~~~~~~~~~~~^~~~~
make[3]: Leaving directory '/usr/src/RPM/BUILD/libnetdude-0.11/protocols/udp'
make[3]: Entering directory '/usr/src/RPM/BUILD/libnetdude-0.11/protocols/udp'
/bin/sh ../../libtool --tag=CC   --mode=link i586-alt-linux-gcc  -pipe -frecord-gcc-switches -Wall -g -O2 -march=i586 -mtune=generic -module -avoid-version  -o libnd_udp.la -rpath /usr/lib/libnetdude/0.11/protocols libnd_udp.lo  -lmagic 
i586-alt-linux-gcc -shared  .libs/libnd_udp.o  -lmagic  -march=i586 -mtune=generic -Wl,-soname -Wl,libnd_udp.so -o .libs/libnd_udp.so
creating libnd_udp.la
(cd .libs && rm -f libnd_udp.la && ln -s ../libnd_udp.la libnd_udp.la)
make[3]: Leaving directory '/usr/src/RPM/BUILD/libnetdude-0.11/protocols/udp'
Making all in vlan
make[3]: Entering directory '/usr/src/RPM/BUILD/libnetdude-0.11/protocols/vlan'
/bin/sh ../../libtool --tag=CC   --mode=compile i586-alt-linux-gcc -DHAVE_CONFIG_H -I. -I../.. -I/usr/include/glib-1.2 -I/usr/lib/glib/include -std=gnu89 -I/usr/include -I../.. -I../../libltdl -I../../src -W -Wall    -pipe -frecord-gcc-switches -Wall -g -O2 -march=i586 -mtune=generic -c -o libnd_vlan.lo libnd_vlan.c
mkdir .libs
 i586-alt-linux-gcc -DHAVE_CONFIG_H -I. -I../.. -I/usr/include/glib-1.2 -I/usr/lib/glib/include -std=gnu89 -I/usr/include -I../.. -I../../libltdl -I../../src -W -Wall -pipe -frecord-gcc-switches -Wall -g -O2 -march=i586 -mtune=generic -c libnd_vlan.c  -fPIC -DPIC -o .libs/libnd_vlan.o
make[3]: Leaving directory '/usr/src/RPM/BUILD/libnetdude-0.11/protocols/vlan'
make[3]: Entering directory '/usr/src/RPM/BUILD/libnetdude-0.11/protocols/vlan'
/bin/sh ../../libtool --tag=CC   --mode=link i586-alt-linux-gcc  -pipe -frecord-gcc-switches -Wall -g -O2 -march=i586 -mtune=generic -module -avoid-version  -o libnd_vlan.la -rpath /usr/lib/libnetdude/0.11/protocols libnd_vlan.lo  -lmagic 
i586-alt-linux-gcc -shared  .libs/libnd_vlan.o  -lmagic  -march=i586 -mtune=generic -Wl,-soname -Wl,libnd_vlan.so -o .libs/libnd_vlan.so
creating libnd_vlan.la
(cd .libs && rm -f libnd_vlan.la && ln -s ../libnd_vlan.la libnd_vlan.la)
make[3]: Leaving directory '/usr/src/RPM/BUILD/libnetdude-0.11/protocols/vlan'
make[3]: Nothing to be done for 'all-am'.
Making all in plugins
Making all in ChecksumFix
make[3]: Entering directory '/usr/src/RPM/BUILD/libnetdude-0.11/plugins/ChecksumFix'
/bin/sh ../../libtool --tag=CC   --mode=compile i586-alt-linux-gcc -DHAVE_CONFIG_H -I. -I../.. -I/usr/include/glib-1.2 -I/usr/lib/glib/include -std=gnu89 -I/usr/include -I../.. -I../../libltdl -I../../src -W -Wall    -pipe -frecord-gcc-switches -Wall -g -O2 -march=i586 -mtune=generic -c -o libnd_cksumfix.lo libnd_cksumfix.c
mkdir .libs
 i586-alt-linux-gcc -DHAVE_CONFIG_H -I. -I../.. -I/usr/include/glib-1.2 -I/usr/lib/glib/include -std=gnu89 -I/usr/include -I../.. -I../../libltdl -I../../src -W -Wall -pipe -frecord-gcc-switches -Wall -g -O2 -march=i586 -mtune=generic -c libnd_cksumfix.c  -fPIC -DPIC -o .libs/libnd_cksumfix.o
make[3]: Leaving directory '/usr/src/RPM/BUILD/libnetdude-0.11/plugins/ChecksumFix'
make[3]: Entering directory '/usr/src/RPM/BUILD/libnetdude-0.11/plugins/ChecksumFix'
/bin/sh ../../libtool --tag=CC   --mode=link i586-alt-linux-gcc  -pipe -frecord-gcc-switches -Wall -g -O2 -march=i586 -mtune=generic -module -avoid-version -L../../src -o libnd_cksumfix.la -rpath /usr/lib/libnetdude/0.11/plugins libnd_cksumfix.lo  
i586-alt-linux-gcc -shared  .libs/libnd_cksumfix.o  -L/usr/src/RPM/BUILD/libnetdude-0.11/src  -march=i586 -mtune=generic -Wl,-soname -Wl,libnd_cksumfix.so -o .libs/libnd_cksumfix.so
creating libnd_cksumfix.la
(cd .libs && rm -f libnd_cksumfix.la && ln -s ../libnd_cksumfix.la libnd_cksumfix.la)
make[3]: Leaving directory '/usr/src/RPM/BUILD/libnetdude-0.11/plugins/ChecksumFix'
Making all in BPF-Filter
make[3]: Entering directory '/usr/src/RPM/BUILD/libnetdude-0.11/plugins/BPF-Filter'
/bin/sh ../../libtool --tag=CC   --mode=compile i586-alt-linux-gcc -DHAVE_CONFIG_H -I. -I../.. -I/usr/include/glib-1.2 -I/usr/lib/glib/include -std=gnu89 -I/usr/include -I../.. -I../../libltdl -I../../src -W -Wall    -pipe -frecord-gcc-switches -Wall -g -O2 -march=i586 -mtune=generic -c -o libnd_bpf.lo libnd_bpf.c
mkdir .libs
 i586-alt-linux-gcc -DHAVE_CONFIG_H -I. -I../.. -I/usr/include/glib-1.2 -I/usr/lib/glib/include -std=gnu89 -I/usr/include -I../.. -I../../libltdl -I../../src -W -Wall -pipe -frecord-gcc-switches -Wall -g -O2 -march=i586 -mtune=generic -c libnd_bpf.c  -fPIC -DPIC -o .libs/libnd_bpf.o
libnd_bpf.c: In function 'bpf_filter_init':
libnd_bpf.c:72:29: warning: parameter 'filter' set but not used [-Wunused-but-set-parameter]
 bpf_filter_init(LND_Filter *filter,
                 ~~~~~~~~~~~~^~~~~~
libnd_bpf.c: In function 'bpf_filter_apply':
libnd_bpf.c:92:30: warning: parameter 'filter' set but not used [-Wunused-but-set-parameter]
 bpf_filter_apply(LND_Filter *filter,
                  ~~~~~~~~~~~~^~~~~~
libnd_bpf.c: In function 'run':
libnd_bpf.c:142:16: warning: parameter 'trace' set but not used [-Wunused-but-set-parameter]
 run(LND_Trace *trace, void *user_data)
     ~~~~~~~~~~~^~~~~
make[3]: Leaving directory '/usr/src/RPM/BUILD/libnetdude-0.11/plugins/BPF-Filter'
make[3]: Entering directory '/usr/src/RPM/BUILD/libnetdude-0.11/plugins/BPF-Filter'
/bin/sh ../../libtool --tag=CC   --mode=link i586-alt-linux-gcc  -pipe -frecord-gcc-switches -Wall -g -O2 -march=i586 -mtune=generic -module -avoid-version -L../../src -o libnd_bpf.la -rpath /usr/lib/libnetdude/0.11/plugins libnd_bpf.lo  
i586-alt-linux-gcc -shared  .libs/libnd_bpf.o  -L/usr/src/RPM/BUILD/libnetdude-0.11/src  -march=i586 -mtune=generic -Wl,-soname -Wl,libnd_bpf.so -o .libs/libnd_bpf.so
creating libnd_bpf.la
(cd .libs && rm -f libnd_bpf.la && ln -s ../libnd_bpf.la libnd_bpf.la)
make[3]: Leaving directory '/usr/src/RPM/BUILD/libnetdude-0.11/plugins/BPF-Filter'
make[3]: Nothing to be done for 'all-am'.
Making all in test
make[2]: Nothing to be done for 'all'.
Making all in docs
make[2]: Nothing to be done for 'all'.
+ exit 0
Executing(%install): /bin/sh -e /usr/src/tmp/rpm-tmp.28597
+ umask 022
+ /bin/mkdir -p /usr/src/RPM/BUILD
+ cd /usr/src/RPM/BUILD
+ /bin/chmod -Rf u+rwX -- /usr/src/tmp/libnetdude-buildroot
+ :
+ /bin/rm -rf -- /usr/src/tmp/libnetdude-buildroot
+ cd libnetdude-0.11
+ make install DESTDIR=/usr/src/tmp/libnetdude-buildroot 'INSTALL=install -p'
make: Entering directory '/usr/src/RPM/BUILD/libnetdude-0.11'
Making install in libltdl
make[1]: Entering directory '/usr/src/RPM/BUILD/libnetdude-0.11/libltdl'
make[2]: Entering directory '/usr/src/RPM/BUILD/libnetdude-0.11/libltdl'
test -z "/usr/lib" || /bin/mkdir -p "/usr/src/tmp/libnetdude-buildroot/usr/lib"
test -z "/usr/include" || /bin/mkdir -p "/usr/src/tmp/libnetdude-buildroot/usr/include"
make[2]: Leaving directory '/usr/src/RPM/BUILD/libnetdude-0.11/libltdl'
make[1]: Leaving directory '/usr/src/RPM/BUILD/libnetdude-0.11/libltdl'
Making install in src
make[1]: Entering directory '/usr/src/RPM/BUILD/libnetdude-0.11/src'
make[2]: Entering directory '/usr/src/RPM/BUILD/libnetdude-0.11/src'
test -z "/usr/lib" || /bin/mkdir -p "/usr/src/tmp/libnetdude-buildroot/usr/lib"
 /bin/sh ../libtool --mode=install install -p  'libnetdude.la' '/usr/src/tmp/libnetdude-buildroot/usr/lib/libnetdude.la'
install -p .libs/libnetdude.so.0.0.0 /usr/src/tmp/libnetdude-buildroot/usr/lib/libnetdude.so.0.0.0
(cd /usr/src/tmp/libnetdude-buildroot/usr/lib && { ln -s -f libnetdude.so.0.0.0 libnetdude.so.0 || { rm -f libnetdude.so.0 && ln -s libnetdude.so.0.0.0 libnetdude.so.0; }; })
(cd /usr/src/tmp/libnetdude-buildroot/usr/lib && { ln -s -f libnetdude.so.0.0.0 libnetdude.so || { rm -f libnetdude.so && ln -s libnetdude.so.0.0.0 libnetdude.so; }; })
install -p .libs/libnetdude.lai /usr/src/tmp/libnetdude-buildroot/usr/lib/libnetdude.la
libtool: install: warning: remember to run `libtool --finish /usr/lib'
test -z "/usr/include/libnetdude/0.11" || /bin/mkdir -p "/usr/src/tmp/libnetdude-buildroot/usr/include/libnetdude/0.11"
 install -p -m 644 'libnd.h' '/usr/src/tmp/libnetdude-buildroot/usr/include/libnetdude/0.11/libnd.h'
 install -p -m 644 'libnd_types.h' '/usr/src/tmp/libnetdude-buildroot/usr/include/libnetdude/0.11/libnd_types.h'
 install -p -m 644 'libnd_dumper.h' '/usr/src/tmp/libnetdude-buildroot/usr/include/libnetdude/0.11/libnd_dumper.h'
 install -p -m 644 'libnd_debug.h' '/usr/src/tmp/libnetdude-buildroot/usr/include/libnetdude/0.11/libnd_debug.h'
 install -p -m 644 'libnd_macros.h' '/usr/src/tmp/libnetdude-buildroot/usr/include/libnetdude/0.11/libnd_macros.h'
 install -p -m 644 'libnd_filter.h' '/usr/src/tmp/libnetdude-buildroot/usr/include/libnetdude/0.11/libnd_filter.h'
 install -p -m 644 'libnd_filter_factory.h' '/usr/src/tmp/libnetdude-buildroot/usr/include/libnetdude/0.11/libnd_filter_factory.h'
 install -p -m 644 'libnd_filter_registry.h' '/usr/src/tmp/libnetdude-buildroot/usr/include/libnetdude/0.11/libnd_filter_registry.h'
 install -p -m 644 'libnd_globals.h' '/usr/src/tmp/libnetdude-buildroot/usr/include/libnetdude/0.11/libnd_globals.h'
 install -p -m 644 'libnd_init.h' '/usr/src/tmp/libnetdude-buildroot/usr/include/libnetdude/0.11/libnd_init.h'
 install -p -m 644 'libnd_magic.h' '/usr/src/tmp/libnetdude-buildroot/usr/include/libnetdude/0.11/libnd_magic.h'
 install -p -m 644 'libnd_misc.h' '/usr/src/tmp/libnetdude-buildroot/usr/include/libnetdude/0.11/libnd_misc.h'
 install -p -m 644 'libnd_null_protocol.h' '/usr/src/tmp/libnetdude-buildroot/usr/include/libnetdude/0.11/libnd_null_protocol.h'
 install -p -m 644 'libnd_packet.h' '/usr/src/tmp/libnetdude-buildroot/usr/include/libnetdude/0.11/libnd_packet.h'
 install -p -m 644 'libnd_packet_iterator.h' '/usr/src/tmp/libnetdude-buildroot/usr/include/libnetdude/0.11/libnd_packet_iterator.h'
 install -p -m 644 'libnd_packet_recycler.h' '/usr/src/tmp/libnetdude-buildroot/usr/include/libnetdude/0.11/libnd_packet_recycler.h'
 install -p -m 644 'libnd_plugin.h' '/usr/src/tmp/libnetdude-buildroot/usr/include/libnetdude/0.11/libnd_plugin.h'
 install -p -m 644 'libnd_prefs.h' '/usr/src/tmp/libnetdude-buildroot/usr/include/libnetdude/0.11/libnd_prefs.h'
 install -p -m 644 'libnd_protocol.h' '/usr/src/tmp/libnetdude-buildroot/usr/include/libnetdude/0.11/libnd_protocol.h'
 install -p -m 644 'libnd_protocol_inst.h' '/usr/src/tmp/libnetdude-buildroot/usr/include/libnetdude/0.11/libnd_protocol_inst.h'
 install -p -m 644 'libnd_protocol_plugin.h' '/usr/src/tmp/libnetdude-buildroot/usr/include/libnetdude/0.11/libnd_protocol_plugin.h'
 install -p -m 644 'libnd_protocol_registry.h' '/usr/src/tmp/libnetdude-buildroot/usr/include/libnetdude/0.11/libnd_protocol_registry.h'
 install -p -m 644 'libnd_raw_protocol.h' '/usr/src/tmp/libnetdude-buildroot/usr/include/libnetdude/0.11/libnd_raw_protocol.h'
 install -p -m 644 'libnd_registry.h' '/usr/src/tmp/libnetdude-buildroot/usr/include/libnetdude/0.11/libnd_registry.h'
 install -p -m 644 'libnd_tcpdump.h' '/usr/src/tmp/libnetdude-buildroot/usr/include/libnetdude/0.11/libnd_tcpdump.h'
 install -p -m 644 'libnd_timestamp.h' '/usr/src/tmp/libnetdude-buildroot/usr/include/libnetdude/0.11/libnd_timestamp.h'
 install -p -m 644 'libnd_tpm.h' '/usr/src/tmp/libnetdude-buildroot/usr/include/libnetdude/0.11/libnd_tpm.h'
 install -p -m 644 'libnd_tp.h' '/usr/src/tmp/libnetdude-buildroot/usr/include/libnetdude/0.11/libnd_tp.h'
 install -p -m 644 'libnd_trace.h' '/usr/src/tmp/libnetdude-buildroot/usr/include/libnetdude/0.11/libnd_trace.h'
 install -p -m 644 'libnd_timestamp.h' '/usr/src/tmp/libnetdude-buildroot/usr/include/libnetdude/0.11/libnd_timestamp.h'
make[2]: Leaving directory '/usr/src/RPM/BUILD/libnetdude-0.11/src'
make[1]: Leaving directory '/usr/src/RPM/BUILD/libnetdude-0.11/src'
Making install in tools
make[1]: Entering directory '/usr/src/RPM/BUILD/libnetdude-0.11/tools'
make[2]: Entering directory '/usr/src/RPM/BUILD/libnetdude-0.11/tools'
test -z "/usr/bin" || /bin/mkdir -p "/usr/src/tmp/libnetdude-buildroot/usr/bin"
  /bin/sh ../libtool --mode=install install -p 'lndtool' '/usr/src/tmp/libnetdude-buildroot/usr/bin/lndtool'
libtool: install: warning: `/usr/src/RPM/BUILD/libnetdude-0.11/src/libnetdude.la' has not been installed in `/usr/lib'
install -p .libs/lndtool /usr/src/tmp/libnetdude-buildroot/usr/bin/lndtool
make[2]: Nothing to be done for 'install-data-am'.
make[2]: Leaving directory '/usr/src/RPM/BUILD/libnetdude-0.11/tools'
make[1]: Leaving directory '/usr/src/RPM/BUILD/libnetdude-0.11/tools'
Making install in protocols
make[1]: Entering directory '/usr/src/RPM/BUILD/libnetdude-0.11/protocols'
Making install in arp
make[2]: Entering directory '/usr/src/RPM/BUILD/libnetdude-0.11/protocols/arp'
make[3]: Entering directory '/usr/src/RPM/BUILD/libnetdude-0.11/protocols/arp'
make[3]: Nothing to be done for 'install-exec-am'.
test -z "/usr/lib/libnetdude/0.11/protocols" || /bin/mkdir -p "/usr/src/tmp/libnetdude-buildroot/usr/lib/libnetdude/0.11/protocols"
 /bin/sh ../../libtool --mode=install install -p  'libnd_arp.la' '/usr/src/tmp/libnetdude-buildroot/usr/lib/libnetdude/0.11/protocols/libnd_arp.la'
install -p .libs/libnd_arp.so /usr/src/tmp/libnetdude-buildroot/usr/lib/libnetdude/0.11/protocols/libnd_arp.so
install -p .libs/libnd_arp.lai /usr/src/tmp/libnetdude-buildroot/usr/lib/libnetdude/0.11/protocols/libnd_arp.la
libtool: install: warning: remember to run `libtool --finish /usr/lib/libnetdude/0.11/protocols'
make[3]: Leaving directory '/usr/src/RPM/BUILD/libnetdude-0.11/protocols/arp'
make[2]: Leaving directory '/usr/src/RPM/BUILD/libnetdude-0.11/protocols/arp'
Making install in ether
make[2]: Entering directory '/usr/src/RPM/BUILD/libnetdude-0.11/protocols/ether'
make[3]: Entering directory '/usr/src/RPM/BUILD/libnetdude-0.11/protocols/ether'
make[3]: Nothing to be done for 'install-exec-am'.
test -z "/usr/lib/libnetdude/0.11/protocols" || /bin/mkdir -p "/usr/src/tmp/libnetdude-buildroot/usr/lib/libnetdude/0.11/protocols"
 /bin/sh ../../libtool --mode=install install -p  'libnd_ethernet.la' '/usr/src/tmp/libnetdude-buildroot/usr/lib/libnetdude/0.11/protocols/libnd_ethernet.la'
install -p .libs/libnd_ethernet.so /usr/src/tmp/libnetdude-buildroot/usr/lib/libnetdude/0.11/protocols/libnd_ethernet.so
install -p .libs/libnd_ethernet.lai /usr/src/tmp/libnetdude-buildroot/usr/lib/libnetdude/0.11/protocols/libnd_ethernet.la
libtool: install: warning: remember to run `libtool --finish /usr/lib/libnetdude/0.11/protocols'
make[3]: Leaving directory '/usr/src/RPM/BUILD/libnetdude-0.11/protocols/ether'
make[2]: Leaving directory '/usr/src/RPM/BUILD/libnetdude-0.11/protocols/ether'
Making install in fddi
make[2]: Entering directory '/usr/src/RPM/BUILD/libnetdude-0.11/protocols/fddi'
make[3]: Entering directory '/usr/src/RPM/BUILD/libnetdude-0.11/protocols/fddi'
make[3]: Nothing to be done for 'install-exec-am'.
test -z "/usr/lib/libnetdude/0.11/protocols" || /bin/mkdir -p "/usr/src/tmp/libnetdude-buildroot/usr/lib/libnetdude/0.11/protocols"
 /bin/sh ../../libtool --mode=install install -p  'libnd_fddi.la' '/usr/src/tmp/libnetdude-buildroot/usr/lib/libnetdude/0.11/protocols/libnd_fddi.la'
install -p .libs/libnd_fddi.so /usr/src/tmp/libnetdude-buildroot/usr/lib/libnetdude/0.11/protocols/libnd_fddi.so
install -p .libs/libnd_fddi.lai /usr/src/tmp/libnetdude-buildroot/usr/lib/libnetdude/0.11/protocols/libnd_fddi.la
libtool: install: warning: remember to run `libtool --finish /usr/lib/libnetdude/0.11/protocols'
test -z "/usr/include/libnetdude/0.11/protocols/fddi" || /bin/mkdir -p "/usr/src/tmp/libnetdude-buildroot/usr/include/libnetdude/0.11/protocols/fddi"
 install -p -m 644 'libnd_fddi.h' '/usr/src/tmp/libnetdude-buildroot/usr/include/libnetdude/0.11/protocols/fddi/libnd_fddi.h'
make[3]: Leaving directory '/usr/src/RPM/BUILD/libnetdude-0.11/protocols/fddi'
make[2]: Leaving directory '/usr/src/RPM/BUILD/libnetdude-0.11/protocols/fddi'
Making install in 802.11
make[2]: Entering directory '/usr/src/RPM/BUILD/libnetdude-0.11/protocols/802.11'
make[3]: Entering directory '/usr/src/RPM/BUILD/libnetdude-0.11/protocols/802.11'
make[3]: Nothing to be done for 'install-exec-am'.
test -z "/usr/lib/libnetdude/0.11/protocols" || /bin/mkdir -p "/usr/src/tmp/libnetdude-buildroot/usr/lib/libnetdude/0.11/protocols"
 /bin/sh ../../libtool --mode=install install -p  'libnd_802_11.la' '/usr/src/tmp/libnetdude-buildroot/usr/lib/libnetdude/0.11/protocols/libnd_802_11.la'
install -p .libs/libnd_802_11.so /usr/src/tmp/libnetdude-buildroot/usr/lib/libnetdude/0.11/protocols/libnd_802_11.so
install -p .libs/libnd_802_11.lai /usr/src/tmp/libnetdude-buildroot/usr/lib/libnetdude/0.11/protocols/libnd_802_11.la
libtool: install: warning: remember to run `libtool --finish /usr/lib/libnetdude/0.11/protocols'
make[3]: Leaving directory '/usr/src/RPM/BUILD/libnetdude-0.11/protocols/802.11'
make[2]: Leaving directory '/usr/src/RPM/BUILD/libnetdude-0.11/protocols/802.11'
Making install in icmp
make[2]: Entering directory '/usr/src/RPM/BUILD/libnetdude-0.11/protocols/icmp'
make[3]: Entering directory '/usr/src/RPM/BUILD/libnetdude-0.11/protocols/icmp'
make[3]: Nothing to be done for 'install-exec-am'.
test -z "/usr/lib/libnetdude/0.11/protocols" || /bin/mkdir -p "/usr/src/tmp/libnetdude-buildroot/usr/lib/libnetdude/0.11/protocols"
 /bin/sh ../../libtool --mode=install install -p  'libnd_icmp.la' '/usr/src/tmp/libnetdude-buildroot/usr/lib/libnetdude/0.11/protocols/libnd_icmp.la'
install -p .libs/libnd_icmp.so /usr/src/tmp/libnetdude-buildroot/usr/lib/libnetdude/0.11/protocols/libnd_icmp.so
install -p .libs/libnd_icmp.lai /usr/src/tmp/libnetdude-buildroot/usr/lib/libnetdude/0.11/protocols/libnd_icmp.la
libtool: install: warning: remember to run `libtool --finish /usr/lib/libnetdude/0.11/protocols'
test -z "/usr/include/libnetdude/0.11/protocols/icmp" || /bin/mkdir -p "/usr/src/tmp/libnetdude-buildroot/usr/include/libnetdude/0.11/protocols/icmp"
 install -p -m 644 'libnd_icmp.h' '/usr/src/tmp/libnetdude-buildroot/usr/include/libnetdude/0.11/protocols/icmp/libnd_icmp.h'
make[3]: Leaving directory '/usr/src/RPM/BUILD/libnetdude-0.11/protocols/icmp'
make[2]: Leaving directory '/usr/src/RPM/BUILD/libnetdude-0.11/protocols/icmp'
Making install in ip
make[2]: Entering directory '/usr/src/RPM/BUILD/libnetdude-0.11/protocols/ip'
make[3]: Entering directory '/usr/src/RPM/BUILD/libnetdude-0.11/protocols/ip'
make[3]: Nothing to be done for 'install-exec-am'.
test -z "/usr/lib/libnetdude/0.11/protocols" || /bin/mkdir -p "/usr/src/tmp/libnetdude-buildroot/usr/lib/libnetdude/0.11/protocols"
 /bin/sh ../../libtool --mode=install install -p  'libnd_ip.la' '/usr/src/tmp/libnetdude-buildroot/usr/lib/libnetdude/0.11/protocols/libnd_ip.la'
install -p .libs/libnd_ip.so /usr/src/tmp/libnetdude-buildroot/usr/lib/libnetdude/0.11/protocols/libnd_ip.so
install -p .libs/libnd_ip.lai /usr/src/tmp/libnetdude-buildroot/usr/lib/libnetdude/0.11/protocols/libnd_ip.la
libtool: install: warning: remember to run `libtool --finish /usr/lib/libnetdude/0.11/protocols'
test -z "/usr/include/libnetdude/0.11/protocols/ip" || /bin/mkdir -p "/usr/src/tmp/libnetdude-buildroot/usr/include/libnetdude/0.11/protocols/ip"
 install -p -m 644 'libnd_ip.h' '/usr/src/tmp/libnetdude-buildroot/usr/include/libnetdude/0.11/protocols/ip/libnd_ip.h'
make[3]: Leaving directory '/usr/src/RPM/BUILD/libnetdude-0.11/protocols/ip'
make[2]: Leaving directory '/usr/src/RPM/BUILD/libnetdude-0.11/protocols/ip'
Making install in linux-sll
make[2]: Entering directory '/usr/src/RPM/BUILD/libnetdude-0.11/protocols/linux-sll'
make[3]: Entering directory '/usr/src/RPM/BUILD/libnetdude-0.11/protocols/linux-sll'
make[3]: Nothing to be done for 'install-exec-am'.
test -z "/usr/lib/libnetdude/0.11/protocols" || /bin/mkdir -p "/usr/src/tmp/libnetdude-buildroot/usr/lib/libnetdude/0.11/protocols"
 /bin/sh ../../libtool --mode=install install -p  'libnd_sll.la' '/usr/src/tmp/libnetdude-buildroot/usr/lib/libnetdude/0.11/protocols/libnd_sll.la'
install -p .libs/libnd_sll.so /usr/src/tmp/libnetdude-buildroot/usr/lib/libnetdude/0.11/protocols/libnd_sll.so
install -p .libs/libnd_sll.lai /usr/src/tmp/libnetdude-buildroot/usr/lib/libnetdude/0.11/protocols/libnd_sll.la
libtool: install: warning: remember to run `libtool --finish /usr/lib/libnetdude/0.11/protocols'
make[3]: Leaving directory '/usr/src/RPM/BUILD/libnetdude-0.11/protocols/linux-sll'
make[2]: Leaving directory '/usr/src/RPM/BUILD/libnetdude-0.11/protocols/linux-sll'
Making install in snap
make[2]: Entering directory '/usr/src/RPM/BUILD/libnetdude-0.11/protocols/snap'
make[3]: Entering directory '/usr/src/RPM/BUILD/libnetdude-0.11/protocols/snap'
make[3]: Nothing to be done for 'install-exec-am'.
test -z "/usr/lib/libnetdude/0.11/protocols" || /bin/mkdir -p "/usr/src/tmp/libnetdude-buildroot/usr/lib/libnetdude/0.11/protocols"
 /bin/sh ../../libtool --mode=install install -p  'libnd_snap.la' '/usr/src/tmp/libnetdude-buildroot/usr/lib/libnetdude/0.11/protocols/libnd_snap.la'
install -p .libs/libnd_snap.so /usr/src/tmp/libnetdude-buildroot/usr/lib/libnetdude/0.11/protocols/libnd_snap.so
install -p .libs/libnd_snap.lai /usr/src/tmp/libnetdude-buildroot/usr/lib/libnetdude/0.11/protocols/libnd_snap.la
libtool: install: warning: remember to run `libtool --finish /usr/lib/libnetdude/0.11/protocols'
test -z "/usr/include/libnetdude/0.11/protocols/snap" || /bin/mkdir -p "/usr/src/tmp/libnetdude-buildroot/usr/include/libnetdude/0.11/protocols/snap"
 install -p -m 644 'libnd_snap.h' '/usr/src/tmp/libnetdude-buildroot/usr/include/libnetdude/0.11/protocols/snap/libnd_snap.h'
make[3]: Leaving directory '/usr/src/RPM/BUILD/libnetdude-0.11/protocols/snap'
make[2]: Leaving directory '/usr/src/RPM/BUILD/libnetdude-0.11/protocols/snap'
Making install in tcp
make[2]: Entering directory '/usr/src/RPM/BUILD/libnetdude-0.11/protocols/tcp'
make[3]: Entering directory '/usr/src/RPM/BUILD/libnetdude-0.11/protocols/tcp'
make[3]: Nothing to be done for 'install-exec-am'.
test -z "/usr/lib/libnetdude/0.11/protocols" || /bin/mkdir -p "/usr/src/tmp/libnetdude-buildroot/usr/lib/libnetdude/0.11/protocols"
 /bin/sh ../../libtool --mode=install install -p  'libnd_tcp.la' '/usr/src/tmp/libnetdude-buildroot/usr/lib/libnetdude/0.11/protocols/libnd_tcp.la'
install -p .libs/libnd_tcp.so /usr/src/tmp/libnetdude-buildroot/usr/lib/libnetdude/0.11/protocols/libnd_tcp.so
install -p .libs/libnd_tcp.lai /usr/src/tmp/libnetdude-buildroot/usr/lib/libnetdude/0.11/protocols/libnd_tcp.la
libtool: install: warning: remember to run `libtool --finish /usr/lib/libnetdude/0.11/protocols'
test -z "/usr/include/libnetdude/0.11/protocols/tcp" || /bin/mkdir -p "/usr/src/tmp/libnetdude-buildroot/usr/include/libnetdude/0.11/protocols/tcp"
 install -p -m 644 'libnd_tcp.h' '/usr/src/tmp/libnetdude-buildroot/usr/include/libnetdude/0.11/protocols/tcp/libnd_tcp.h'
 install -p -m 644 'libnd_tcb.h' '/usr/src/tmp/libnetdude-buildroot/usr/include/libnetdude/0.11/protocols/tcp/libnd_tcb.h'
make[3]: Leaving directory '/usr/src/RPM/BUILD/libnetdude-0.11/protocols/tcp'
make[2]: Leaving directory '/usr/src/RPM/BUILD/libnetdude-0.11/protocols/tcp'
Making install in udp
make[2]: Entering directory '/usr/src/RPM/BUILD/libnetdude-0.11/protocols/udp'
make[3]: Entering directory '/usr/src/RPM/BUILD/libnetdude-0.11/protocols/udp'
make[3]: Nothing to be done for 'install-exec-am'.
test -z "/usr/lib/libnetdude/0.11/protocols" || /bin/mkdir -p "/usr/src/tmp/libnetdude-buildroot/usr/lib/libnetdude/0.11/protocols"
 /bin/sh ../../libtool --mode=install install -p  'libnd_udp.la' '/usr/src/tmp/libnetdude-buildroot/usr/lib/libnetdude/0.11/protocols/libnd_udp.la'
install -p .libs/libnd_udp.so /usr/src/tmp/libnetdude-buildroot/usr/lib/libnetdude/0.11/protocols/libnd_udp.so
install -p .libs/libnd_udp.lai /usr/src/tmp/libnetdude-buildroot/usr/lib/libnetdude/0.11/protocols/libnd_udp.la
libtool: install: warning: remember to run `libtool --finish /usr/lib/libnetdude/0.11/protocols'
test -z "/usr/include/libnetdude/0.11/protocols/udp" || /bin/mkdir -p "/usr/src/tmp/libnetdude-buildroot/usr/include/libnetdude/0.11/protocols/udp"
 install -p -m 644 'libnd_udp.h' '/usr/src/tmp/libnetdude-buildroot/usr/include/libnetdude/0.11/protocols/udp/libnd_udp.h'
make[3]: Leaving directory '/usr/src/RPM/BUILD/libnetdude-0.11/protocols/udp'
make[2]: Leaving directory '/usr/src/RPM/BUILD/libnetdude-0.11/protocols/udp'
Making install in vlan
make[2]: Entering directory '/usr/src/RPM/BUILD/libnetdude-0.11/protocols/vlan'
make[3]: Entering directory '/usr/src/RPM/BUILD/libnetdude-0.11/protocols/vlan'
make[3]: Nothing to be done for 'install-exec-am'.
test -z "/usr/lib/libnetdude/0.11/protocols" || /bin/mkdir -p "/usr/src/tmp/libnetdude-buildroot/usr/lib/libnetdude/0.11/protocols"
 /bin/sh ../../libtool --mode=install install -p  'libnd_vlan.la' '/usr/src/tmp/libnetdude-buildroot/usr/lib/libnetdude/0.11/protocols/libnd_vlan.la'
install -p .libs/libnd_vlan.so /usr/src/tmp/libnetdude-buildroot/usr/lib/libnetdude/0.11/protocols/libnd_vlan.so
install -p .libs/libnd_vlan.lai /usr/src/tmp/libnetdude-buildroot/usr/lib/libnetdude/0.11/protocols/libnd_vlan.la
libtool: install: warning: remember to run `libtool --finish /usr/lib/libnetdude/0.11/protocols'
test -z "/usr/include/libnetdude/0.11/protocols/vlan" || /bin/mkdir -p "/usr/src/tmp/libnetdude-buildroot/usr/include/libnetdude/0.11/protocols/vlan"
 install -p -m 644 'libnd_vlan.h' '/usr/src/tmp/libnetdude-buildroot/usr/include/libnetdude/0.11/protocols/vlan/libnd_vlan.h'
make[3]: Leaving directory '/usr/src/RPM/BUILD/libnetdude-0.11/protocols/vlan'
make[2]: Leaving directory '/usr/src/RPM/BUILD/libnetdude-0.11/protocols/vlan'
make[2]: Entering directory '/usr/src/RPM/BUILD/libnetdude-0.11/protocols'
make[3]: Entering directory '/usr/src/RPM/BUILD/libnetdude-0.11/protocols'
make[3]: Nothing to be done for 'install-exec-am'.
make[3]: Nothing to be done for 'install-data-am'.
make[3]: Leaving directory '/usr/src/RPM/BUILD/libnetdude-0.11/protocols'
make[2]: Leaving directory '/usr/src/RPM/BUILD/libnetdude-0.11/protocols'
make[1]: Leaving directory '/usr/src/RPM/BUILD/libnetdude-0.11/protocols'
Making install in plugins
make[1]: Entering directory '/usr/src/RPM/BUILD/libnetdude-0.11/plugins'
Making install in ChecksumFix
make[2]: Entering directory '/usr/src/RPM/BUILD/libnetdude-0.11/plugins/ChecksumFix'
make[3]: Entering directory '/usr/src/RPM/BUILD/libnetdude-0.11/plugins/ChecksumFix'
make[3]: Nothing to be done for 'install-exec-am'.
test -z "/usr/lib/libnetdude/0.11/plugins" || /bin/mkdir -p "/usr/src/tmp/libnetdude-buildroot/usr/lib/libnetdude/0.11/plugins"
 /bin/sh ../../libtool --mode=install install -p  'libnd_cksumfix.la' '/usr/src/tmp/libnetdude-buildroot/usr/lib/libnetdude/0.11/plugins/libnd_cksumfix.la'
install -p .libs/libnd_cksumfix.so /usr/src/tmp/libnetdude-buildroot/usr/lib/libnetdude/0.11/plugins/libnd_cksumfix.so
install -p .libs/libnd_cksumfix.lai /usr/src/tmp/libnetdude-buildroot/usr/lib/libnetdude/0.11/plugins/libnd_cksumfix.la
libtool: install: warning: remember to run `libtool --finish /usr/lib/libnetdude/0.11/plugins'
test -z "/usr/include/libnetdude/0.11/plugins/" || /bin/mkdir -p "/usr/src/tmp/libnetdude-buildroot/usr/include/libnetdude/0.11/plugins/"
 install -p -m 644 'libnd_cksumfix.h' '/usr/src/tmp/libnetdude-buildroot/usr/include/libnetdude/0.11/plugins//libnd_cksumfix.h'
make[3]: Leaving directory '/usr/src/RPM/BUILD/libnetdude-0.11/plugins/ChecksumFix'
make[2]: Leaving directory '/usr/src/RPM/BUILD/libnetdude-0.11/plugins/ChecksumFix'
Making install in BPF-Filter
make[2]: Entering directory '/usr/src/RPM/BUILD/libnetdude-0.11/plugins/BPF-Filter'
make[3]: Entering directory '/usr/src/RPM/BUILD/libnetdude-0.11/plugins/BPF-Filter'
make[3]: Nothing to be done for 'install-exec-am'.
test -z "/usr/lib/libnetdude/0.11/plugins" || /bin/mkdir -p "/usr/src/tmp/libnetdude-buildroot/usr/lib/libnetdude/0.11/plugins"
 /bin/sh ../../libtool --mode=install install -p  'libnd_bpf.la' '/usr/src/tmp/libnetdude-buildroot/usr/lib/libnetdude/0.11/plugins/libnd_bpf.la'
install -p .libs/libnd_bpf.so /usr/src/tmp/libnetdude-buildroot/usr/lib/libnetdude/0.11/plugins/libnd_bpf.so
install -p .libs/libnd_bpf.lai /usr/src/tmp/libnetdude-buildroot/usr/lib/libnetdude/0.11/plugins/libnd_bpf.la
libtool: install: warning: remember to run `libtool --finish /usr/lib/libnetdude/0.11/plugins'
test -z "/usr/include/libnetdude/0.11/plugins/" || /bin/mkdir -p "/usr/src/tmp/libnetdude-buildroot/usr/include/libnetdude/0.11/plugins/"
 install -p -m 644 'libnd_bpf.h' '/usr/src/tmp/libnetdude-buildroot/usr/include/libnetdude/0.11/plugins//libnd_bpf.h'
make[3]: Leaving directory '/usr/src/RPM/BUILD/libnetdude-0.11/plugins/BPF-Filter'
make[2]: Leaving directory '/usr/src/RPM/BUILD/libnetdude-0.11/plugins/BPF-Filter'
make[2]: Entering directory '/usr/src/RPM/BUILD/libnetdude-0.11/plugins'
make[3]: Entering directory '/usr/src/RPM/BUILD/libnetdude-0.11/plugins'
make[3]: Nothing to be done for 'install-exec-am'.
make[3]: Nothing to be done for 'install-data-am'.
make[3]: Leaving directory '/usr/src/RPM/BUILD/libnetdude-0.11/plugins'
make[2]: Leaving directory '/usr/src/RPM/BUILD/libnetdude-0.11/plugins'
make[1]: Leaving directory '/usr/src/RPM/BUILD/libnetdude-0.11/plugins'
Making install in test
make[1]: Entering directory '/usr/src/RPM/BUILD/libnetdude-0.11/test'
make[2]: Entering directory '/usr/src/RPM/BUILD/libnetdude-0.11/test'
make[2]: Nothing to be done for 'install-exec-am'.
make[2]: Nothing to be done for 'install-data-am'.
make[2]: Leaving directory '/usr/src/RPM/BUILD/libnetdude-0.11/test'
make[1]: Leaving directory '/usr/src/RPM/BUILD/libnetdude-0.11/test'
Making install in docs
make[1]: Entering directory '/usr/src/RPM/BUILD/libnetdude-0.11/docs'
make[2]: Entering directory '/usr/src/RPM/BUILD/libnetdude-0.11/docs'
make[2]: Nothing to be done for 'install-exec-am'.
/bin/sh /usr/src/RPM/BUILD/libnetdude-0.11/install-sh -d /usr/src/tmp/libnetdude-buildroot/usr/share/gtk-doc/html/libnetdude//libnetdude/images
(installfiles=`echo ./html/*.html`; \
if test "$installfiles" = './html/*.html'; \
then echo '-- Nothing to install' ; \
else \
  for i in $installfiles; do \
    echo '-- Installing '$i ; \
    install -p -m 644 $i /usr/src/tmp/libnetdude-buildroot/usr/share/gtk-doc/html/libnetdude//libnetdude; \
  done; \
  echo '-- Installing ./html/index.sgml' ; \
  install -p -m 644 ./html/index.sgml /usr/src/tmp/libnetdude-buildroot/usr/share/gtk-doc/html/libnetdude//libnetdude; \
  echo '-- Installing ./images/' ; \
  install -p -m 644 images/caution.gif images/note.gif images/warning.gif images/logo.gif images/traceparts1.png images/traceparts2.png /usr/src/tmp/libnetdude-buildroot/usr/share/gtk-doc/html/libnetdude//libnetdude/images; \
  echo '-- Installing ./stylesheet.css' ; \
  install -p -m 644 ./stylesheet.css /usr/src/tmp/libnetdude-buildroot/usr/share/gtk-doc/html/libnetdude//libnetdude; \
fi)
-- Nothing to install
make[2]: Leaving directory '/usr/src/RPM/BUILD/libnetdude-0.11/docs'
make[1]: Leaving directory '/usr/src/RPM/BUILD/libnetdude-0.11/docs'
make[1]: Entering directory '/usr/src/RPM/BUILD/libnetdude-0.11'
make[2]: Entering directory '/usr/src/RPM/BUILD/libnetdude-0.11'
make[2]: Nothing to be done for 'install-exec-am'.
make[2]: Nothing to be done for 'install-data-am'.
make[2]: Leaving directory '/usr/src/RPM/BUILD/libnetdude-0.11'
make[1]: Leaving directory '/usr/src/RPM/BUILD/libnetdude-0.11'
make: Leaving directory '/usr/src/RPM/BUILD/libnetdude-0.11'
+ mkdir -p /usr/src/tmp/libnetdude-buildroot/usr/lib/libnetdude/0.11
+ mv /usr/src/tmp/libnetdude-buildroot/usr/bin/lndtool /usr/src/tmp/libnetdude-buildroot/usr/lib/libnetdude/0.11/lndtool
+ install -D -m 755 -p libnetdude-lndtool-wrapper.sh /usr/src/tmp/libnetdude-buildroot/usr/bin/lndtool
+ find /usr/src/tmp/libnetdude-buildroot -name '*.la' -exec rm -f '{}' ';'
+ /usr/lib/rpm/brp-alt
Cleaning files in /usr/src/tmp/libnetdude-buildroot (auto)
mode of './usr/lib/libnetdude/0.11/plugins/libnd_bpf.so' changed from 0755 (rwxr-xr-x) to 0644 (rw-r--r--)
mode of './usr/lib/libnetdude/0.11/plugins/libnd_cksumfix.so' changed from 0755 (rwxr-xr-x) to 0644 (rw-r--r--)
mode of './usr/lib/libnetdude/0.11/protocols/libnd_vlan.so' changed from 0755 (rwxr-xr-x) to 0644 (rw-r--r--)
mode of './usr/lib/libnetdude/0.11/protocols/libnd_udp.so' changed from 0755 (rwxr-xr-x) to 0644 (rw-r--r--)
mode of './usr/lib/libnetdude/0.11/protocols/libnd_tcp.so' changed from 0755 (rwxr-xr-x) to 0644 (rw-r--r--)
mode of './usr/lib/libnetdude/0.11/protocols/libnd_snap.so' changed from 0755 (rwxr-xr-x) to 0644 (rw-r--r--)
mode of './usr/lib/libnetdude/0.11/protocols/libnd_sll.so' changed from 0755 (rwxr-xr-x) to 0644 (rw-r--r--)
mode of './usr/lib/libnetdude/0.11/protocols/libnd_ip.so' changed from 0755 (rwxr-xr-x) to 0644 (rw-r--r--)
mode of './usr/lib/libnetdude/0.11/protocols/libnd_icmp.so' changed from 0755 (rwxr-xr-x) to 0644 (rw-r--r--)
mode of './usr/lib/libnetdude/0.11/protocols/libnd_802_11.so' changed from 0755 (rwxr-xr-x) to 0644 (rw-r--r--)
mode of './usr/lib/libnetdude/0.11/protocols/libnd_fddi.so' changed from 0755 (rwxr-xr-x) to 0644 (rw-r--r--)
mode of './usr/lib/libnetdude/0.11/protocols/libnd_ethernet.so' changed from 0755 (rwxr-xr-x) to 0644 (rw-r--r--)
mode of './usr/lib/libnetdude/0.11/protocols/libnd_arp.so' changed from 0755 (rwxr-xr-x) to 0644 (rw-r--r--)
mode of './usr/lib/libnetdude.so.0.0.0' changed from 0755 (rwxr-xr-x) to 0644 (rw-r--r--)
Verifying and fixing files in /usr/src/tmp/libnetdude-buildroot (binconfig,pkgconfig,libtool,desktop)
Checking contents of files in /usr/src/tmp/libnetdude-buildroot/ (default)
Compressing files in /usr/src/tmp/libnetdude-buildroot (auto)
Adjusting library links in /usr/src/tmp/libnetdude-buildroot
./usr/lib:
	libnetdude.so.0 -> libnetdude.so.0.0.0
Verifying ELF objects in /usr/src/tmp/libnetdude-buildroot (arch=normal,fhs=normal,lfs=relaxed,lint=relaxed,rpath=normal,stack=normal,textrel=normal,unresolved=normal)
verify-elf: WARNING: ./usr/lib/libnetdude/0.11/plugins/libnd_bpf.so: undefined symbol: libnd_filter_registry_add
verify-elf: WARNING: ./usr/lib/libnetdude/0.11/plugins/libnd_bpf.so: undefined symbol: libnd_filter_new
verify-elf: WARNING: ./usr/lib/libnetdude/0.11/plugins/libnd_bpf.so: undefined symbol: bpf_filter
verify-elf: WARNING: ./usr/lib/libnetdude/0.11/plugins/libnd_bpf.so: undefined symbol: pcap_compile
verify-elf: WARNING: ./usr/lib/libnetdude/0.11/plugins/libnd_bpf.so: undefined symbol: g_malloc0
verify-elf: WARNING: ./usr/lib/libnetdude/0.11/plugins/libnd_bpf.so: undefined symbol: pcap_compile_nopcap
verify-elf: WARNING: ./usr/lib/libnetdude/0.11/plugins/libnd_bpf.so: undefined symbol: pcap_freecode
verify-elf: WARNING: ./usr/lib/libnetdude/0.11/plugins/libnd_bpf.so: undefined symbol: g_strdup
verify-elf: WARNING: ./usr/lib/libnetdude/0.11/plugins/libnd_bpf.so: undefined symbol: pcapnav_pcap
verify-elf: WARNING: ./usr/lib/libnetdude/0.11/plugins/libnd_bpf.so: undefined symbol: g_free
verify-elf: WARNING: ./usr/lib/libnetdude/0.11/plugins/libnd_cksumfix.so: undefined symbol: libnd_trace_free
verify-elf: WARNING: ./usr/lib/libnetdude/0.11/plugins/libnd_cksumfix.so: undefined symbol: libnd_trace_get_pcap_handle
verify-elf: WARNING: ./usr/lib/libnetdude/0.11/plugins/libnd_cksumfix.so: undefined symbol: libnd_dumper_new
verify-elf: WARNING: ./usr/lib/libnetdude/0.11/plugins/libnd_cksumfix.so: undefined symbol: libnd_dumper_write
verify-elf: WARNING: ./usr/lib/libnetdude/0.11/plugins/libnd_cksumfix.so: undefined symbol: libnd_trace_set_dirty
verify-elf: WARNING: ./usr/lib/libnetdude/0.11/plugins/libnd_cksumfix.so: undefined symbol: libnd_pit_init
verify-elf: WARNING: ./usr/lib/libnetdude/0.11/plugins/libnd_cksumfix.so: undefined symbol: libnd_pit_get
verify-elf: WARNING: ./usr/lib/libnetdude/0.11/plugins/libnd_cksumfix.so: undefined symbol: libnd_pit_next
verify-elf: WARNING: ./usr/lib/libnetdude/0.11/plugins/libnd_cksumfix.so: undefined symbol: libnd_dumper_free
verify-elf: WARNING: ./usr/lib/libnetdude/0.11/plugins/libnd_cksumfix.so: undefined symbol: libnd_trace_new
verify-elf: WARNING: ./usr/lib/libnetdude/0.11/plugins/libnd_cksumfix.so: undefined symbol: libnd_packet_fix
verify-elf: WARNING: ./usr/lib/libnetdude/0.11/protocols/libnd_vlan.so: undefined symbol: libnd_proto_registry_find
verify-elf: WARNING: ./usr/lib/libnetdude/0.11/protocols/libnd_vlan.so: undefined symbol: libnd_packet_get_end
verify-elf: WARNING: ./usr/lib/libnetdude/0.11/protocols/libnd_vlan.so: undefined symbol: libnd_packet_get_data
verify-elf: WARNING: ./usr/lib/libnetdude/0.11/protocols/libnd_vlan.so: undefined symbol: libnd_packet_add_proto_data
verify-elf: WARNING: ./usr/lib/libnetdude/0.11/protocols/libnd_vlan.so: undefined symbol: libnd_raw_proto_get
verify-elf: WARNING: ./usr/lib/libnetdude/0.11/protocols/libnd_vlan.so: undefined symbol: libnd_proto_new
verify-elf: WARNING: ./usr/lib/libnetdude/0.11/protocols/libnd_udp.so: undefined symbol: libnd_packet_modified
verify-elf: WARNING: ./usr/lib/libnetdude/0.11/protocols/libnd_udp.so: undefined symbol: libnd_packet_get_proto_data
verify-elf: WARNING: ./usr/lib/libnetdude/0.11/protocols/libnd_udp.so: undefined symbol: libnd_misc_in_cksum
verify-elf: WARNING: ./usr/lib/libnetdude/0.11/protocols/libnd_udp.so: undefined symbol: libnd_packet_get_data
verify-elf: WARNING: ./usr/lib/libnetdude/0.11/protocols/libnd_udp.so: undefined symbol: libnd_proto_registry_find
verify-elf: WARNING: ./usr/lib/libnetdude/0.11/protocols/libnd_udp.so: undefined symbol: libnd_packet_get_end
verify-elf: WARNING: ./usr/lib/libnetdude/0.11/protocols/libnd_udp.so: undefined symbol: libnd_raw_proto_get
verify-elf: WARNING: ./usr/lib/libnetdude/0.11/protocols/libnd_udp.so: undefined symbol: libnd_packet_add_proto_data
verify-elf: WARNING: ./usr/lib/libnetdude/0.11/protocols/libnd_udp.so: undefined symbol: libnd_proto_new
verify-elf: WARNING: ./usr/lib/libnetdude/0.11/protocols/libnd_tcp.so: undefined symbol: libnd_packet_modified
verify-elf: WARNING: ./usr/lib/libnetdude/0.11/protocols/libnd_tcp.so: undefined symbol: g_free
verify-elf: WARNING: ./usr/lib/libnetdude/0.11/protocols/libnd_tcp.so: undefined symbol: libnd_reg_del_data
verify-elf: WARNING: ./usr/lib/libnetdude/0.11/protocols/libnd_tcp.so: undefined symbol: libnd_misc_ones_complement_checksum
verify-elf: WARNING: ./usr/lib/libnetdude/0.11/protocols/libnd_tcp.so: undefined symbol: g_hash_table_lookup
verify-elf: WARNING: ./usr/lib/libnetdude/0.11/protocols/libnd_tcp.so: undefined symbol: libnd_prefs_domain_add_apply_cb
verify-elf: WARNING: ./usr/lib/libnetdude/0.11/protocols/libnd_tcp.so: undefined symbol: libnd_prefs_add_domain
verify-elf: WARNING: ./usr/lib/libnetdude/0.11/protocols/libnd_tcp.so: undefined symbol: libnd_reg_get_data
verify-elf: WARNING: ./usr/lib/libnetdude/0.11/protocols/libnd_tcp.so: undefined symbol: g_hash_table_new
verify-elf: WARNING: ./usr/lib/libnetdude/0.11/protocols/libnd_tcp.so: undefined symbol: libnd_packet_get_trace
verify-elf: WARNING: ./usr/lib/libnetdude/0.11/protocols/libnd_tcp.so: undefined symbol: libnd_packet_get_data
verify-elf: WARNING: ./usr/lib/libnetdude/0.11/protocols/libnd_tcp.so: undefined symbol: g_hash_table_insert
verify-elf: WARNING: ./usr/lib/libnetdude/0.11/protocols/libnd_tcp.so: undefined symbol: libnd_tcpdump_options_add
verify-elf: WARNING: ./usr/lib/libnetdude/0.11/protocols/libnd_tcp.so: undefined symbol: libnd_packet_get_index
verify-elf: WARNING: ./usr/lib/libnetdude/0.11/protocols/libnd_tcp.so: undefined symbol: libnd_tcpdump_options_reset
verify-elf: WARNING: ./usr/lib/libnetdude/0.11/protocols/libnd_tcp.so: undefined symbol: libnd_proto_registry_find
verify-elf: WARNING: ./usr/lib/libnetdude/0.11/protocols/libnd_tcp.so: undefined symbol: libnd_reg_set_data
verify-elf: WARNING: ./usr/lib/libnetdude/0.11/protocols/libnd_tcp.so: undefined symbol: g_hash_table_destroy
verify-elf: WARNING: ./usr/lib/libnetdude/0.11/protocols/libnd_tcp.so: undefined symbol: libnd_packet_get_end
verify-elf: WARNING: ./usr/lib/libnetdude/0.11/protocols/libnd_tcp.so: undefined symbol: libnd_raw_proto_get
verify-elf: WARNING: ./usr/lib/libnetdude/0.11/protocols/libnd_tcp.so: undefined symbol: g_malloc0
verify-elf: WARNING: ./usr/lib/libnetdude/0.11/protocols/libnd_tcp.so: undefined symbol: libnd_packet_add_proto_data
verify-elf: WARNING: ./usr/lib/libnetdude/0.11/protocols/libnd_tcp.so: undefined symbol: g_snprintf
verify-elf: WARNING: ./usr/lib/libnetdude/0.11/protocols/libnd_tcp.so: undefined symbol: libnd_proto_new
verify-elf: WARNING: ./usr/lib/libnetdude/0.11/protocols/libnd_tcp.so: undefined symbol: g_hash_table_foreach
verify-elf: WARNING: ./usr/lib/libnetdude/0.11/protocols/libnd_tcp.so: undefined symbol: libnd_prefs_get_int_item
verify-elf: WARNING: ./usr/lib/libnetdude/0.11/protocols/libnd_snap.so: undefined symbol: libnd_proto_registry_find
verify-elf: WARNING: ./usr/lib/libnetdude/0.11/protocols/libnd_snap.so: undefined symbol: libnd_packet_get_end
verify-elf: WARNING: ./usr/lib/libnetdude/0.11/protocols/libnd_snap.so: undefined symbol: libnd_packet_get_data
verify-elf: WARNING: ./usr/lib/libnetdude/0.11/protocols/libnd_snap.so: undefined symbol: libnd_packet_add_proto_data
verify-elf: WARNING: ./usr/lib/libnetdude/0.11/protocols/libnd_snap.so: undefined symbol: libnd_raw_proto_get
verify-elf: WARNING: ./usr/lib/libnetdude/0.11/protocols/libnd_snap.so: undefined symbol: libnd_proto_new
verify-elf: WARNING: ./usr/lib/libnetdude/0.11/protocols/libnd_sll.so: undefined symbol: libnd_proto_registry_find
verify-elf: WARNING: ./usr/lib/libnetdude/0.11/protocols/libnd_sll.so: undefined symbol: libnd_packet_get_end
verify-elf: WARNING: ./usr/lib/libnetdude/0.11/protocols/libnd_sll.so: undefined symbol: libnd_packet_get_data
verify-elf: WARNING: ./usr/lib/libnetdude/0.11/protocols/libnd_sll.so: undefined symbol: libnd_packet_add_proto_data
verify-elf: WARNING: ./usr/lib/libnetdude/0.11/protocols/libnd_sll.so: undefined symbol: libnd_raw_proto_get
verify-elf: WARNING: ./usr/lib/libnetdude/0.11/protocols/libnd_sll.so: undefined symbol: libnd_proto_new
verify-elf: WARNING: ./usr/lib/libnetdude/0.11/protocols/libnd_ip.so: undefined symbol: libnd_proto_registry_find
verify-elf: WARNING: ./usr/lib/libnetdude/0.11/protocols/libnd_ip.so: undefined symbol: libnd_packet_foreach_proto
verify-elf: WARNING: ./usr/lib/libnetdude/0.11/protocols/libnd_ip.so: undefined symbol: libnd_packet_foreach_proto_backward
verify-elf: WARNING: ./usr/lib/libnetdude/0.11/protocols/libnd_ip.so: undefined symbol: libnd_misc_in_cksum
verify-elf: WARNING: ./usr/lib/libnetdude/0.11/protocols/libnd_ip.so: undefined symbol: libnd_packet_get_end
verify-elf: WARNING: ./usr/lib/libnetdude/0.11/protocols/libnd_ip.so: undefined symbol: libnd_packet_get_data
verify-elf: WARNING: ./usr/lib/libnetdude/0.11/protocols/libnd_ip.so: undefined symbol: libnd_packet_add_proto_data
verify-elf: WARNING: ./usr/lib/libnetdude/0.11/protocols/libnd_ip.so: undefined symbol: libnd_raw_proto_get
verify-elf: WARNING: ./usr/lib/libnetdude/0.11/protocols/libnd_ip.so: undefined symbol: libnd_proto_new
verify-elf: WARNING: ./usr/lib/libnetdude/0.11/protocols/libnd_ip.so: undefined symbol: libnd_packet_modified
verify-elf: WARNING: ./usr/lib/libnetdude/0.11/protocols/libnd_icmp.so: undefined symbol: libnd_proto_registry_find
verify-elf: WARNING: ./usr/lib/libnetdude/0.11/protocols/libnd_icmp.so: undefined symbol: libnd_misc_in_cksum
verify-elf: WARNING: ./usr/lib/libnetdude/0.11/protocols/libnd_icmp.so: undefined symbol: libnd_packet_get_end
verify-elf: WARNING: ./usr/lib/libnetdude/0.11/protocols/libnd_icmp.so: undefined symbol: libnd_packet_get_data
verify-elf: WARNING: ./usr/lib/libnetdude/0.11/protocols/libnd_icmp.so: undefined symbol: libnd_packet_add_proto_data
verify-elf: WARNING: ./usr/lib/libnetdude/0.11/protocols/libnd_icmp.so: undefined symbol: libnd_raw_proto_get
verify-elf: WARNING: ./usr/lib/libnetdude/0.11/protocols/libnd_icmp.so: undefined symbol: libnd_proto_new
verify-elf: WARNING: ./usr/lib/libnetdude/0.11/protocols/libnd_icmp.so: undefined symbol: libnd_packet_modified
verify-elf: WARNING: ./usr/lib/libnetdude/0.11/protocols/libnd_802_11.so: undefined symbol: libnd_proto_registry_find
verify-elf: WARNING: ./usr/lib/libnetdude/0.11/protocols/libnd_802_11.so: undefined symbol: libnd_packet_get_end
verify-elf: WARNING: ./usr/lib/libnetdude/0.11/protocols/libnd_802_11.so: undefined symbol: libnd_packet_get_data
verify-elf: WARNING: ./usr/lib/libnetdude/0.11/protocols/libnd_802_11.so: undefined symbol: libnd_packet_add_proto_data
verify-elf: WARNING: ./usr/lib/libnetdude/0.11/protocols/libnd_802_11.so: undefined symbol: libnd_raw_proto_get
verify-elf: WARNING: ./usr/lib/libnetdude/0.11/protocols/libnd_802_11.so: undefined symbol: libnd_proto_new
verify-elf: WARNING: ./usr/lib/libnetdude/0.11/protocols/libnd_fddi.so: undefined symbol: libnd_proto_registry_find
verify-elf: WARNING: ./usr/lib/libnetdude/0.11/protocols/libnd_fddi.so: undefined symbol: libnd_packet_get_end
verify-elf: WARNING: ./usr/lib/libnetdude/0.11/protocols/libnd_fddi.so: undefined symbol: libnd_packet_get_data
verify-elf: WARNING: ./usr/lib/libnetdude/0.11/protocols/libnd_fddi.so: undefined symbol: libnd_packet_add_proto_data
verify-elf: WARNING: ./usr/lib/libnetdude/0.11/protocols/libnd_fddi.so: undefined symbol: libnd_raw_proto_get
verify-elf: WARNING: ./usr/lib/libnetdude/0.11/protocols/libnd_fddi.so: undefined symbol: libnd_proto_new
verify-elf: WARNING: ./usr/lib/libnetdude/0.11/protocols/libnd_ethernet.so: undefined symbol: libnd_proto_registry_find
verify-elf: WARNING: ./usr/lib/libnetdude/0.11/protocols/libnd_ethernet.so: undefined symbol: libnd_packet_get_end
verify-elf: WARNING: ./usr/lib/libnetdude/0.11/protocols/libnd_ethernet.so: undefined symbol: libnd_packet_get_data
verify-elf: WARNING: ./usr/lib/libnetdude/0.11/protocols/libnd_ethernet.so: undefined symbol: libnd_packet_add_proto_data
verify-elf: WARNING: ./usr/lib/libnetdude/0.11/protocols/libnd_ethernet.so: undefined symbol: libnd_raw_proto_get
verify-elf: WARNING: ./usr/lib/libnetdude/0.11/protocols/libnd_ethernet.so: undefined symbol: libnd_proto_new
verify-elf: WARNING: ./usr/lib/libnetdude/0.11/protocols/libnd_arp.so: undefined symbol: libnd_proto_add_magic
verify-elf: WARNING: ./usr/lib/libnetdude/0.11/protocols/libnd_arp.so: undefined symbol: libnd_packet_get_end
verify-elf: WARNING: ./usr/lib/libnetdude/0.11/protocols/libnd_arp.so: undefined symbol: libnd_packet_get_data
verify-elf: WARNING: ./usr/lib/libnetdude/0.11/protocols/libnd_arp.so: undefined symbol: libnd_packet_add_proto_data
verify-elf: WARNING: ./usr/lib/libnetdude/0.11/protocols/libnd_arp.so: undefined symbol: libnd_raw_proto_get
verify-elf: WARNING: ./usr/lib/libnetdude/0.11/protocols/libnd_arp.so: undefined symbol: libnd_proto_new
verify-elf: WARNING: ./usr/lib/libnetdude.so.0.0.0: uses non-LFS functions: fopen readdir
Hardlinking identical .pyc and .opt-?.pyc files
Hardlinking identical .pyc and .pyo files
Processing files: libnetdude-0.11-alt2_16
Executing(%doc): /bin/sh -e /usr/src/tmp/rpm-tmp.20870
+ umask 022
+ /bin/mkdir -p /usr/src/RPM/BUILD
+ cd /usr/src/RPM/BUILD
+ cd libnetdude-0.11
+ DOCDIR=/usr/src/tmp/libnetdude-buildroot/usr/share/doc/libnetdude-0.11
+ export DOCDIR
+ rm -rf /usr/src/tmp/libnetdude-buildroot/usr/share/doc/libnetdude-0.11
+ /bin/mkdir -p /usr/src/tmp/libnetdude-buildroot/usr/share/doc/libnetdude-0.11
+ cp -prL README COPYING /usr/src/tmp/libnetdude-buildroot/usr/share/doc/libnetdude-0.11
+ chmod -R go-w /usr/src/tmp/libnetdude-buildroot/usr/share/doc/libnetdude-0.11
+ chmod -R a+rX /usr/src/tmp/libnetdude-buildroot/usr/share/doc/libnetdude-0.11
+ exit 0
Finding Provides (using /usr/lib/rpm/find-provides)
Executing: /bin/sh -e /usr/src/tmp/rpm-tmp.rVZJ13
find-provides: running scripts (alternatives,debuginfo,lib,pam,perl,pkgconfig,python,python3,shell)
Finding Requires (using /usr/lib/rpm/find-requires)
Executing: /bin/sh -e /usr/src/tmp/rpm-tmp.OODAjH
find-requires: running scripts (cpp,debuginfo,files,lib,pam,perl,pkgconfig,pkgconfiglib,python,python3,rpmlib,shebang,shell,static,symlinks)
Provides: libnetdude.so.0 = set:mdPTdpvZjQOZ369BLR9YnBzsXi9FbWilf1VM9XiVsobr74ZmhUviIXT25ja4QcqdM5Vgv3hfsaEW6tCB52yEzTekoeZFQ5iZ7q1gbW3Mylxiu4fKqWoMQ06Z5aKzsnXmhU25QwymjlxSmMZoH2Clhxl4wQawcCDSvlZHjJU9JIX6EcN5iyofMZ5Z8uPUX31II376rGfp3bvJBXfgD2UEL9LmT208d9iMPs95bD8WAGJ4LolnxuwKXP2308zinG6hIOQAPZDtZxU6p3zGnhnWEXXBVUmku1XDS2104z0PJml4WZJC1KwNJTR6Ws1o9mxPawOBvE4oIRCnrtHN5mQYlHIeVUUgkPWZ53SOU0awIfZD0CxCOFhrtu1lPuZelT1rUzQk1gN0TQ1O7npwO1b0D5pbPVslVPYUBucwZsuOHNJ4gpXJLDd1Zgb6lihd6Uhsei6WJ41KD0Gi7IHtzQzYFyigepdKReA51212Ql7lmJrAIzB0D0FN7Bdy7c0qeglu7TigddcfYpLuc26OaYEgnGFlttE4PG3TMGZhyf4ZnnnceFGoINGt9gnjlRCi8flH3sYmd0MHB9KcmeC0LRjxdDYUzWLi4hEcZsQhp0qwg9sNRH7K4oiAJ9hfIkDB8D3Va
Requires: /lib/ld-linux.so.2, libc.so.6(GLIBC_2.0), libc.so.6(GLIBC_2.1), libc.so.6(GLIBC_2.1.3), libc.so.6(GLIBC_2.15), libc.so.6(GLIBC_2.2), libc.so.6(GLIBC_2.3), libc.so.6(GLIBC_2.3.4), libc.so.6(GLIBC_2.4), libc.so.6(GLIBC_2.7), libdl.so.2(GLIBC_2.0), libdl.so.2(GLIBC_2.1), libglib-1.2.so.0 >= set:mhAP5iXIB7Vd3RqFGwHPHZps6yQ3HfOyCPVVu9ZhdtlHPOUnQQV2kGcrII53cLVl5mQV6i9nCXlWcq6A5, libmagic.so.1 >= set:jh7DH85833, libpcap.so.0.8 >= set:khzkqZ6scQIj1J52, libpcapnav.so.0 >= set:jeB2Ou07HjxPeaSJC8FVxnZ3e4i8m2ZAc0QgHGrRCB3gs3, rtld(GNU_HASH)
Requires(rpmlib): rpmlib(SetVersions)
Finding debuginfo files (using /usr/lib/rpm/find-debuginfo-files)
Executing: /bin/sh -e /usr/src/tmp/rpm-tmp.IrZnBU
Creating libnetdude-debuginfo package
Processing files: libnetdude-devel-0.11-alt2_16
Executing(%doc): /bin/sh -e /usr/src/tmp/rpm-tmp.61707
+ umask 022
+ /bin/mkdir -p /usr/src/RPM/BUILD
+ cd /usr/src/RPM/BUILD
+ cd libnetdude-0.11
+ DOCDIR=/usr/src/tmp/libnetdude-buildroot/usr/share/doc/libnetdude-devel-0.11
+ export DOCDIR
+ rm -rf /usr/src/tmp/libnetdude-buildroot/usr/share/doc/libnetdude-devel-0.11
+ /bin/mkdir -p /usr/src/tmp/libnetdude-buildroot/usr/share/doc/libnetdude-devel-0.11
+ cp -prL README COPYING ChangeLog TODO /usr/src/tmp/libnetdude-buildroot/usr/share/doc/libnetdude-devel-0.11
+ chmod -R go-w /usr/src/tmp/libnetdude-buildroot/usr/share/doc/libnetdude-devel-0.11
+ chmod -R a+rX /usr/src/tmp/libnetdude-buildroot/usr/share/doc/libnetdude-devel-0.11
+ exit 0
Finding Provides (using /usr/lib/rpm/find-provides)
Executing: /bin/sh -e /usr/src/tmp/rpm-tmp.uLyLWI
find-provides: running scripts (alternatives,debuginfo,lib,pam,perl,pkgconfig,python,python3,shell)
Finding Requires (using /usr/lib/rpm/find-requires)
Executing: /bin/sh -e /usr/src/tmp/rpm-tmp.sW3Sei
find-requires: running scripts (cpp,debuginfo,files,lib,pam,perl,pkgconfig,pkgconfiglib,python,python3,rpmlib,shebang,shell,static,symlinks)
In file included from /usr/src/tmp/libnetdude-buildroot/usr/include/libnetdude/0.11/libnd_types.h:28,
                 from /usr/src/tmp/libnetdude-buildroot/usr/include/libnetdude/0.11/libnd.h:36:
/usr/src/tmp/libnetdude-buildroot/usr/include/libnetdude/0.11/libnd_globals.h:28:10: fatal error: glib.h: No such file or directory
 #include <glib.h>
          ^~~~~~~~
compilation terminated.
cpp.req: /usr/src/tmp/libnetdude-buildroot/usr/include/libnetdude/0.11/libnd.h: cpp failed, trying c++ mode
In file included from /usr/src/tmp/libnetdude-buildroot/usr/include/libnetdude/0.11/libnd_types.h:28,
                 from /usr/src/tmp/libnetdude-buildroot/usr/include/libnetdude/0.11/libnd.h:36:
/usr/src/tmp/libnetdude-buildroot/usr/include/libnetdude/0.11/libnd_globals.h:28:10: fatal error: glib.h: No such file or directory
 #include <glib.h>
          ^~~~~~~~
compilation terminated.
cpp.req: WARNING: /usr/src/tmp/libnetdude-buildroot/usr/include/libnetdude/0.11/libnd.h: cpp failed
In file included from /usr/src/tmp/libnetdude-buildroot/usr/include/libnetdude/0.11/libnd_types.h:28,
                 from /usr/src/tmp/libnetdude-buildroot/usr/include/libnetdude/0.11/libnd_tp.h:28:
/usr/src/tmp/libnetdude-buildroot/usr/include/libnetdude/0.11/libnd_globals.h:28:10: fatal error: glib.h: No such file or directory
 #include <glib.h>
          ^~~~~~~~
compilation terminated.
cpp.req: /usr/src/tmp/libnetdude-buildroot/usr/include/libnetdude/0.11/libnd_tp.h: cpp failed, trying c++ mode
In file included from /usr/src/tmp/libnetdude-buildroot/usr/include/libnetdude/0.11/libnd_types.h:28,
                 from /usr/src/tmp/libnetdude-buildroot/usr/include/libnetdude/0.11/libnd_tp.h:28:
/usr/src/tmp/libnetdude-buildroot/usr/include/libnetdude/0.11/libnd_globals.h:28:10: fatal error: glib.h: No such file or directory
 #include <glib.h>
          ^~~~~~~~
compilation terminated.
cpp.req: WARNING: /usr/src/tmp/libnetdude-buildroot/usr/include/libnetdude/0.11/libnd_tp.h: cpp failed
In file included from /usr/src/tmp/libnetdude-buildroot/usr/include/libnetdude/0.11/libnd_types.h:28,
                 from /usr/src/tmp/libnetdude-buildroot/usr/include/libnetdude/0.11/libnd_tpm.h:29:
/usr/src/tmp/libnetdude-buildroot/usr/include/libnetdude/0.11/libnd_globals.h:28:10: fatal error: glib.h: No such file or directory
 #include <glib.h>
          ^~~~~~~~
compilation terminated.
cpp.req: /usr/src/tmp/libnetdude-buildroot/usr/include/libnetdude/0.11/libnd_tpm.h: cpp failed, trying c++ mode
In file included from /usr/src/tmp/libnetdude-buildroot/usr/include/libnetdude/0.11/libnd_types.h:28,
                 from /usr/src/tmp/libnetdude-buildroot/usr/include/libnetdude/0.11/libnd_tpm.h:29:
/usr/src/tmp/libnetdude-buildroot/usr/include/libnetdude/0.11/libnd_globals.h:28:10: fatal error: glib.h: No such file or directory
 #include <glib.h>
          ^~~~~~~~
compilation terminated.
cpp.req: WARNING: /usr/src/tmp/libnetdude-buildroot/usr/include/libnetdude/0.11/libnd_tpm.h: cpp failed
In file included from /usr/src/tmp/libnetdude-buildroot/usr/include/libnetdude/0.11/libnd_types.h:28,
                 from /usr/src/tmp/libnetdude-buildroot/usr/include/libnetdude/0.11/libnd.h:36,
                 from /usr/src/tmp/libnetdude-buildroot/usr/include/libnetdude/0.11/libnd_init.h:28:
/usr/src/tmp/libnetdude-buildroot/usr/include/libnetdude/0.11/libnd_globals.h:28:10: fatal error: glib.h: No such file or directory
 #include <glib.h>
          ^~~~~~~~
compilation terminated.
cpp.req: /usr/src/tmp/libnetdude-buildroot/usr/include/libnetdude/0.11/libnd_init.h: cpp failed, trying c++ mode
In file included from /usr/src/tmp/libnetdude-buildroot/usr/include/libnetdude/0.11/libnd_types.h:28,
                 from /usr/src/tmp/libnetdude-buildroot/usr/include/libnetdude/0.11/libnd.h:36,
                 from /usr/src/tmp/libnetdude-buildroot/usr/include/libnetdude/0.11/libnd_init.h:28:
/usr/src/tmp/libnetdude-buildroot/usr/include/libnetdude/0.11/libnd_globals.h:28:10: fatal error: glib.h: No such file or directory
 #include <glib.h>
          ^~~~~~~~
compilation terminated.
cpp.req: WARNING: /usr/src/tmp/libnetdude-buildroot/usr/include/libnetdude/0.11/libnd_init.h: cpp failed
In file included from /usr/src/tmp/libnetdude-buildroot/usr/include/libnetdude/0.11/libnd_types.h:28,
                 from /usr/src/tmp/libnetdude-buildroot/usr/include/libnetdude/0.11/libnd_misc.h:31:
/usr/src/tmp/libnetdude-buildroot/usr/include/libnetdude/0.11/libnd_globals.h:28:10: fatal error: glib.h: No such file or directory
 #include <glib.h>
          ^~~~~~~~
compilation terminated.
cpp.req: /usr/src/tmp/libnetdude-buildroot/usr/include/libnetdude/0.11/libnd_misc.h: cpp failed, trying c++ mode
In file included from /usr/src/tmp/libnetdude-buildroot/usr/include/libnetdude/0.11/libnd_types.h:28,
                 from /usr/src/tmp/libnetdude-buildroot/usr/include/libnetdude/0.11/libnd_misc.h:31:
/usr/src/tmp/libnetdude-buildroot/usr/include/libnetdude/0.11/libnd_globals.h:28:10: fatal error: glib.h: No such file or directory
 #include <glib.h>
          ^~~~~~~~
compilation terminated.
cpp.req: WARNING: /usr/src/tmp/libnetdude-buildroot/usr/include/libnetdude/0.11/libnd_misc.h: cpp failed
In file included from /usr/src/tmp/libnetdude-buildroot/usr/include/libnetdude/0.11/libnd_debug.h:28:
/usr/src/tmp/libnetdude-buildroot/usr/include/libnetdude/0.11/libnd_globals.h:28:10: fatal error: glib.h: No such file or directory
 #include <glib.h>
          ^~~~~~~~
compilation terminated.
cpp.req: /usr/src/tmp/libnetdude-buildroot/usr/include/libnetdude/0.11/libnd_debug.h: cpp failed, trying c++ mode
In file included from /usr/src/tmp/libnetdude-buildroot/usr/include/libnetdude/0.11/libnd_debug.h:28:
/usr/src/tmp/libnetdude-buildroot/usr/include/libnetdude/0.11/libnd_globals.h:28:10: fatal error: glib.h: No such file or directory
 #include <glib.h>
          ^~~~~~~~
compilation terminated.
cpp.req: WARNING: /usr/src/tmp/libnetdude-buildroot/usr/include/libnetdude/0.11/libnd_debug.h: cpp failed
In file included from /usr/src/tmp/libnetdude-buildroot/usr/include/libnetdude/0.11/libnd_types.h:28,
                 from /usr/src/tmp/libnetdude-buildroot/usr/include/libnetdude/0.11/libnd.h:36,
                 from /usr/src/tmp/libnetdude-buildroot/usr/include/libnetdude/0.11/libnd_prefs.h:38:
/usr/src/tmp/libnetdude-buildroot/usr/include/libnetdude/0.11/libnd_globals.h:28:10: fatal error: glib.h: No such file or directory
 #include <glib.h>
          ^~~~~~~~
compilation terminated.
cpp.req: /usr/src/tmp/libnetdude-buildroot/usr/include/libnetdude/0.11/libnd_prefs.h: cpp failed, trying c++ mode
In file included from /usr/src/tmp/libnetdude-buildroot/usr/include/libnetdude/0.11/libnd_types.h:28,
                 from /usr/src/tmp/libnetdude-buildroot/usr/include/libnetdude/0.11/libnd.h:36,
                 from /usr/src/tmp/libnetdude-buildroot/usr/include/libnetdude/0.11/libnd_prefs.h:38:
/usr/src/tmp/libnetdude-buildroot/usr/include/libnetdude/0.11/libnd_globals.h:28:10: fatal error: glib.h: No such file or directory
 #include <glib.h>
          ^~~~~~~~
compilation terminated.
cpp.req: WARNING: /usr/src/tmp/libnetdude-buildroot/usr/include/libnetdude/0.11/libnd_prefs.h: cpp failed
In file included from /usr/src/tmp/libnetdude-buildroot/usr/include/libnetdude/0.11/libnd_types.h:28,
                 from /usr/src/tmp/libnetdude-buildroot/usr/include/libnetdude/0.11/libnd_filter.h:28,
                 from /usr/src/tmp/libnetdude-buildroot/usr/include/libnetdude/0.11/libnd_trace.h:29:
/usr/src/tmp/libnetdude-buildroot/usr/include/libnetdude/0.11/libnd_globals.h:28:10: fatal error: glib.h: No such file or directory
 #include <glib.h>
          ^~~~~~~~
compilation terminated.
cpp.req: /usr/src/tmp/libnetdude-buildroot/usr/include/libnetdude/0.11/libnd_trace.h: cpp failed, trying c++ mode
In file included from /usr/src/tmp/libnetdude-buildroot/usr/include/libnetdude/0.11/libnd_types.h:28,
                 from /usr/src/tmp/libnetdude-buildroot/usr/include/libnetdude/0.11/libnd_filter.h:28,
                 from /usr/src/tmp/libnetdude-buildroot/usr/include/libnetdude/0.11/libnd_trace.h:29:
/usr/src/tmp/libnetdude-buildroot/usr/include/libnetdude/0.11/libnd_globals.h:28:10: fatal error: glib.h: No such file or directory
 #include <glib.h>
          ^~~~~~~~
compilation terminated.
cpp.req: WARNING: /usr/src/tmp/libnetdude-buildroot/usr/include/libnetdude/0.11/libnd_trace.h: cpp failed
In file included from /usr/src/tmp/libnetdude-buildroot/usr/include/libnetdude/0.11/libnd_types.h:28:
/usr/src/tmp/libnetdude-buildroot/usr/include/libnetdude/0.11/libnd_globals.h:28:10: fatal error: glib.h: No such file or directory
 #include <glib.h>
          ^~~~~~~~
compilation terminated.
cpp.req: /usr/src/tmp/libnetdude-buildroot/usr/include/libnetdude/0.11/libnd_types.h: cpp failed, trying c++ mode
In file included from /usr/src/tmp/libnetdude-buildroot/usr/include/libnetdude/0.11/libnd_types.h:28:
/usr/src/tmp/libnetdude-buildroot/usr/include/libnetdude/0.11/libnd_globals.h:28:10: fatal error: glib.h: No such file or directory
 #include <glib.h>
          ^~~~~~~~
compilation terminated.
cpp.req: WARNING: /usr/src/tmp/libnetdude-buildroot/usr/include/libnetdude/0.11/libnd_types.h: cpp failed
In file included from /usr/src/tmp/libnetdude-buildroot/usr/include/libnetdude/0.11/libnd_types.h:28,
                 from /usr/src/tmp/libnetdude-buildroot/usr/include/libnetdude/0.11/libnd_dumper.h:29:
/usr/src/tmp/libnetdude-buildroot/usr/include/libnetdude/0.11/libnd_globals.h:28:10: fatal error: glib.h: No such file or directory
 #include <glib.h>
          ^~~~~~~~
compilation terminated.
cpp.req: /usr/src/tmp/libnetdude-buildroot/usr/include/libnetdude/0.11/libnd_dumper.h: cpp failed, trying c++ mode
In file included from /usr/src/tmp/libnetdude-buildroot/usr/include/libnetdude/0.11/libnd_types.h:28,
                 from /usr/src/tmp/libnetdude-buildroot/usr/include/libnetdude/0.11/libnd_dumper.h:29:
/usr/src/tmp/libnetdude-buildroot/usr/include/libnetdude/0.11/libnd_globals.h:28:10: fatal error: glib.h: No such file or directory
 #include <glib.h>
          ^~~~~~~~
compilation terminated.
cpp.req: WARNING: /usr/src/tmp/libnetdude-buildroot/usr/include/libnetdude/0.11/libnd_dumper.h: cpp failed
In file included from /usr/src/tmp/libnetdude-buildroot/usr/include/libnetdude/0.11/libnd_types.h:28,
                 from /usr/src/tmp/libnetdude-buildroot/usr/include/libnetdude/0.11/libnd_filter.h:28:
/usr/src/tmp/libnetdude-buildroot/usr/include/libnetdude/0.11/libnd_globals.h:28:10: fatal error: glib.h: No such file or directory
 #include <glib.h>
          ^~~~~~~~
compilation terminated.
cpp.req: /usr/src/tmp/libnetdude-buildroot/usr/include/libnetdude/0.11/libnd_filter.h: cpp failed, trying c++ mode
In file included from /usr/src/tmp/libnetdude-buildroot/usr/include/libnetdude/0.11/libnd_types.h:28,
                 from /usr/src/tmp/libnetdude-buildroot/usr/include/libnetdude/0.11/libnd_filter.h:28:
/usr/src/tmp/libnetdude-buildroot/usr/include/libnetdude/0.11/libnd_globals.h:28:10: fatal error: glib.h: No such file or directory
 #include <glib.h>
          ^~~~~~~~
compilation terminated.
cpp.req: WARNING: /usr/src/tmp/libnetdude-buildroot/usr/include/libnetdude/0.11/libnd_filter.h: cpp failed
In file included from /usr/src/tmp/libnetdude-buildroot/usr/include/libnetdude/0.11/libnd_types.h:28,
                 from /usr/src/tmp/libnetdude-buildroot/usr/include/libnetdude/0.11/libnd_packet.h:33:
/usr/src/tmp/libnetdude-buildroot/usr/include/libnetdude/0.11/libnd_globals.h:28:10: fatal error: glib.h: No such file or directory
 #include <glib.h>
          ^~~~~~~~
compilation terminated.
cpp.req: /usr/src/tmp/libnetdude-buildroot/usr/include/libnetdude/0.11/libnd_packet.h: cpp failed, trying c++ mode
In file included from /usr/src/tmp/libnetdude-buildroot/usr/include/libnetdude/0.11/libnd_types.h:28,
                 from /usr/src/tmp/libnetdude-buildroot/usr/include/libnetdude/0.11/libnd_packet.h:33:
/usr/src/tmp/libnetdude-buildroot/usr/include/libnetdude/0.11/libnd_globals.h:28:10: fatal error: glib.h: No such file or directory
 #include <glib.h>
          ^~~~~~~~
compilation terminated.
cpp.req: WARNING: /usr/src/tmp/libnetdude-buildroot/usr/include/libnetdude/0.11/libnd_packet.h: cpp failed
/usr/src/tmp/libnetdude-buildroot/usr/include/libnetdude/0.11/libnd_plugin.h:28:10: fatal error: ltdl.h: No such file or directory
 #include <ltdl.h>
          ^~~~~~~~
compilation terminated.
cpp.req: /usr/src/tmp/libnetdude-buildroot/usr/include/libnetdude/0.11/libnd_plugin.h: cpp failed, trying c++ mode
/usr/src/tmp/libnetdude-buildroot/usr/include/libnetdude/0.11/libnd_plugin.h:28:10: fatal error: ltdl.h: No such file or directory
 #include <ltdl.h>
          ^~~~~~~~
compilation terminated.
cpp.req: WARNING: /usr/src/tmp/libnetdude-buildroot/usr/include/libnetdude/0.11/libnd_plugin.h: cpp failed
/usr/src/tmp/libnetdude-buildroot/usr/include/libnetdude/0.11/libnd_globals.h:28:10: fatal error: glib.h: No such file or directory
 #include <glib.h>
          ^~~~~~~~
compilation terminated.
cpp.req: /usr/src/tmp/libnetdude-buildroot/usr/include/libnetdude/0.11/libnd_globals.h: cpp failed, trying c++ mode
/usr/src/tmp/libnetdude-buildroot/usr/include/libnetdude/0.11/libnd_globals.h:28:10: fatal error: glib.h: No such file or directory
 #include <glib.h>
          ^~~~~~~~
compilation terminated.
cpp.req: WARNING: /usr/src/tmp/libnetdude-buildroot/usr/include/libnetdude/0.11/libnd_globals.h: cpp failed
In file included from /usr/src/tmp/libnetdude-buildroot/usr/include/libnetdude/0.11/libnd_types.h:28,
                 from /usr/src/tmp/libnetdude-buildroot/usr/include/libnetdude/0.11/libnd_tcpdump.h:28:
/usr/src/tmp/libnetdude-buildroot/usr/include/libnetdude/0.11/libnd_globals.h:28:10: fatal error: glib.h: No such file or directory
 #include <glib.h>
          ^~~~~~~~
compilation terminated.
cpp.req: /usr/src/tmp/libnetdude-buildroot/usr/include/libnetdude/0.11/libnd_tcpdump.h: cpp failed, trying c++ mode
In file included from /usr/src/tmp/libnetdude-buildroot/usr/include/libnetdude/0.11/libnd_types.h:28,
                 from /usr/src/tmp/libnetdude-buildroot/usr/include/libnetdude/0.11/libnd_tcpdump.h:28:
/usr/src/tmp/libnetdude-buildroot/usr/include/libnetdude/0.11/libnd_globals.h:28:10: fatal error: glib.h: No such file or directory
 #include <glib.h>
          ^~~~~~~~
compilation terminated.
cpp.req: WARNING: /usr/src/tmp/libnetdude-buildroot/usr/include/libnetdude/0.11/libnd_tcpdump.h: cpp failed
In file included from /usr/src/tmp/libnetdude-buildroot/usr/include/libnetdude/0.11/libnd_types.h:28,
                 from /usr/src/tmp/libnetdude-buildroot/usr/include/libnetdude/0.11/libnd_packet.h:33,
                 from /usr/src/tmp/libnetdude-buildroot/usr/include/libnetdude/0.11/libnd_protocol.h:29:
/usr/src/tmp/libnetdude-buildroot/usr/include/libnetdude/0.11/libnd_globals.h:28:10: fatal error: glib.h: No such file or directory
 #include <glib.h>
          ^~~~~~~~
compilation terminated.
cpp.req: /usr/src/tmp/libnetdude-buildroot/usr/include/libnetdude/0.11/libnd_protocol.h: cpp failed, trying c++ mode
In file included from /usr/src/tmp/libnetdude-buildroot/usr/include/libnetdude/0.11/libnd_types.h:28,
                 from /usr/src/tmp/libnetdude-buildroot/usr/include/libnetdude/0.11/libnd_packet.h:33,
                 from /usr/src/tmp/libnetdude-buildroot/usr/include/libnetdude/0.11/libnd_protocol.h:29:
/usr/src/tmp/libnetdude-buildroot/usr/include/libnetdude/0.11/libnd_globals.h:28:10: fatal error: glib.h: No such file or directory
 #include <glib.h>
          ^~~~~~~~
compilation terminated.
cpp.req: WARNING: /usr/src/tmp/libnetdude-buildroot/usr/include/libnetdude/0.11/libnd_protocol.h: cpp failed
In file included from /usr/src/tmp/libnetdude-buildroot/usr/include/libnetdude/0.11/libnd_types.h:28,
                 from /usr/src/tmp/libnetdude-buildroot/usr/include/libnetdude/0.11/libnd_raw_protocol.h:28:
/usr/src/tmp/libnetdude-buildroot/usr/include/libnetdude/0.11/libnd_globals.h:28:10: fatal error: glib.h: No such file or directory
 #include <glib.h>
          ^~~~~~~~
compilation terminated.
cpp.req: /usr/src/tmp/libnetdude-buildroot/usr/include/libnetdude/0.11/libnd_raw_protocol.h: cpp failed, trying c++ mode
In file included from /usr/src/tmp/libnetdude-buildroot/usr/include/libnetdude/0.11/libnd_types.h:28,
                 from /usr/src/tmp/libnetdude-buildroot/usr/include/libnetdude/0.11/libnd_raw_protocol.h:28:
/usr/src/tmp/libnetdude-buildroot/usr/include/libnetdude/0.11/libnd_globals.h:28:10: fatal error: glib.h: No such file or directory
 #include <glib.h>
          ^~~~~~~~
compilation terminated.
cpp.req: WARNING: /usr/src/tmp/libnetdude-buildroot/usr/include/libnetdude/0.11/libnd_raw_protocol.h: cpp failed
In file included from /usr/src/tmp/libnetdude-buildroot/usr/include/libnetdude/0.11/libnd_types.h:28,
                 from /usr/src/tmp/libnetdude-buildroot/usr/include/libnetdude/0.11/libnd_packet.h:33,
                 from /usr/src/tmp/libnetdude-buildroot/usr/include/libnetdude/0.11/libnd_protocol.h:29,
                 from /usr/src/tmp/libnetdude-buildroot/usr/include/libnetdude/0.11/libnd_null_protocol.h:28:
/usr/src/tmp/libnetdude-buildroot/usr/include/libnetdude/0.11/libnd_globals.h:28:10: fatal error: glib.h: No such file or directory
 #include <glib.h>
          ^~~~~~~~
compilation terminated.
cpp.req: /usr/src/tmp/libnetdude-buildroot/usr/include/libnetdude/0.11/libnd_null_protocol.h: cpp failed, trying c++ mode
In file included from /usr/src/tmp/libnetdude-buildroot/usr/include/libnetdude/0.11/libnd_types.h:28,
                 from /usr/src/tmp/libnetdude-buildroot/usr/include/libnetdude/0.11/libnd_packet.h:33,
                 from /usr/src/tmp/libnetdude-buildroot/usr/include/libnetdude/0.11/libnd_protocol.h:29,
                 from /usr/src/tmp/libnetdude-buildroot/usr/include/libnetdude/0.11/libnd_null_protocol.h:28:
/usr/src/tmp/libnetdude-buildroot/usr/include/libnetdude/0.11/libnd_globals.h:28:10: fatal error: glib.h: No such file or directory
 #include <glib.h>
          ^~~~~~~~
compilation terminated.
cpp.req: WARNING: /usr/src/tmp/libnetdude-buildroot/usr/include/libnetdude/0.11/libnd_null_protocol.h: cpp failed
In file included from /usr/src/tmp/libnetdude-buildroot/usr/include/libnetdude/0.11/libnd_types.h:28,
                 from /usr/src/tmp/libnetdude-buildroot/usr/include/libnetdude/0.11/libnd_packet.h:33,
                 from /usr/src/tmp/libnetdude-buildroot/usr/include/libnetdude/0.11/libnd_protocol.h:29,
                 from /usr/src/tmp/libnetdude-buildroot/usr/include/libnetdude/0.11/libnd_protocol_inst.h:28:
/usr/src/tmp/libnetdude-buildroot/usr/include/libnetdude/0.11/libnd_globals.h:28:10: fatal error: glib.h: No such file or directory
 #include <glib.h>
          ^~~~~~~~
compilation terminated.
cpp.req: /usr/src/tmp/libnetdude-buildroot/usr/include/libnetdude/0.11/libnd_protocol_inst.h: cpp failed, trying c++ mode
In file included from /usr/src/tmp/libnetdude-buildroot/usr/include/libnetdude/0.11/libnd_types.h:28,
                 from /usr/src/tmp/libnetdude-buildroot/usr/include/libnetdude/0.11/libnd_packet.h:33,
                 from /usr/src/tmp/libnetdude-buildroot/usr/include/libnetdude/0.11/libnd_protocol.h:29,
                 from /usr/src/tmp/libnetdude-buildroot/usr/include/libnetdude/0.11/libnd_protocol_inst.h:28:
/usr/src/tmp/libnetdude-buildroot/usr/include/libnetdude/0.11/libnd_globals.h:28:10: fatal error: glib.h: No such file or directory
 #include <glib.h>
          ^~~~~~~~
compilation terminated.
cpp.req: WARNING: /usr/src/tmp/libnetdude-buildroot/usr/include/libnetdude/0.11/libnd_protocol_inst.h: cpp failed
In file included from /usr/src/tmp/libnetdude-buildroot/usr/include/libnetdude/0.11/libnd_types.h:28,
                 from /usr/src/tmp/libnetdude-buildroot/usr/include/libnetdude/0.11/libnd_filter_factory.h:28:
/usr/src/tmp/libnetdude-buildroot/usr/include/libnetdude/0.11/libnd_globals.h:28:10: fatal error: glib.h: No such file or directory
 #include <glib.h>
          ^~~~~~~~
compilation terminated.
cpp.req: /usr/src/tmp/libnetdude-buildroot/usr/include/libnetdude/0.11/libnd_filter_factory.h: cpp failed, trying c++ mode
In file included from /usr/src/tmp/libnetdude-buildroot/usr/include/libnetdude/0.11/libnd_types.h:28,
                 from /usr/src/tmp/libnetdude-buildroot/usr/include/libnetdude/0.11/libnd_filter_factory.h:28:
/usr/src/tmp/libnetdude-buildroot/usr/include/libnetdude/0.11/libnd_globals.h:28:10: fatal error: glib.h: No such file or directory
 #include <glib.h>
          ^~~~~~~~
compilation terminated.
cpp.req: WARNING: /usr/src/tmp/libnetdude-buildroot/usr/include/libnetdude/0.11/libnd_filter_factory.h: cpp failed
In file included from /usr/src/tmp/libnetdude-buildroot/usr/include/libnetdude/0.11/libnd_types.h:28,
                 from /usr/src/tmp/libnetdude-buildroot/usr/include/libnetdude/0.11/libnd_filter_registry.h:28:
/usr/src/tmp/libnetdude-buildroot/usr/include/libnetdude/0.11/libnd_globals.h:28:10: fatal error: glib.h: No such file or directory
 #include <glib.h>
          ^~~~~~~~
compilation terminated.
cpp.req: /usr/src/tmp/libnetdude-buildroot/usr/include/libnetdude/0.11/libnd_filter_registry.h: cpp failed, trying c++ mode
In file included from /usr/src/tmp/libnetdude-buildroot/usr/include/libnetdude/0.11/libnd_types.h:28,
                 from /usr/src/tmp/libnetdude-buildroot/usr/include/libnetdude/0.11/libnd_filter_registry.h:28:
/usr/src/tmp/libnetdude-buildroot/usr/include/libnetdude/0.11/libnd_globals.h:28:10: fatal error: glib.h: No such file or directory
 #include <glib.h>
          ^~~~~~~~
compilation terminated.
cpp.req: WARNING: /usr/src/tmp/libnetdude-buildroot/usr/include/libnetdude/0.11/libnd_filter_registry.h: cpp failed
In file included from /usr/src/tmp/libnetdude-buildroot/usr/include/libnetdude/0.11/libnd_types.h:28,
                 from /usr/src/tmp/libnetdude-buildroot/usr/include/libnetdude/0.11/libnd_packet_iterator.h:28:
/usr/src/tmp/libnetdude-buildroot/usr/include/libnetdude/0.11/libnd_globals.h:28:10: fatal error: glib.h: No such file or directory
 #include <glib.h>
          ^~~~~~~~
compilation terminated.
cpp.req: /usr/src/tmp/libnetdude-buildroot/usr/include/libnetdude/0.11/libnd_packet_iterator.h: cpp failed, trying c++ mode
In file included from /usr/src/tmp/libnetdude-buildroot/usr/include/libnetdude/0.11/libnd_types.h:28,
                 from /usr/src/tmp/libnetdude-buildroot/usr/include/libnetdude/0.11/libnd_packet_iterator.h:28:
/usr/src/tmp/libnetdude-buildroot/usr/include/libnetdude/0.11/libnd_globals.h:28:10: fatal error: glib.h: No such file or directory
 #include <glib.h>
          ^~~~~~~~
compilation terminated.
cpp.req: WARNING: /usr/src/tmp/libnetdude-buildroot/usr/include/libnetdude/0.11/libnd_packet_iterator.h: cpp failed
In file included from /usr/src/tmp/libnetdude-buildroot/usr/include/libnetdude/0.11/libnd_types.h:28,
                 from /usr/src/tmp/libnetdude-buildroot/usr/include/libnetdude/0.11/libnd_packet_recycler.h:28:
/usr/src/tmp/libnetdude-buildroot/usr/include/libnetdude/0.11/libnd_globals.h:28:10: fatal error: glib.h: No such file or directory
 #include <glib.h>
          ^~~~~~~~
compilation terminated.
cpp.req: /usr/src/tmp/libnetdude-buildroot/usr/include/libnetdude/0.11/libnd_packet_recycler.h: cpp failed, trying c++ mode
In file included from /usr/src/tmp/libnetdude-buildroot/usr/include/libnetdude/0.11/libnd_types.h:28,
                 from /usr/src/tmp/libnetdude-buildroot/usr/include/libnetdude/0.11/libnd_packet_recycler.h:28:
/usr/src/tmp/libnetdude-buildroot/usr/include/libnetdude/0.11/libnd_globals.h:28:10: fatal error: glib.h: No such file or directory
 #include <glib.h>
          ^~~~~~~~
compilation terminated.
cpp.req: WARNING: /usr/src/tmp/libnetdude-buildroot/usr/include/libnetdude/0.11/libnd_packet_recycler.h: cpp failed
/usr/src/tmp/libnetdude-buildroot/usr/include/libnetdude/0.11/libnd_protocol_plugin.h:28:10: fatal error: ltdl.h: No such file or directory
 #include <ltdl.h>
          ^~~~~~~~
compilation terminated.
cpp.req: /usr/src/tmp/libnetdude-buildroot/usr/include/libnetdude/0.11/libnd_protocol_plugin.h: cpp failed, trying c++ mode
/usr/src/tmp/libnetdude-buildroot/usr/include/libnetdude/0.11/libnd_protocol_plugin.h:28:10: fatal error: ltdl.h: No such file or directory
 #include <ltdl.h>
          ^~~~~~~~
compilation terminated.
cpp.req: WARNING: /usr/src/tmp/libnetdude-buildroot/usr/include/libnetdude/0.11/libnd_protocol_plugin.h: cpp failed
In file included from /usr/src/tmp/libnetdude-buildroot/usr/include/libnetdude/0.11/libnd_types.h:28,
                 from /usr/src/tmp/libnetdude-buildroot/usr/include/libnetdude/0.11/libnd_protocol_registry.h:28:
/usr/src/tmp/libnetdude-buildroot/usr/include/libnetdude/0.11/libnd_globals.h:28:10: fatal error: glib.h: No such file or directory
 #include <glib.h>
          ^~~~~~~~
compilation terminated.
cpp.req: /usr/src/tmp/libnetdude-buildroot/usr/include/libnetdude/0.11/libnd_protocol_registry.h: cpp failed, trying c++ mode
In file included from /usr/src/tmp/libnetdude-buildroot/usr/include/libnetdude/0.11/libnd_types.h:28,
                 from /usr/src/tmp/libnetdude-buildroot/usr/include/libnetdude/0.11/libnd_protocol_registry.h:28:
/usr/src/tmp/libnetdude-buildroot/usr/include/libnetdude/0.11/libnd_globals.h:28:10: fatal error: glib.h: No such file or directory
 #include <glib.h>
          ^~~~~~~~
compilation terminated.
cpp.req: WARNING: /usr/src/tmp/libnetdude-buildroot/usr/include/libnetdude/0.11/libnd_protocol_registry.h: cpp failed
In file included from /usr/src/tmp/libnetdude-buildroot/usr/include/libnetdude/0.11/libnd_types.h:28,
                 from /usr/src/tmp/libnetdude-buildroot/usr/include/libnetdude/0.11/libnd_filter.h:28,
                 from /usr/src/tmp/libnetdude-buildroot/usr/include/libnetdude/0.11/libnd_trace.h:29,
                 from /usr/src/tmp/libnetdude-buildroot/usr/include/libnetdude/0.11/plugins/libnd_bpf.h:28:
/usr/src/tmp/libnetdude-buildroot/usr/include/libnetdude/0.11/libnd_globals.h:28:10: fatal error: glib.h: No such file or directory
 #include <glib.h>
          ^~~~~~~~
compilation terminated.
cpp.req: /usr/src/tmp/libnetdude-buildroot/usr/include/libnetdude/0.11/plugins/libnd_bpf.h: cpp failed, trying c++ mode
In file included from /usr/src/tmp/libnetdude-buildroot/usr/include/libnetdude/0.11/libnd_types.h:28,
                 from /usr/src/tmp/libnetdude-buildroot/usr/include/libnetdude/0.11/libnd_filter.h:28,
                 from /usr/src/tmp/libnetdude-buildroot/usr/include/libnetdude/0.11/libnd_trace.h:29,
                 from /usr/src/tmp/libnetdude-buildroot/usr/include/libnetdude/0.11/plugins/libnd_bpf.h:28:
/usr/src/tmp/libnetdude-buildroot/usr/include/libnetdude/0.11/libnd_globals.h:28:10: fatal error: glib.h: No such file or directory
 #include <glib.h>
          ^~~~~~~~
compilation terminated.
cpp.req: WARNING: /usr/src/tmp/libnetdude-buildroot/usr/include/libnetdude/0.11/plugins/libnd_bpf.h: cpp failed
In file included from /usr/src/tmp/libnetdude-buildroot/usr/include/libnetdude/0.11/libnd_types.h:28,
                 from /usr/src/tmp/libnetdude-buildroot/usr/include/libnetdude/0.11/libnd_filter.h:28,
                 from /usr/src/tmp/libnetdude-buildroot/usr/include/libnetdude/0.11/libnd_trace.h:29,
                 from /usr/src/tmp/libnetdude-buildroot/usr/include/libnetdude/0.11/plugins/libnd_cksumfix.h:28:
/usr/src/tmp/libnetdude-buildroot/usr/include/libnetdude/0.11/libnd_globals.h:28:10: fatal error: glib.h: No such file or directory
 #include <glib.h>
          ^~~~~~~~
compilation terminated.
cpp.req: /usr/src/tmp/libnetdude-buildroot/usr/include/libnetdude/0.11/plugins/libnd_cksumfix.h: cpp failed, trying c++ mode
In file included from /usr/src/tmp/libnetdude-buildroot/usr/include/libnetdude/0.11/libnd_types.h:28,
                 from /usr/src/tmp/libnetdude-buildroot/usr/include/libnetdude/0.11/libnd_filter.h:28,
                 from /usr/src/tmp/libnetdude-buildroot/usr/include/libnetdude/0.11/libnd_trace.h:29,
                 from /usr/src/tmp/libnetdude-buildroot/usr/include/libnetdude/0.11/plugins/libnd_cksumfix.h:28:
/usr/src/tmp/libnetdude-buildroot/usr/include/libnetdude/0.11/libnd_globals.h:28:10: fatal error: glib.h: No such file or directory
 #include <glib.h>
          ^~~~~~~~
compilation terminated.
cpp.req: WARNING: /usr/src/tmp/libnetdude-buildroot/usr/include/libnetdude/0.11/plugins/libnd_cksumfix.h: cpp failed
In file included from /usr/src/tmp/libnetdude-buildroot/usr/include/libnetdude/0.11/libnd_types.h:28,
                 from /usr/src/tmp/libnetdude-buildroot/usr/include/libnetdude/0.11/libnd.h:36,
                 from /usr/src/tmp/libnetdude-buildroot/usr/include/libnetdude/0.11/protocols/ip/libnd_ip.h:28:
/usr/src/tmp/libnetdude-buildroot/usr/include/libnetdude/0.11/libnd_globals.h:28:10: fatal error: glib.h: No such file or directory
 #include <glib.h>
          ^~~~~~~~
compilation terminated.
cpp.req: /usr/src/tmp/libnetdude-buildroot/usr/include/libnetdude/0.11/protocols/ip/libnd_ip.h: cpp failed, trying c++ mode
In file included from /usr/src/tmp/libnetdude-buildroot/usr/include/libnetdude/0.11/libnd_types.h:28,
                 from /usr/src/tmp/libnetdude-buildroot/usr/include/libnetdude/0.11/libnd.h:36,
                 from /usr/src/tmp/libnetdude-buildroot/usr/include/libnetdude/0.11/protocols/ip/libnd_ip.h:28:
/usr/src/tmp/libnetdude-buildroot/usr/include/libnetdude/0.11/libnd_globals.h:28:10: fatal error: glib.h: No such file or directory
 #include <glib.h>
          ^~~~~~~~
compilation terminated.
cpp.req: WARNING: /usr/src/tmp/libnetdude-buildroot/usr/include/libnetdude/0.11/protocols/ip/libnd_ip.h: cpp failed
In file included from /usr/src/tmp/libnetdude-buildroot/usr/include/libnetdude/0.11/libnd_types.h:28,
                 from /usr/src/tmp/libnetdude-buildroot/usr/include/libnetdude/0.11/libnd.h:36,
                 from /usr/src/tmp/libnetdude-buildroot/usr/include/libnetdude/0.11/protocols/tcp/libnd_tcb.h:28:
/usr/src/tmp/libnetdude-buildroot/usr/include/libnetdude/0.11/libnd_globals.h:28:10: fatal error: glib.h: No such file or directory
 #include <glib.h>
          ^~~~~~~~
compilation terminated.
cpp.req: /usr/src/tmp/libnetdude-buildroot/usr/include/libnetdude/0.11/protocols/tcp/libnd_tcb.h: cpp failed, trying c++ mode
In file included from /usr/src/tmp/libnetdude-buildroot/usr/include/libnetdude/0.11/libnd_types.h:28,
                 from /usr/src/tmp/libnetdude-buildroot/usr/include/libnetdude/0.11/libnd.h:36,
                 from /usr/src/tmp/libnetdude-buildroot/usr/include/libnetdude/0.11/protocols/tcp/libnd_tcb.h:28:
/usr/src/tmp/libnetdude-buildroot/usr/include/libnetdude/0.11/libnd_globals.h:28:10: fatal error: glib.h: No such file or directory
 #include <glib.h>
          ^~~~~~~~
compilation terminated.
cpp.req: WARNING: /usr/src/tmp/libnetdude-buildroot/usr/include/libnetdude/0.11/protocols/tcp/libnd_tcb.h: cpp failed
In file included from /usr/src/tmp/libnetdude-buildroot/usr/include/libnetdude/0.11/libnd_types.h:28,
                 from /usr/src/tmp/libnetdude-buildroot/usr/include/libnetdude/0.11/libnd.h:36,
                 from /usr/src/tmp/libnetdude-buildroot/usr/include/libnetdude/0.11/protocols/tcp/libnd_tcp.h:29:
/usr/src/tmp/libnetdude-buildroot/usr/include/libnetdude/0.11/libnd_globals.h:28:10: fatal error: glib.h: No such file or directory
 #include <glib.h>
          ^~~~~~~~
compilation terminated.
cpp.req: /usr/src/tmp/libnetdude-buildroot/usr/include/libnetdude/0.11/protocols/tcp/libnd_tcp.h: cpp failed, trying c++ mode
In file included from /usr/src/tmp/libnetdude-buildroot/usr/include/libnetdude/0.11/libnd_types.h:28,
                 from /usr/src/tmp/libnetdude-buildroot/usr/include/libnetdude/0.11/libnd.h:36,
                 from /usr/src/tmp/libnetdude-buildroot/usr/include/libnetdude/0.11/protocols/tcp/libnd_tcp.h:29:
/usr/src/tmp/libnetdude-buildroot/usr/include/libnetdude/0.11/libnd_globals.h:28:10: fatal error: glib.h: No such file or directory
 #include <glib.h>
          ^~~~~~~~
compilation terminated.
cpp.req: WARNING: /usr/src/tmp/libnetdude-buildroot/usr/include/libnetdude/0.11/protocols/tcp/libnd_tcp.h: cpp failed
In file included from /usr/src/tmp/libnetdude-buildroot/usr/include/libnetdude/0.11/libnd_types.h:28,
                 from /usr/src/tmp/libnetdude-buildroot/usr/include/libnetdude/0.11/libnd.h:36,
                 from /usr/src/tmp/libnetdude-buildroot/usr/include/libnetdude/0.11/protocols/udp/libnd_udp.h:28:
/usr/src/tmp/libnetdude-buildroot/usr/include/libnetdude/0.11/libnd_globals.h:28:10: fatal error: glib.h: No such file or directory
 #include <glib.h>
          ^~~~~~~~
compilation terminated.
cpp.req: /usr/src/tmp/libnetdude-buildroot/usr/include/libnetdude/0.11/protocols/udp/libnd_udp.h: cpp failed, trying c++ mode
In file included from /usr/src/tmp/libnetdude-buildroot/usr/include/libnetdude/0.11/libnd_types.h:28,
                 from /usr/src/tmp/libnetdude-buildroot/usr/include/libnetdude/0.11/libnd.h:36,
                 from /usr/src/tmp/libnetdude-buildroot/usr/include/libnetdude/0.11/protocols/udp/libnd_udp.h:28:
/usr/src/tmp/libnetdude-buildroot/usr/include/libnetdude/0.11/libnd_globals.h:28:10: fatal error: glib.h: No such file or directory
 #include <glib.h>
          ^~~~~~~~
compilation terminated.
cpp.req: WARNING: /usr/src/tmp/libnetdude-buildroot/usr/include/libnetdude/0.11/protocols/udp/libnd_udp.h: cpp failed
In file included from /usr/src/tmp/libnetdude-buildroot/usr/include/libnetdude/0.11/libnd_types.h:28,
                 from /usr/src/tmp/libnetdude-buildroot/usr/include/libnetdude/0.11/libnd.h:36,
                 from /usr/src/tmp/libnetdude-buildroot/usr/include/libnetdude/0.11/protocols/fddi/libnd_fddi.h:29:
/usr/src/tmp/libnetdude-buildroot/usr/include/libnetdude/0.11/libnd_globals.h:28:10: fatal error: glib.h: No such file or directory
 #include <glib.h>
          ^~~~~~~~
compilation terminated.
cpp.req: /usr/src/tmp/libnetdude-buildroot/usr/include/libnetdude/0.11/protocols/fddi/libnd_fddi.h: cpp failed, trying c++ mode
In file included from /usr/src/tmp/libnetdude-buildroot/usr/include/libnetdude/0.11/libnd_types.h:28,
                 from /usr/src/tmp/libnetdude-buildroot/usr/include/libnetdude/0.11/libnd.h:36,
                 from /usr/src/tmp/libnetdude-buildroot/usr/include/libnetdude/0.11/protocols/fddi/libnd_fddi.h:29:
/usr/src/tmp/libnetdude-buildroot/usr/include/libnetdude/0.11/libnd_globals.h:28:10: fatal error: glib.h: No such file or directory
 #include <glib.h>
          ^~~~~~~~
compilation terminated.
cpp.req: WARNING: /usr/src/tmp/libnetdude-buildroot/usr/include/libnetdude/0.11/protocols/fddi/libnd_fddi.h: cpp failed
In file included from /usr/src/tmp/libnetdude-buildroot/usr/include/libnetdude/0.11/libnd_types.h:28,
                 from /usr/src/tmp/libnetdude-buildroot/usr/include/libnetdude/0.11/libnd.h:36,
                 from /usr/src/tmp/libnetdude-buildroot/usr/include/libnetdude/0.11/protocols/icmp/libnd_icmp.h:29:
/usr/src/tmp/libnetdude-buildroot/usr/include/libnetdude/0.11/libnd_globals.h:28:10: fatal error: glib.h: No such file or directory
 #include <glib.h>
          ^~~~~~~~
compilation terminated.
cpp.req: /usr/src/tmp/libnetdude-buildroot/usr/include/libnetdude/0.11/protocols/icmp/libnd_icmp.h: cpp failed, trying c++ mode
In file included from /usr/src/tmp/libnetdude-buildroot/usr/include/libnetdude/0.11/libnd_types.h:28,
                 from /usr/src/tmp/libnetdude-buildroot/usr/include/libnetdude/0.11/libnd.h:36,
                 from /usr/src/tmp/libnetdude-buildroot/usr/include/libnetdude/0.11/protocols/icmp/libnd_icmp.h:29:
/usr/src/tmp/libnetdude-buildroot/usr/include/libnetdude/0.11/libnd_globals.h:28:10: fatal error: glib.h: No such file or directory
 #include <glib.h>
          ^~~~~~~~
compilation terminated.
cpp.req: WARNING: /usr/src/tmp/libnetdude-buildroot/usr/include/libnetdude/0.11/protocols/icmp/libnd_icmp.h: cpp failed
In file included from /usr/src/tmp/libnetdude-buildroot/usr/include/libnetdude/0.11/libnd_types.h:28,
                 from /usr/src/tmp/libnetdude-buildroot/usr/include/libnetdude/0.11/libnd.h:36,
                 from /usr/src/tmp/libnetdude-buildroot/usr/include/libnetdude/0.11/protocols/snap/libnd_snap.h:28:
/usr/src/tmp/libnetdude-buildroot/usr/include/libnetdude/0.11/libnd_globals.h:28:10: fatal error: glib.h: No such file or directory
 #include <glib.h>
          ^~~~~~~~
compilation terminated.
cpp.req: /usr/src/tmp/libnetdude-buildroot/usr/include/libnetdude/0.11/protocols/snap/libnd_snap.h: cpp failed, trying c++ mode
In file included from /usr/src/tmp/libnetdude-buildroot/usr/include/libnetdude/0.11/libnd_types.h:28,
                 from /usr/src/tmp/libnetdude-buildroot/usr/include/libnetdude/0.11/libnd.h:36,
                 from /usr/src/tmp/libnetdude-buildroot/usr/include/libnetdude/0.11/protocols/snap/libnd_snap.h:28:
/usr/src/tmp/libnetdude-buildroot/usr/include/libnetdude/0.11/libnd_globals.h:28:10: fatal error: glib.h: No such file or directory
 #include <glib.h>
          ^~~~~~~~
compilation terminated.
cpp.req: WARNING: /usr/src/tmp/libnetdude-buildroot/usr/include/libnetdude/0.11/protocols/snap/libnd_snap.h: cpp failed
In file included from /usr/src/tmp/libnetdude-buildroot/usr/include/libnetdude/0.11/libnd_types.h:28,
                 from /usr/src/tmp/libnetdude-buildroot/usr/include/libnetdude/0.11/libnd.h:36,
                 from /usr/src/tmp/libnetdude-buildroot/usr/include/libnetdude/0.11/protocols/vlan/libnd_vlan.h:28:
/usr/src/tmp/libnetdude-buildroot/usr/include/libnetdude/0.11/libnd_globals.h:28:10: fatal error: glib.h: No such file or directory
 #include <glib.h>
          ^~~~~~~~
compilation terminated.
cpp.req: /usr/src/tmp/libnetdude-buildroot/usr/include/libnetdude/0.11/protocols/vlan/libnd_vlan.h: cpp failed, trying c++ mode
In file included from /usr/src/tmp/libnetdude-buildroot/usr/include/libnetdude/0.11/libnd_types.h:28,
                 from /usr/src/tmp/libnetdude-buildroot/usr/include/libnetdude/0.11/libnd.h:36,
                 from /usr/src/tmp/libnetdude-buildroot/usr/include/libnetdude/0.11/protocols/vlan/libnd_vlan.h:28:
/usr/src/tmp/libnetdude-buildroot/usr/include/libnetdude/0.11/libnd_globals.h:28:10: fatal error: glib.h: No such file or directory
 #include <glib.h>
          ^~~~~~~~
compilation terminated.
cpp.req: WARNING: /usr/src/tmp/libnetdude-buildroot/usr/include/libnetdude/0.11/protocols/vlan/libnd_vlan.h: cpp failed
Requires: libnetdude = 0.11-alt2_16, /bin/sh, /lib/ld-linux.so.2, /usr/lib/libnetdude.so.0.0.0, libc.so.6(GLIBC_2.0), libc.so.6(GLIBC_2.3.4), libnetdude.so.0 >= set:mips3ApqeX2FvdjqDb0AELESh1, libpcapnav.so.0 >= set:jidhf, rtld(GNU_HASH)
Requires(rpmlib): rpmlib(SetVersions)
Finding debuginfo files (using /usr/lib/rpm/find-debuginfo-files)
Executing: /bin/sh -e /usr/src/tmp/rpm-tmp.z0YnSE
Creating libnetdude-devel-debuginfo package
Processing files: libnetdude-debuginfo-0.11-alt2_16
Finding Provides (using /usr/lib/rpm/find-provides)
Executing: /bin/sh -e /usr/src/tmp/rpm-tmp.BBRO6I
find-provides: running scripts (debuginfo)
Finding Requires (using /usr/lib/rpm/find-requires)
Executing: /bin/sh -e /usr/src/tmp/rpm-tmp.xyeqep
find-requires: running scripts (debuginfo)
Provides: debug(libnetdude.so.0)
Requires: libnetdude = 0.11-alt2_16, /usr/lib/debug/lib/ld-linux.so.2.debug, debug(libc.so.6), debug(libdl.so.2), debug(libglib-1.2.so.0), debug(libmagic.so.1), debug(libpcap.so.0.8), debug(libpcapnav.so.0)
Processing files: libnetdude-devel-debuginfo-0.11-alt2_16
Finding Provides (using /usr/lib/rpm/find-provides)
Executing: /bin/sh -e /usr/src/tmp/rpm-tmp.4y3rOB
find-provides: running scripts (debuginfo)
Finding Requires (using /usr/lib/rpm/find-requires)
Executing: /bin/sh -e /usr/src/tmp/rpm-tmp.WbCfIx
find-requires: running scripts (debuginfo)
Requires: libnetdude-devel = 0.11-alt2_16, /usr/lib/debug/lib/ld-linux.so.2.debug, debug(libc.so.6), debug(libnetdude.so.0), debug(libpcapnav.so.0)
Adding to libnetdude-devel-debuginfo a strict dependency on libnetdude-debuginfo
Removing from libnetdude-devel-debuginfo 18 sources provided by libnetdude-debuginfo
also prunning dir /usr/src/debug/libnetdude-0.11/libltdl
also prunning dir /usr/src/debug/libnetdude-0.11/src
also prunning dir /usr/src/debug/libnetdude-0.11/tools
also prunning dir /usr/src/debug/libnetdude-0.11
Removing 2 extra deps from libnetdude-devel due to dependency on libnetdude
Removing 1 extra deps from libnetdude-devel-debuginfo due to dependency on libnetdude-debuginfo
Removing 5 extra deps from libnetdude-devel due to repentancy on libnetdude
Removing 3 extra deps from libnetdude-devel-debuginfo due to repentancy on libnetdude-debuginfo
warning: File(s) packaged into both libnetdude-0.11-alt2_16 and libnetdude-devel-0.11-alt2_16:
    /usr/lib/libnetdude/0.11/lndtool
warning: File(s) packaged into both libnetdude-debuginfo-0.11-alt2_16 and libnetdude-devel-debuginfo-0.11-alt2_16:
    /usr/lib/debug/.build-id/08/3498e42c2222f0334ce7e890bc2f7fd333794c
    /usr/lib/debug/.build-id/08/3498e42c2222f0334ce7e890bc2f7fd333794c.debug
    /usr/lib/debug/usr/lib/libnetdude/0.11/lndtool.debug
Wrote: /usr/src/RPM/RPMS/i586/libnetdude-0.11-alt2_16.i586.rpm
Wrote: /usr/src/RPM/RPMS/i586/libnetdude-devel-0.11-alt2_16.i586.rpm
Wrote: /usr/src/RPM/RPMS/i586/libnetdude-debuginfo-0.11-alt2_16.i586.rpm
Wrote: /usr/src/RPM/RPMS/i586/libnetdude-devel-debuginfo-0.11-alt2_16.i586.rpm
28.11user 6.78system 0:51.49elapsed 67%CPU (0avgtext+0avgdata 33072maxresident)k
0inputs+0outputs (0major+3123282minor)pagefaults 0swaps
152.74user 46.93system 4:14.81elapsed 78%CPU (0avgtext+0avgdata 196008maxresident)k
992inputs+0outputs (0major+4426341minor)pagefaults 0swaps