<86>Jan  2 08:15:48 userdel[47972]: delete user 'rooter'
<86>Jan  2 08:15:48 userdel[47972]: removed group 'rooter' owned by 'rooter'
<86>Jan  2 08:15:48 userdel[47972]: removed shadow group 'rooter' owned by 'rooter'
<86>Jan  2 08:15:48 groupadd[48002]: group added to /etc/group: name=rooter, GID=621
<86>Jan  2 08:15:48 groupadd[48002]: group added to /etc/gshadow: name=rooter
<86>Jan  2 08:15:48 groupadd[48002]: new group: name=rooter, GID=621
<86>Jan  2 08:15:48 useradd[48023]: new user: name=rooter, UID=621, GID=621, home=/root, shell=/bin/bash
<86>Jan  2 08:15:48 userdel[48079]: delete user 'builder'
<86>Jan  2 08:15:48 userdel[48079]: removed group 'builder' owned by 'builder'
<86>Jan  2 08:15:48 userdel[48079]: removed shadow group 'builder' owned by 'builder'
<86>Jan  2 08:15:48 groupadd[48113]: group added to /etc/group: name=builder, GID=622
<86>Jan  2 08:15:48 groupadd[48113]: group added to /etc/gshadow: name=builder
<86>Jan  2 08:15:48 groupadd[48113]: new group: name=builder, GID=622
<86>Jan  2 08:15:48 useradd[48138]: new user: name=builder, UID=622, GID=622, home=/usr/src, shell=/bin/bash
warning: Macro %_kde4_bindir not found
warning: Macro %K4build not found
warning: Macro %K4install not found
warning: Macro %_K4libdir not found
warning: Macro %_K4libdir not found
warning: Macro %_K4libdir not found
warning: Macro %_K4includedir not found
warning: Macro %_K4link not found
<13>Jan  2 08:15:55 rpmi: xorg-proto-devel-2018.4-alt3 1527685079 installed
<13>Jan  2 08:15:55 rpmi: libjpeg-2:1.5.1-alt1 1498218318 installed
<13>Jan  2 08:15:55 rpmi: libICE-1.0.9-alt1 1409902721 installed
<13>Jan  2 08:15:55 rpmi: libpng16-1.6.35-alt1 sisyphus.214397.100 1539159349 installed
<13>Jan  2 08:15:55 rpmi: libexpat-2.2.4-alt1 1503305345 installed
<13>Jan  2 08:15:55 rpmi: libSM-1.2.3-alt1 sisyphus.215747.100 1540812795 installed
<13>Jan  2 08:15:55 rpmi: libglvnd-7:1.1.0-alt3 sisyphus.215982.100 1541498632 installed
<13>Jan  2 08:15:55 rpmi: xml-utils-1:2.9.4.0.12.e905-alt1.1 1525115767 installed
<13>Jan  2 08:15:55 rpmi: libogg-1.3.3-alt1 sisyphus.217914.100 1545006091 installed
<13>Jan  2 08:15:55 rpmi: libwayland-client-1.16.0-alt1 1535614871 installed
<13>Jan  2 08:15:55 rpmi: shared-mime-info-1.10-alt1.1 1530525599 installed
<13>Jan  2 08:15:55 rpmi: libICE-devel-1.0.9-alt1 1409902721 installed
<13>Jan  2 08:15:55 rpmi: libSM-devel-1.2.3-alt1 sisyphus.215747.100 1540812795 installed
<13>Jan  2 08:15:55 rpmi: zlib-devel-1.2.11-alt1 sisyphus.217171.100 1543710737 installed
<86>Jan  2 08:15:55 groupadd[85440]: group added to /etc/group: name=utempter, GID=499
<86>Jan  2 08:15:55 groupadd[85440]: group added to /etc/gshadow: name=utempter
<86>Jan  2 08:15:55 groupadd[85440]: new group: name=utempter, GID=499
<13>Jan  2 08:15:55 rpmi: libutempter-1.1.6-alt2 1299636220 installed
<13>Jan  2 08:15:55 rpmi: libgif-4.1.6-alt3 1299634261 installed
<13>Jan  2 08:15:55 rpmi: libsqlite3-3.25.2-alt2 sisyphus.215082.100 1539700318 installed
<13>Jan  2 08:15:55 rpmi: libwayland-server-1.16.0-alt1 1535614871 installed
<13>Jan  2 08:15:55 rpmi: libXdmcp-1.1.1-alt1 1334617701 installed
<13>Jan  2 08:15:55 rpmi: libXau-1.0.8-alt1 1369565808 installed
<13>Jan  2 08:15:55 rpmi: libxcb-1.13.1-alt1 sisyphus.214413.100 1539170896 installed
<13>Jan  2 08:15:55 rpmi: ilmbase12-common-2.2.0-alt1.1 1434452921 installed
<13>Jan  2 08:15:55 rpmi: libiex12-2.2.0-alt1.1 1434452921 installed
<13>Jan  2 08:15:55 rpmi: libhalf12-2.2.0-alt1.1 1434452921 installed
<13>Jan  2 08:15:57 rpmi: libicu63-1:6.3.1-alt1 sisyphus.215328.100 1540049988 installed
<13>Jan  2 08:15:57 rpmi: libgraphite2-1.3.13-alt1 sisyphus.218545.100 1545686511 installed
<13>Jan  2 08:15:57 rpmi: libharfbuzz-2.2.0-alt1 sisyphus.218134.500 1545261518 installed
<13>Jan  2 08:15:57 rpmi: libfreetype-2.9.1-alt1.S1 1530781053 installed
<13>Jan  2 08:15:57 rpmi: fontconfig-2.13.1-alt1 sisyphus.215917.100 1540973886 installed
Updating fonts cache: <29>Jan  2 08:15:58 fontconfig: Updating fonts cache: succeeded
[ DONE ]
<13>Jan  2 08:15:58 rpmi: libidn2-2.0.5-alt1 1526923875 installed
<13>Jan  2 08:15:58 rpmi: qt4-common-4.8.7-alt13.S1 1535591248 installed
<13>Jan  2 08:15:58 rpmi: libqt4-core-4.8.7-alt13.S1 1535591248 installed
<13>Jan  2 08:15:58 rpmi: libqt4-sql-4.8.7-alt13.S1 1535591248 installed
<13>Jan  2 08:15:58 rpmi: libqt4-xml-4.8.7-alt13.S1 1535591248 installed
<13>Jan  2 08:15:58 rpmi: icon-theme-hicolor-0.17-alt1 1505715846 installed
<13>Jan  2 08:15:58 rpmi: ed-1:0.2-alt10 1449768440 installed
<13>Jan  2 08:15:59 rpmi: menu-icons-default-0.2.0.20-alt1 1479213521 installed
<13>Jan  2 08:15:59 rpmi: altlinux-freedesktop-menu-icon-theme-default-0.0.26-alt1 1366231495 installed
<13>Jan  2 08:15:59 rpmi: libqt4-sql-sqlite-4.8.7-alt13.S1 1535591248 installed
<13>Jan  2 08:15:59 rpmi: automoc-0.9.88-alt1.qa1 1366273811 installed
<13>Jan  2 08:15:59 rpmi: libqt4-clucene-4.8.7-alt13.S1 1535591248 installed
<13>Jan  2 08:15:59 rpmi: libqt4-test-4.8.7-alt13.S1 1535591248 installed
<13>Jan  2 08:15:59 rpmi: rpm-macros-qt4-4.8.7-alt13.S1 1535591089 installed
<13>Jan  2 08:15:59 rpmi: libharfbuzz-icu-2.2.0-alt1 sisyphus.218134.500 1545261518 installed
<13>Jan  2 08:15:59 rpmi: libgraphite2-devel-1.3.13-alt1 sisyphus.218545.100 1545686511 installed
<13>Jan  2 08:15:59 rpmi: icu-utils-1:6.3.1-alt1 sisyphus.215328.100 1540049988 installed
<13>Jan  2 08:15:59 rpmi: libicu-devel-1:6.3.1-alt1 sisyphus.215328.100 1540049988 installed
<13>Jan  2 08:15:59 rpmi: libilmthread12-2.2.0-alt1.1 1434452921 installed
<13>Jan  2 08:16:01 rpmi: libxcb-devel-1.13.1-alt1 sisyphus.214413.100 1539170896 installed
<13>Jan  2 08:16:01 rpmi: libXau-devel-1.0.8-alt1 1369565808 installed
<13>Jan  2 08:16:01 rpmi: libXdmcp-devel-1.1.1-alt1 1334617701 installed
<13>Jan  2 08:16:01 rpmi: libgif-devel-4.1.6-alt3 1299634261 installed
<13>Jan  2 08:16:01 rpmi: libutempter-devel-1.1.6-alt2 1299636220 installed
<13>Jan  2 08:16:01 rpmi: libpng-devel-1.6.35-alt1 sisyphus.214397.100 1539159349 installed
<13>Jan  2 08:16:01 rpmi: libwayland-egl-4:18.1.0-alt1 1535614871 installed
<13>Jan  2 08:16:01 rpmi: libflac8-1.3.2-alt1 1507623955 installed
<13>Jan  2 08:16:01 rpmi: libvorbis-1.3.6-alt1 1528307812 installed
<13>Jan  2 08:16:01 rpmi: rpm-build-gir-0.7.2-alt4 1534675014 installed
<13>Jan  2 08:16:01 rpmi: libOpenGL-7:1.1.0-alt3 sisyphus.215982.100 1541498632 installed
<13>Jan  2 08:16:01 rpmi: libGLES-7:1.1.0-alt3 sisyphus.215982.100 1541498632 installed
<13>Jan  2 08:16:01 rpmi: libtiff5-4.0.3-alt1 1348347501 installed
<13>Jan  2 08:16:01 rpmi: libjasper-2.0.14-alt1 1530105217 installed
<13>Jan  2 08:16:01 rpmi: sgml-common-0.6.3-alt15 1423664786 installed
<13>Jan  2 08:16:01 rpmi: docbook-dtds-4.5-alt1 1223476557 installed
<13>Jan  2 08:16:01 rpmi: docbook-style-xsl-1.79.1-alt2 sisyphus.213665.100 1537949315 installed
<13>Jan  2 08:16:01 rpmi: shared-desktop-ontologies-1:0.11.0-alt1 1378390330 installed
<13>Jan  2 08:16:01 rpmi: shared-desktop-ontologies-devel-1:0.11.0-alt1 1378390330 installed
<13>Jan  2 08:16:01 rpmi: bzlib-devel-1:1.0.6-alt5 1508883171 installed
<13>Jan  2 08:16:01 rpmi: libpcre16-8.42-alt1 1531419113 installed
<13>Jan  2 08:16:01 rpmi: pcretest-8.42-alt1 1531419113 installed
<13>Jan  2 08:16:01 rpmi: libpcre-devel-8.42-alt1 1531419113 installed
<13>Jan  2 08:16:01 rpmi: libltdl7-2.4.2-alt7 sisyphus.216946.100 1543650637 installed
<13>Jan  2 08:16:01 rpmi: libunixODBC2-2.3.4-alt2 1487857381 installed
<13>Jan  2 08:16:01 rpmi: libunixODBC-devel-compat-2.3.4-alt2 1487857381 installed
<13>Jan  2 08:16:02 rpmi: libunixODBC-devel-2.3.4-alt2 1487857381 installed
<13>Jan  2 08:16:02 rpmi: libalsa-1:1.1.7-alt1 sisyphus.215150.100 1539797658 installed
<13>Jan  2 08:16:02 rpmi: libgsm-1.0.17-alt1 1523356165 installed
<13>Jan  2 08:16:02 rpmi: libsndfile-1.0.28-alt2 sisyphus.212728.100 1536333068 installed
<13>Jan  2 08:16:02 rpmi: libasyncns-0.8-alt2.qa1 1365949820 installed
<13>Jan  2 08:16:02 rpmi: libhunspell-1.7.0-alt1 sisyphus.216944.100 1543319096 installed
<13>Jan  2 08:16:02 rpmi: libenchant-1.6.0-alt3.qa1 1460409853 installed
<13>Jan  2 08:16:02 rpmi: libwebp7-1.0.1-alt1 sisyphus.216740.100 1542890911 installed
<13>Jan  2 08:16:02 rpmi: liborc-0.4.28-alt1 1511201506 installed
<13>Jan  2 08:16:02 rpmi: libgudev-1:232-alt3 1523738518 installed
<13>Jan  2 08:16:02 rpmi: libxshmfence-1.2-alt2 1518613552 installed
<13>Jan  2 08:16:02 rpmi: libpciaccess-1:0.14-alt1 1528969252 installed
<13>Jan  2 08:16:02 rpmi: libdrm-1:2.4.96-alt1 sisyphus.215486.100 1540374027 installed
<13>Jan  2 08:16:02 rpmi: libgbm-4:18.3.1-alt1 sisyphus.218704.100 1545992861 installed
<13>Jan  2 08:16:02 rpmi: liblz4-1:1.8.3-alt1 sisyphus.213737.100 1538009686 installed
<13>Jan  2 08:16:02 rpmi: libgpg-error-1.31-alt1.S1 1529015802 installed
<13>Jan  2 08:16:02 rpmi: libgcrypt20-1.8.3-alt4 sisyphus.218050.200 1545223289 installed
<13>Jan  2 08:16:02 rpmi: libsystemd-1:240-alt1 sisyphus.218867.200 1546345349 installed
<13>Jan  2 08:16:02 rpmi: libdbus-1.12.12-alt1 sisyphus.217336.100 1544000923 installed
<13>Jan  2 08:16:02 rpmi: libqt4-dbus-4.8.7-alt13.S1 1535591248 installed
<13>Jan  2 08:16:02 rpmi: libqt4-script-4.8.7-alt13.S1 1535591248 installed
<13>Jan  2 08:16:02 rpmi: libstrigi-0.7.8-alt8 1529687726 installed
<13>Jan  2 08:16:02 rpmi: libxslt-1.1.32-alt2 1517429984 installed
<13>Jan  2 08:16:02 rpmi: libstrigi-devel-0.7.8-alt8 1529687726 installed
<13>Jan  2 08:16:02 rpmi: libpulseaudio-12.2-alt1 1535623585 installed
<13>Jan  2 08:16:02 rpmi: libdbus-devel-1.12.12-alt1 sisyphus.217336.100 1544000923 installed
<13>Jan  2 08:16:02 rpmi: liblcms2-2.9-alt1 1516411892 installed
<13>Jan  2 08:16:02 rpmi: libmng-2.0.3-alt2 sisyphus.215736.100 1540804101 installed
<13>Jan  2 08:16:02 rpmi: openexr22-common-2.2.0-alt1.1 1434453376 installed
<13>Jan  2 08:16:03 rpmi: libilmimf22-2.2.0-alt1.1 1434453376 installed
<13>Jan  2 08:16:03 rpmi: su-0.60-alt35 1484567251 installed
<13>Jan  2 08:16:03 rpmi: url_handler-0.3.1-alt1 1290564262 installed
<13>Jan  2 08:16:03 rpmi: libX11-locales-3:1.6.7-alt1 sisyphus.214413.200 1539171080 installed
<13>Jan  2 08:16:03 rpmi: libX11-3:1.6.7-alt1 sisyphus.214413.200 1539171143 installed
<13>Jan  2 08:16:03 rpmi: libXext-1.3.3-alt1 1409902959 installed
<13>Jan  2 08:16:03 rpmi: libX11-devel-3:1.6.7-alt1 sisyphus.214413.200 1539171143 installed
<13>Jan  2 08:16:03 rpmi: libXrender-0.9.8-alt1 1371312112 installed
<13>Jan  2 08:16:03 rpmi: libXfixes-5.0.3-alt1 sisyphus.216396.300 1542022162 installed
<13>Jan  2 08:16:03 rpmi: libXfixes-devel-5.0.3-alt1 sisyphus.216396.300 1542022162 installed
<13>Jan  2 08:16:03 rpmi: libXrender-devel-0.9.8-alt1 1371312112 installed
<13>Jan  2 08:16:03 rpmi: libXext-devel-1.3.3-alt1 1409902959 installed
<13>Jan  2 08:16:03 rpmi: libXcursor-1.1.15-alt1.S1 1512373366 installed
<13>Jan  2 08:16:03 rpmi: libXt-1.1.4-alt1 1369984722 installed
<13>Jan  2 08:16:03 rpmi: libXrandr-1.5.0-alt1 1431936189 installed
<13>Jan  2 08:16:03 rpmi: libXi-1.7.9-alt1.S1 1515755342 installed
<13>Jan  2 08:16:03 rpmi: libXi-devel-1.7.9-alt1.S1 1515755342 installed
<13>Jan  2 08:16:03 rpmi: libXinerama-1.1.3-alt2 1527671619 installed
<13>Jan  2 08:16:03 rpmi: libqt4-gui-4.8.7-alt13.S1 1535591248 installed
<13>Jan  2 08:16:03 rpmi: libqt4-svg-4.8.7-alt13.S1 1535591248 installed
<13>Jan  2 08:16:03 rpmi: libqt4-uitools-4.8.7-alt13.S1 1535591248 installed
<13>Jan  2 08:16:03 rpmi: libphonon-4.8.3-alt1 1418134069 installed
<13>Jan  2 08:16:04 rpmi: libqt4-designer-4.8.7-alt13.S1 1535591248 installed
<13>Jan  2 08:16:04 rpmi: libXxf86vm-1.1.4-alt2 1527672187 installed
<13>Jan  2 08:16:04 rpmi: libXScrnSaver-1.2.2-alt1 1331212354 installed
<13>Jan  2 08:16:04 rpmi: libXtst-1.2.2-alt1 1369984893 installed
<13>Jan  2 08:16:04 rpmi: libXtst-devel-1.2.2-alt1 1369984893 installed
<13>Jan  2 08:16:04 rpmi: libXdamage-1.1.3-alt4 1297162593 installed
<13>Jan  2 08:16:04 rpmi: libGLX-mesa-4:18.3.1-alt1 sisyphus.218704.100 1545992861 installed
<13>Jan  2 08:16:04 rpmi: libEGL-mesa-4:18.3.1-alt1 sisyphus.218704.100 1545992861 installed
<13>Jan  2 08:16:04 rpmi: libEGL-7:1.1.0-alt3 sisyphus.215982.100 1541498632 installed
<13>Jan  2 08:16:04 rpmi: libGLX-7:1.1.0-alt3 sisyphus.215982.100 1541498632 installed
<13>Jan  2 08:16:04 rpmi: libGL-7:1.1.0-alt3 sisyphus.215982.100 1541498632 installed
<13>Jan  2 08:16:04 rpmi: libqt4-opengl-4.8.7-alt13.S1 1535591248 installed
<13>Jan  2 08:16:04 rpmi: libglvnd-devel-7:1.1.0-alt3 sisyphus.215982.100 1541498632 installed
<13>Jan  2 08:16:04 rpmi: libEGL-devel-4:18.3.1-alt1 sisyphus.218704.100 1545992861 installed
<13>Jan  2 08:16:04 rpmi: libGL-devel-4:18.3.1-alt1 sisyphus.218704.100 1545992861 installed
<13>Jan  2 08:16:04 rpmi: libGLU-4:9.0.0-alt1 1347643784 installed
<13>Jan  2 08:16:04 rpmi: libGLU-devel-4:9.0.0-alt1 1347643784 installed
<13>Jan  2 08:16:04 rpmi: libXdamage-devel-1.1.3-alt4 1297162593 installed
<13>Jan  2 08:16:04 rpmi: libXScrnSaver-devel-1.2.2-alt1 1331212354 installed
<13>Jan  2 08:16:04 rpmi: libXxf86vm-devel-1.1.4-alt2 1527672187 installed
<13>Jan  2 08:16:04 rpmi: libphononexperimental-4.8.3-alt1 1418134069 installed
<13>Jan  2 08:16:04 rpmi: libdbusmenu-qt2-0.9.3-alt0.2 1463760662 installed
<13>Jan  2 08:16:04 rpmi: libqt4-multimedia-4.8.7-alt13.S1 1535591248 installed
<13>Jan  2 08:16:04 rpmi: libqt4-scripttools-4.8.7-alt13.S1 1535591248 installed
<13>Jan  2 08:16:04 rpmi: libXinerama-devel-1.1.3-alt2 1527671619 installed
<13>Jan  2 08:16:04 rpmi: libXrandr-devel-1.5.0-alt1 1431936189 installed
<13>Jan  2 08:16:04 rpmi: libXmu-1.1.2-alt1 1391072530 installed
<13>Jan  2 08:16:04 rpmi: xset-1.2.4-alt1 sisyphus.213358.100 1537438594 installed
<13>Jan  2 08:16:04 rpmi: libXpm-3.5.11-alt1 1391072398 installed
<13>Jan  2 08:16:04 rpmi: libXpm-devel-3.5.11-alt1 1391072398 installed
<13>Jan  2 08:16:05 rpmi: libXt-devel-1.1.4-alt1 1369984722 installed
<13>Jan  2 08:16:05 rpmi: libXcursor-devel-1.1.15-alt1.S1 1512373366 installed
<13>Jan  2 08:16:05 rpmi: libXft-2.3.2-alt1 1409902660 installed
<13>Jan  2 08:16:05 rpmi: libXv-1.0.11-alt1 1527685499 installed
<13>Jan  2 08:16:05 rpmi: libXv-devel-1.0.11-alt1 1527685499 installed
<13>Jan  2 08:16:05 rpmi: xprop-1.2.3-alt1 sisyphus.213300.100 1537401932 installed
<13>Jan  2 08:16:05 rpmi: xdg-utils-1.1.3-alt5 sisyphus.216143.100 1541504685 installed
<13>Jan  2 08:16:05 rpmi: libXcomposite-0.4.3-alt3 1297306936 installed
<13>Jan  2 08:16:05 rpmi: libXcomposite-devel-0.4.3-alt3 1297306936 installed
<13>Jan  2 08:16:05 rpmi: libxkbfile-1.0.9-alt1 1527685441 installed
<13>Jan  2 08:16:05 rpmi: libxkbfile-devel-1.0.9-alt1 1527685441 installed
<13>Jan  2 08:16:05 rpmi: desktop-file-utils-0.23-alt1 sisyphus.214313.100 1539037620 installed
<13>Jan  2 08:16:05 rpmi: rpm-macros-kde-common-devel-14.12.1-alt1 1422279175 installed
<13>Jan  2 08:16:05 rpmi: strace-4.26-alt1 sisyphus.218650.100 1545875033 installed
<13>Jan  2 08:16:05 rpmi: rpm-utils-0.10-alt1 1481222510 installed
<13>Jan  2 08:16:05 rpmi: kde-common-devel-14.12.1-alt1 1422279175 installed
<13>Jan  2 08:16:05 rpmi: kde-common-15.12.1-alt1 1453450783 installed
<13>Jan  2 08:16:05 rpmi: gsettings-desktop-schemas-data-3.28.1-alt1 sisyphus.212587.100 1536082062 installed
<13>Jan  2 08:16:05 rpmi: libgio-2.58.2-alt1 sisyphus.218134.100 1545260937 installed
<13>Jan  2 08:16:05 rpmi: gsettings-desktop-schemas-3.28.1-alt1 sisyphus.212587.100 1536082066 installed
<13>Jan  2 08:16:05 rpmi: libgstreamer1.0-1.14.4-alt1 sisyphus.214120.2200 1538778557 installed
<13>Jan  2 08:16:05 rpmi: libgst-plugins1.0-1.14.4-alt3 sisyphus.216849.100 1543144442 installed
<13>Jan  2 08:16:05 rpmi: libpolkit-0.115-alt4 sisyphus.217425.100 1544107356 installed
<13>Jan  2 08:16:05 rpmi: libpolkit-qt-core-1-0.112.0-alt1 1407931994 installed
<13>Jan  2 08:16:05 rpmi: gcc-c++-common-1.4.23-alt1 sisyphus.218115.200 1545282875 installed
<13>Jan  2 08:16:06 rpmi: libstdc++8-devel-8.2.1-alt2 sisyphus.218691.100 1545948777 installed
<13>Jan  2 08:16:08 rpmi: gcc8-c++-8.2.1-alt2 sisyphus.218691.100 1545948777 installed
<13>Jan  2 08:16:08 rpmi: libgdbm-1.8.3-alt10 1454943334 installed
<13>Jan  2 08:16:08 rpmi: libuv-1.23.2-alt1 sisyphus.217108.100 1543612230 installed
<13>Jan  2 08:16:08 rpmi: librhash-1.3.5-alt2 1505156279 installed
<13>Jan  2 08:16:08 rpmi: libjsoncpp19-1.8.4-alt2.S1 1518769525 installed
<13>Jan  2 08:16:08 rpmi: publicsuffix-list-dafsa-20181106-alt1 sisyphus.216228.100 1541611754 installed
<13>Jan  2 08:16:08 rpmi: libpsl-0.20.2-alt2 sisyphus.216228.200 1541611889 installed
<13>Jan  2 08:16:08 rpmi: libnghttp2-1.34.0-alt1 sisyphus.214524.100 1539249634 installed
<13>Jan  2 08:16:08 rpmi: libverto-0.3.0-alt1_5 1525957714 installed
<13>Jan  2 08:16:08 rpmi: libkeyutils-1.6-alt2 sisyphus.217337.100 1544003161 installed
<13>Jan  2 08:16:08 rpmi: libcom_err-1.44.5-alt1 sisyphus.218838.100 1546206118 installed
<13>Jan  2 08:16:08 rpmi: libbrotlicommon-1.0.7-alt1 sisyphus.215491.100 1540428597 installed
<13>Jan  2 08:16:08 rpmi: libbrotlidec-1.0.7-alt1 sisyphus.215491.100 1540428597 installed
<13>Jan  2 08:16:08 rpmi: libnettle6-3.4.1-alt1 sisyphus.217427.100 1544107917 installed
<13>Jan  2 08:16:08 rpmi: libarchive13-3.3.1-alt1.S1 1488799507 installed
<13>Jan  2 08:16:08 rpmi: rpm-macros-cmake-3.13.1-alt1 sisyphus.217317.100 1544006298 installed
<13>Jan  2 08:16:09 rpmi: cmake-modules-3.13.1-alt1 sisyphus.217317.100 1544006285 installed
<13>Jan  2 08:16:09 rpmi: libtasn1-4.13-alt2 1521133850 installed
<13>Jan  2 08:16:09 rpmi: libp11-kit-0.23.9-alt5 1525798298 installed
<13>Jan  2 08:16:09 rpmi: altlinux-mime-defaults-0.433-alt1 sisyphus.216233.100 1541623461 installed
<13>Jan  2 08:16:09 rpmi: wm-common-freedesktop-1.3-alt1 1303402115 installed
<13>Jan  2 08:16:09 rpmi: altlinux-freedesktop-menu-common-0.66-alt1 sisyphus.213076.200 1537111008 installed
<13>Jan  2 08:16:09 rpmi: rpm-macros-alternatives-0.4.5-alt1.1 1404382149 installed
<13>Jan  2 08:16:09 rpmi: alternatives-0.4.5-alt1.1 1404382149 installed
<13>Jan  2 08:16:09 rpmi: ca-certificates-2018.11.12-alt1 sisyphus.216395.300 1542114035 installed
<13>Jan  2 08:16:09 rpmi: ca-trust-0.1.1-alt2 1515595785 installed
<13>Jan  2 08:16:09 rpmi: p11-kit-trust-0.23.9-alt5 1525798298 installed
<13>Jan  2 08:16:09 rpmi: libcrypto1.1-1.1.0j-alt1 sisyphus.216647.100 1542743878 installed
<13>Jan  2 08:16:09 rpmi: libssl1.1-1.1.0j-alt1 sisyphus.216647.100 1542743878 installed
<13>Jan  2 08:16:09 rpmi: libqt4-network-4.8.7-alt13.S1 1535591248 installed
<13>Jan  2 08:16:09 rpmi: libpython3-3.6.5-alt1.1 1535734576 installed
<13>Jan  2 08:16:09 rpmi: rpm-build-python3-0.1.13.1-alt2 1535450458 installed
<13>Jan  2 08:16:09 rpmi: tests-for-installed-python3-pkgs-0.1.13.1-alt2 1535450458 installed
<13>Jan  2 08:16:09 rpmi: python3-3.6.5-alt1.1 1535734576 installed
<13>Jan  2 08:16:10 rpmi: python3-base-3.6.5-alt1.1 1535734576 installed
<13>Jan  2 08:16:10 rpmi: libqt4-qt3support-4.8.7-alt13.S1 1535591248 installed
<86>Jan  2 08:16:10 groupadd[4200]: group added to /etc/group: name=_keytab, GID=498
<86>Jan  2 08:16:10 groupadd[4200]: group added to /etc/gshadow: name=_keytab
<86>Jan  2 08:16:10 groupadd[4200]: new group: name=_keytab, GID=498
<13>Jan  2 08:16:10 rpmi: libkrb5-1.16.2-alt2 sisyphus.216877.200 1543483297 installed
<86>Jan  2 08:16:10 groupadd[4442]: group added to /etc/group: name=sasl, GID=497
<86>Jan  2 08:16:10 groupadd[4442]: group added to /etc/gshadow: name=sasl
<86>Jan  2 08:16:10 groupadd[4442]: new group: name=sasl, GID=497
<13>Jan  2 08:16:10 rpmi: libsasl2-3-2.1.27-alt1 sisyphus.218476.200 1545647755 installed
<13>Jan  2 08:16:10 rpmi: libldap-2.4.46-alt1 1535562135 installed
<13>Jan  2 08:16:10 rpmi: libcurl-7.63.0-alt1 sisyphus.217831.100 1544762811 installed
<13>Jan  2 08:16:11 rpmi: cmake-3.13.1-alt1 sisyphus.217317.100 1544006298 installed
<13>Jan  2 08:16:12 rpmi: glib2-devel-2.58.2-alt1 sisyphus.218134.100 1545260937 installed
<13>Jan  2 08:16:12 rpmi: libharfbuzz-devel-2.2.0-alt1 sisyphus.218134.500 1545261518 installed
<13>Jan  2 08:16:12 rpmi: libfreetype-devel-2.9.1-alt1.S1 1530781053 installed
<13>Jan  2 08:16:12 rpmi: fontconfig-devel-2.13.1-alt1 sisyphus.215917.100 1540973886 installed
<13>Jan  2 08:16:12 rpmi: libXft-devel-2.3.2-alt1 1409902660 installed
<13>Jan  2 08:16:12 rpmi: libqt4-xmlpatterns-4.8.7-alt13.S1 1535591248 installed
<13>Jan  2 08:16:13 rpmi: libqt4-declarative-4.8.7-alt13.S1 1535591248 installed
<13>Jan  2 08:16:14 rpmi: libqt4-webkit-1:2.3.4-alt6 sisyphus.215264.100 1540024276 installed
<13>Jan  2 08:16:14 rpmi: libattica0.4-0.4.2-alt1 1375339023 installed
<13>Jan  2 08:16:14 rpmi: libqt4-help-4.8.7-alt13.S1 1535591248 installed
<13>Jan  2 08:16:14 rpmi: libqt4-4.8.7-alt13.S1 1535591089 installed
<13>Jan  2 08:16:14 rpmi: libssl-devel-1.1.0j-alt1 sisyphus.216647.100 1542743878 installed
<13>Jan  2 08:16:14 rpmi: phonon-devel-4.8.3-alt1 1418134069 installed
<13>Jan  2 08:16:14 rpmi: libqt4-webkit-devel-1:2.3.4-alt6 sisyphus.215264.100 1540024276 installed
<13>Jan  2 08:16:16 rpmi: libqt4-devel-4.8.7-alt13.S1 1535591248 installed
<13>Jan  2 08:16:16 rpmi: libqca2-2.2.0-alt0.1.S1 1535533007 installed
<13>Jan  2 08:16:16 rpmi: altlinux-freedesktop-menu-shallow-menu-0.66-alt1 sisyphus.213076.200 1537111008 installed
<13>Jan  2 08:16:16 rpmi: altlinux-freedesktop-menu-generic-0.66-alt1 sisyphus.213076.200 1537111008 installed
<13>Jan  2 08:16:16 rpmi: altlinux-freedesktop-menu-kde4-0.66-alt1 sisyphus.213076.200 1537111008 installed
<13>Jan  2 08:16:18 rpmi: kde4libs-4.14.38-alt3 sisyphus.216623.100 1542711753 installed
<13>Jan  2 08:16:18 rpmi: kde4libs-devel-4.14.38-alt3 sisyphus.216623.100 1542711753 installed
<13>Jan  2 08:16:18 rpmi: gcc-c++-8-alt1 sisyphus.214000.40 1542664775 installed
Building target platforms: i586
Building for target i586
Wrote: /usr/src/in/nosrpm/libkdeedu4-15.12.1-alt1.nosrc.rpm
Installing libkdeedu4-15.12.1-alt1.src.rpm
Building target platforms: i586
Building for target i586
Executing(%prep): /bin/sh -e /usr/src/tmp/rpm-tmp.24484
+ umask 022
+ /bin/mkdir -p /usr/src/RPM/BUILD
+ cd /usr/src/RPM/BUILD
+ cd /usr/src/RPM/BUILD
+ rm -rf libkdeedu-15.12.1
+ echo 'Source #0 (libkdeedu-15.12.1.tar):'
Source #0 (libkdeedu-15.12.1.tar):
+ /bin/tar -xf /usr/src/RPM/SOURCES/libkdeedu-15.12.1.tar
+ cd libkdeedu-15.12.1
+ /bin/chmod -c -Rf u+rwX,go-w .
+ exit 0
Executing(%build): /bin/sh -e /usr/src/tmp/rpm-tmp.63372
+ umask 022
+ /bin/mkdir -p /usr/src/RPM/BUILD
+ cd /usr/src/RPM/BUILD
+ cd libkdeedu-15.12.1
+ __kde4_build
+ mkdir -p BUILD-i586-alt-linux
+ __kde4_cmake
+ export PATH=/usr/lib/kde4/bin:/usr/src/bin:/bin:/usr/bin:/usr/X11R6/bin:/usr/games
+ PATH=/usr/lib/kde4/bin:/usr/src/bin:/bin:/usr/bin:/usr/X11R6/bin:/usr/games
+ pushd BUILD-i586-alt-linux
~/RPM/BUILD/libkdeedu-15.12.1/BUILD-i586-alt-linux ~/RPM/BUILD/libkdeedu-15.12.1
+ cmake .. -DCMAKE_SKIP_RPATH:BOOL=yes -DCMAKE_BUILD_TYPE=Release '-DCMAKE_C_FLAGS:STRING=-pipe -frecord-gcc-switches -Wall -g -O2 -march=i586 -mtune=generic' '-DCMAKE_CXX_FLAGS:STRING=-pipe -frecord-gcc-switches -Wall -g -O2 -march=i586 -mtune=generic' '-DCMAKE_EXE_LINKER_FLAGS:STRING=-L/usr/lib/kde4link -L/usr/lib/kde4/devel' '-DCMAKE_MODULE_LINKER_FLAGS:STRING=-L/usr/lib/kde4link -L/usr/lib/kde4/devel' '-DCMAKE_SHARED_LINKER_FLAGS:STRING=-L/usr/lib/kde4link -L/usr/lib/kde4/devel' '-DCMAKE_LIBRARY_PATH:LIST=/usr/lib/kde4/devel;/usr/lib/kde4link;/usr/lib;/lib' -DLIB_DESTINATION=lib -DLIB_SUFFIX= -DCMAKE_INSTALL_PREFIX=/usr -DBIN_INSTALL_DIR=/usr/bin -DSBIN_INSTALL_DIR=/usr/sbin -DICON_INSTALL_DIR=/usr/share/icons -DXDG_APPS_INSTALL_DIR=/usr/share/applications/kde4 -DXDG_DIRECTORY_INSTALL_DIR=/usr/share/desktop-directories -DLIB_INSTALL_DIR=/usr/lib -DLIBEXEC_INSTALL_DIR=/usr/lib/kde4/libexec -DINCLUDE_INSTALL_DIR=/usr/include/kde4 -DKDE4_INCLUDE_INSTALL_DIR=/usr/include/kde4 -DSYSCONF_INSTALL_DIR=/etc -DDATA_INSTALL_DIR=/usr/share/kde4/apps -DCONFIG_INSTALL_DIR=/usr/share/kde4/config -DKCFG_INSTALL_DIR=/usr/share/kde4/config.kcfg -DHTML_INSTALL_DIR=/usr/share/kde4/doc/HTML -DAPPLNK_INSTALL_DIR=/usr/share/applnk -DLOCALE_INSTALL_DIR=/usr/share/kde4/locale -DSERVICES_INSTALL_DIR=/usr/share/kde4/services -DSERVICETYPES_INSTALL_DIR=/usr/share/kde4/servicetypes -DKCONF_UPDATE_INSTALL_DIR=/usr/share/kde4/apps/kconf_update -DXDG_MIME_INSTALL_DIR=/usr/share/mime/packages -DAUTOSTART_INSTALL_DIR=/usr/share/kde4/autostart -DSOUND_INSTALL_DIR=/usr/share/kde4/sounds -DTEMPLATES_INSTALL_DIR=/usr/share/kde4/templates -DWALLPAPER_INSTALL_DIR=/usr/share/wallpapers -DDBUS_INTERFACES_INSTALL_DIR=/usr/share/dbus-1/interfaces -DDBUS_SERVICES_INSTALL_DIR=/usr/share/dbus-1/services -DDBUS_SYSTEM_SERVICES_INSTALL_DIR=/usr/share/dbus-1/system-services -DMAN_INSTALL_DIR=/usr/share/man -DINFO_INSTALL_DIR=/usr/share/info -DINSTALL_PYTHON_FILES_IN_PYTHON_PREFIX:BOOL=yes
-- The C compiler identification is GNU 8.2.1
-- The CXX compiler identification is GNU 8.2.1
-- Check for working C compiler: /usr/bin/cc
-- Check for working C compiler: /usr/bin/cc -- works
-- Detecting C compiler ABI info
-- Detecting C compiler ABI info - done
-- Detecting C compile features
-- Detecting C compile features - done
-- Check for working CXX compiler: /usr/bin/c++
-- Check for working CXX compiler: /usr/bin/c++ -- works
-- Detecting CXX compiler ABI info
-- Detecting CXX compiler ABI info - done
-- Detecting CXX compile features
-- Detecting CXX compile features - done
-- Looking for Q_WS_X11
-- Looking for Q_WS_X11 - found
-- Looking for Q_WS_WIN
-- Looking for Q_WS_WIN - not found
-- Looking for Q_WS_QWS
-- Looking for Q_WS_QWS - not found
-- Looking for Q_WS_MAC
-- Looking for Q_WS_MAC - not found
-- Found Qt-Version 4.8.7 (using /usr/bin/qmake-qt4)
-- Looking for XOpenDisplay in /usr/lib/libX11.so;/usr/lib/libXext.so;/usr/lib/libXft.so;/usr/lib/libXau.so;/usr/lib/libXdmcp.so;/usr/lib/libXpm.so
-- Looking for XOpenDisplay in /usr/lib/libX11.so;/usr/lib/libXext.so;/usr/lib/libXft.so;/usr/lib/libXau.so;/usr/lib/libXdmcp.so;/usr/lib/libXpm.so - found
-- Looking for gethostbyname
-- Looking for gethostbyname - found
-- Looking for connect
-- Looking for connect - found
-- Looking for remove
-- Looking for remove - found
-- Looking for shmat
-- Looking for shmat - found
-- Looking for IceConnectionNumber in ICE
-- Looking for IceConnectionNumber in ICE - found
-- Found X11: /usr/lib/libX11.so
-- Looking for pthread.h
-- Looking for pthread.h - found
-- Looking for pthread_create
-- Looking for pthread_create - not found
-- Looking for pthread_create in pthreads
-- Looking for pthread_create in pthreads - not found
-- Looking for pthread_create in pthread
-- Looking for pthread_create in pthread - found
-- Found Threads: TRUE  
-- Found OpenSSL: /usr/lib/libcrypto.so (found version "1.1.0j")  
-- Looking for _POSIX_TIMERS
-- Looking for _POSIX_TIMERS - found
-- Found Automoc4: /usr/bin/automoc4  
-- Found Perl: /usr/bin/perl (found version "5.26.2") 
-- Found Phonon: /usr/include/kde4 (Required is at least version "4.3.80") 
-- Performing Test _OFFT_IS_64BIT
-- Performing Test _OFFT_IS_64BIT - Failed
-- Performing Test HAVE_FPIE_SUPPORT
-- Performing Test HAVE_FPIE_SUPPORT - Success
-- Performing Test __KDE_HAVE_W_OVERLOADED_VIRTUAL
-- Performing Test __KDE_HAVE_W_OVERLOADED_VIRTUAL - Success
-- Performing Test __KDE_HAVE_GCC_VISIBILITY
-- Performing Test __KDE_HAVE_GCC_VISIBILITY - Success
-- Found KDE 4.12 include dir: /usr/include/kde4
-- Found KDE 4.12 library dir: /usr/lib/kde4/devel
-- Found the KDE4 kconfig_compiler4 preprocessor: /usr/lib/kde4/bin/kconfig_compiler4
-- Found automoc4: /usr/bin/automoc4
CMake Warning (dev) at /usr/lib/automoc4/Automoc4Config.cmake:179 (get_directory_property):
  Policy CMP0059 is not set: Do not treat DEFINITIONS as a built-in directory
  property.  Run "cmake --help-policy CMP0059" for policy details.  Use the
  cmake_policy command to set the policy and suppress this warning.
Call Stack (most recent call first):
  /usr/lib/automoc4/Automoc4Config.cmake:243 (_add_automoc4_target)
  /usr/share/kde4/apps/cmake/modules/KDE4Macros.cmake:1081 (_automoc4_kde4_pre_target_handling)
  keduvocdocument/CMakeLists.txt:36 (kde4_add_library)
This warning is for project developers.  Use -Wno-dev to suppress it.

CMake Warning (dev) at /usr/lib/automoc4/Automoc4Config.cmake:179 (get_directory_property):
  Policy CMP0059 is not set: Do not treat DEFINITIONS as a built-in directory
  property.  Run "cmake --help-policy CMP0059" for policy details.  Use the
  cmake_policy command to set the policy and suppress this warning.
Call Stack (most recent call first):
  /usr/lib/automoc4/Automoc4Config.cmake:243 (_add_automoc4_target)
  /usr/share/kde4/apps/cmake/modules/KDE4Macros.cmake:1081 (_automoc4_kde4_pre_target_handling)
  keduvocdocument/CMakeLists.txt:38 (kde4_add_library)
This warning is for project developers.  Use -Wno-dev to suppress it.

CMake Warning (dev) at /usr/lib/automoc4/Automoc4Config.cmake:179 (get_directory_property):
  Policy CMP0059 is not set: Do not treat DEFINITIONS as a built-in directory
  property.  Run "cmake --help-policy CMP0059" for policy details.  Use the
  cmake_policy command to set the policy and suppress this warning.
Call Stack (most recent call first):
  /usr/lib/automoc4/Automoc4Config.cmake:243 (_add_automoc4_target)
  /usr/share/kde4/apps/cmake/modules/KDE4Macros.cmake:1081 (_automoc4_kde4_pre_target_handling)
  qtmmlwidget/CMakeLists.txt:5 (kde4_add_library)
This warning is for project developers.  Use -Wno-dev to suppress it.

CMake Warning (dev) in CMakeLists.txt:
  No cmake_minimum_required command is present.  A line of code such as

    cmake_minimum_required(VERSION 3.13)

  should be added at the top of the file.  The version specified may be lower
  if you wish to support older CMake versions for this project.  For more
  information run "cmake --help-policy CMP0000".
This warning is for project developers.  Use -Wno-dev to suppress it.

-- Configuring done
CMake Warning (dev) at /usr/share/kde4/apps/cmake/modules/KDE4Macros.cmake:1088 (add_library):
  Policy CMP0003 should be set before this line.  Add code such as

    if(COMMAND cmake_policy)
      cmake_policy(SET CMP0003 NEW)
    endif(COMMAND cmake_policy)

  as early as possible but after the most recent call to
  cmake_minimum_required or cmake_policy(VERSION).  This warning appears
  because target "keduvocdocument" links to some libraries for which the
  linker must search:

    -lpthread

  and other libraries with known full path:

    /usr/lib/libkio.so.5.14.38

  CMake is adding directories in the second list to the linker search path in
  case they are needed to find libraries from the first list (for backwards
  compatibility with CMake 2.4).  Set policy CMP0003 to OLD or NEW to enable
  or disable this behavior explicitly.  Run "cmake --help-policy CMP0003" for
  more information.
Call Stack (most recent call first):
  keduvocdocument/CMakeLists.txt:38 (kde4_add_library)
This warning is for project developers.  Use -Wno-dev to suppress it.

CMake Warning (dev) in keduvocdocument/CMakeLists.txt:
  Policy CMP0022 is not set: INTERFACE_LINK_LIBRARIES defines the link
  interface.  Run "cmake --help-policy CMP0022" for policy details.  Use the
  cmake_policy command to set the policy and suppress this warning.

  Target "keduvocdocument" has an INTERFACE_LINK_LIBRARIES property which
  differs from its LINK_INTERFACE_LIBRARIES properties.

  INTERFACE_LINK_LIBRARIES:

    KDE4__kio;Qt4::QtXml

  LINK_INTERFACE_LIBRARIES:

    

This warning is for project developers.  Use -Wno-dev to suppress it.

-- Generating done
CMake Warning:
  Manually-specified variables were not used by the project:

    APPLNK_INSTALL_DIR
    INSTALL_PYTHON_FILES_IN_PYTHON_PREFIX
    LIB_DESTINATION


-- Build files have been written to: /usr/src/RPM/BUILD/libkdeedu-15.12.1/BUILD-i586-alt-linux
+ popd
~/RPM/BUILD/libkdeedu-15.12.1
+ __kde4_make
+ pushd BUILD-i586-alt-linux
~/RPM/BUILD/libkdeedu-15.12.1/BUILD-i586-alt-linux ~/RPM/BUILD/libkdeedu-15.12.1
+ make -j8
make[2]: Entering directory '/usr/src/RPM/BUILD/libkdeedu-15.12.1/BUILD-i586-alt-linux'
Scanning dependencies of target keduvocdocument_static_automoc
make[2]: Leaving directory '/usr/src/RPM/BUILD/libkdeedu-15.12.1/BUILD-i586-alt-linux'
make[2]: Entering directory '/usr/src/RPM/BUILD/libkdeedu-15.12.1/BUILD-i586-alt-linux'
Scanning dependencies of target keduvocdocument_automoc
make[2]: Leaving directory '/usr/src/RPM/BUILD/libkdeedu-15.12.1/BUILD-i586-alt-linux'
make[2]: Entering directory '/usr/src/RPM/BUILD/libkdeedu-15.12.1/BUILD-i586-alt-linux'
Scanning dependencies of target qtmmlwidget_automoc
make[2]: Leaving directory '/usr/src/RPM/BUILD/libkdeedu-15.12.1/BUILD-i586-alt-linux'
make[1]: Entering directory '/usr/src/RPM/BUILD/libkdeedu-15.12.1/BUILD-i586-alt-linux'
[  0%] Built target qtmmlwidget_automoc
make[1]: Leaving directory '/usr/src/RPM/BUILD/libkdeedu-15.12.1/BUILD-i586-alt-linux'
make[2]: Entering directory '/usr/src/RPM/BUILD/libkdeedu-15.12.1/BUILD-i586-alt-linux'
Scanning dependencies of target qtmmlwidget
make[2]: Leaving directory '/usr/src/RPM/BUILD/libkdeedu-15.12.1/BUILD-i586-alt-linux'
make[2]: Entering directory '/usr/src/RPM/BUILD/libkdeedu-15.12.1/BUILD-i586-alt-linux'
[  1%] Building CXX object qtmmlwidget/CMakeFiles/qtmmlwidget.dir/qtmmlwidget_automoc.o
make[2]: Leaving directory '/usr/src/RPM/BUILD/libkdeedu-15.12.1/BUILD-i586-alt-linux'
make[2]: Entering directory '/usr/src/RPM/BUILD/libkdeedu-15.12.1/BUILD-i586-alt-linux'
Generating keduvocdocument.moc
Generating keduvockvtml2reader.moc
Generating keduvockvtmlreader.moc
make[2]: Leaving directory '/usr/src/RPM/BUILD/libkdeedu-15.12.1/BUILD-i586-alt-linux'
make[1]: Entering directory '/usr/src/RPM/BUILD/libkdeedu-15.12.1/BUILD-i586-alt-linux'
[  3%] Built target keduvocdocument_automoc
make[1]: Leaving directory '/usr/src/RPM/BUILD/libkdeedu-15.12.1/BUILD-i586-alt-linux'
make[2]: Entering directory '/usr/src/RPM/BUILD/libkdeedu-15.12.1/BUILD-i586-alt-linux'
Generating keduvocdocument.moc
Generating keduvockvtml2reader.moc
Generating keduvockvtmlreader.moc
make[2]: Leaving directory '/usr/src/RPM/BUILD/libkdeedu-15.12.1/BUILD-i586-alt-linux'
make[1]: Entering directory '/usr/src/RPM/BUILD/libkdeedu-15.12.1/BUILD-i586-alt-linux'
[  3%] Built target keduvocdocument_static_automoc
make[1]: Leaving directory '/usr/src/RPM/BUILD/libkdeedu-15.12.1/BUILD-i586-alt-linux'
make[2]: Entering directory '/usr/src/RPM/BUILD/libkdeedu-15.12.1/BUILD-i586-alt-linux'
Scanning dependencies of target keduvocdocument
make[2]: Leaving directory '/usr/src/RPM/BUILD/libkdeedu-15.12.1/BUILD-i586-alt-linux'
make[2]: Entering directory '/usr/src/RPM/BUILD/libkdeedu-15.12.1/BUILD-i586-alt-linux'
Scanning dependencies of target keduvocdocument_static
make[2]: Leaving directory '/usr/src/RPM/BUILD/libkdeedu-15.12.1/BUILD-i586-alt-linux'
make[2]: Entering directory '/usr/src/RPM/BUILD/libkdeedu-15.12.1/BUILD-i586-alt-linux'
[  4%] Building CXX object keduvocdocument/CMakeFiles/keduvocdocument.dir/keduvocdocument_automoc.o
make[2]: Leaving directory '/usr/src/RPM/BUILD/libkdeedu-15.12.1/BUILD-i586-alt-linux'
make[2]: Entering directory '/usr/src/RPM/BUILD/libkdeedu-15.12.1/BUILD-i586-alt-linux'
[  6%] Building CXX object keduvocdocument/CMakeFiles/keduvocdocument_static.dir/keduvocdocument_static_automoc.o
make[2]: Leaving directory '/usr/src/RPM/BUILD/libkdeedu-15.12.1/BUILD-i586-alt-linux'
make[2]: Entering directory '/usr/src/RPM/BUILD/libkdeedu-15.12.1/BUILD-i586-alt-linux'
[  9%] Building CXX object keduvocdocument/CMakeFiles/keduvocdocument.dir/keduvocidentifier.o
make[2]: Leaving directory '/usr/src/RPM/BUILD/libkdeedu-15.12.1/BUILD-i586-alt-linux'
make[2]: Entering directory '/usr/src/RPM/BUILD/libkdeedu-15.12.1/BUILD-i586-alt-linux'
[ 14%] Building CXX object keduvocdocument/CMakeFiles/keduvocdocument_static.dir/keduvocidentifier.o
make[2]: Leaving directory '/usr/src/RPM/BUILD/libkdeedu-15.12.1/BUILD-i586-alt-linux'
make[2]: Entering directory '/usr/src/RPM/BUILD/libkdeedu-15.12.1/BUILD-i586-alt-linux'
[  8%] Building CXX object keduvocdocument/CMakeFiles/keduvocdocument.dir/keduvocdocument.o
make[2]: Leaving directory '/usr/src/RPM/BUILD/libkdeedu-15.12.1/BUILD-i586-alt-linux'
make[2]: Entering directory '/usr/src/RPM/BUILD/libkdeedu-15.12.1/BUILD-i586-alt-linux'
[ 16%] Building CXX object keduvocdocument/CMakeFiles/keduvocdocument_static.dir/keduvocexpression.o
make[2]: Leaving directory '/usr/src/RPM/BUILD/libkdeedu-15.12.1/BUILD-i586-alt-linux'
make[2]: Entering directory '/usr/src/RPM/BUILD/libkdeedu-15.12.1/BUILD-i586-alt-linux'
[ 13%] Building CXX object keduvocdocument/CMakeFiles/keduvocdocument.dir/keduvocexpression.o
make[2]: Leaving directory '/usr/src/RPM/BUILD/libkdeedu-15.12.1/BUILD-i586-alt-linux'
make[2]: Entering directory '/usr/src/RPM/BUILD/libkdeedu-15.12.1/BUILD-i586-alt-linux'
[ 18%] Building CXX object keduvocdocument/CMakeFiles/keduvocdocument.dir/keduvoctranslation.o
make[2]: Leaving directory '/usr/src/RPM/BUILD/libkdeedu-15.12.1/BUILD-i586-alt-linux'
make[2]: Entering directory '/usr/src/RPM/BUILD/libkdeedu-15.12.1/BUILD-i586-alt-linux'
[ 22%] Building CXX object keduvocdocument/CMakeFiles/keduvocdocument.dir/keduvoclesson.o
make[2]: Leaving directory '/usr/src/RPM/BUILD/libkdeedu-15.12.1/BUILD-i586-alt-linux'
make[2]: Entering directory '/usr/src/RPM/BUILD/libkdeedu-15.12.1/BUILD-i586-alt-linux'
[ 11%] Building CXX object keduvocdocument/CMakeFiles/keduvocdocument_static.dir/keduvocdocument.o
make[2]: Leaving directory '/usr/src/RPM/BUILD/libkdeedu-15.12.1/BUILD-i586-alt-linux'
make[2]: Entering directory '/usr/src/RPM/BUILD/libkdeedu-15.12.1/BUILD-i586-alt-linux'
[ 19%] Building CXX object keduvocdocument/CMakeFiles/keduvocdocument.dir/keduvoccontainer.o
make[2]: Leaving directory '/usr/src/RPM/BUILD/libkdeedu-15.12.1/BUILD-i586-alt-linux'
make[2]: Entering directory '/usr/src/RPM/BUILD/libkdeedu-15.12.1/BUILD-i586-alt-linux'
[ 21%] Building CXX object keduvocdocument/CMakeFiles/keduvocdocument_static.dir/keduvoctranslation.o
make[2]: Leaving directory '/usr/src/RPM/BUILD/libkdeedu-15.12.1/BUILD-i586-alt-linux'
make[2]: Entering directory '/usr/src/RPM/BUILD/libkdeedu-15.12.1/BUILD-i586-alt-linux'
[ 29%] Building CXX object keduvocdocument/CMakeFiles/keduvocdocument.dir/keduvocarticle.o
make[2]: Leaving directory '/usr/src/RPM/BUILD/libkdeedu-15.12.1/BUILD-i586-alt-linux'
make[2]: Entering directory '/usr/src/RPM/BUILD/libkdeedu-15.12.1/BUILD-i586-alt-linux'
[ 26%] Building CXX object keduvocdocument/CMakeFiles/keduvocdocument.dir/keduvocleitnerbox.o
make[2]: Leaving directory '/usr/src/RPM/BUILD/libkdeedu-15.12.1/BUILD-i586-alt-linux'
make[2]: Entering directory '/usr/src/RPM/BUILD/libkdeedu-15.12.1/BUILD-i586-alt-linux'
[ 27%] Building CXX object keduvocdocument/CMakeFiles/keduvocdocument.dir/keduvoctext.o
make[2]: Leaving directory '/usr/src/RPM/BUILD/libkdeedu-15.12.1/BUILD-i586-alt-linux'
make[2]: Entering directory '/usr/src/RPM/BUILD/libkdeedu-15.12.1/BUILD-i586-alt-linux'
[ 36%] Building CXX object keduvocdocument/CMakeFiles/keduvocdocument.dir/keduvocpersonalpronoun.o
make[2]: Leaving directory '/usr/src/RPM/BUILD/libkdeedu-15.12.1/BUILD-i586-alt-linux'
make[2]: Entering directory '/usr/src/RPM/BUILD/libkdeedu-15.12.1/BUILD-i586-alt-linux'
[ 34%] Building CXX object keduvocdocument/CMakeFiles/keduvocdocument_static.dir/keduvocleitnerbox.o
make[2]: Leaving directory '/usr/src/RPM/BUILD/libkdeedu-15.12.1/BUILD-i586-alt-linux'
make[2]: Entering directory '/usr/src/RPM/BUILD/libkdeedu-15.12.1/BUILD-i586-alt-linux'
[ 31%] Building CXX object keduvocdocument/CMakeFiles/keduvocdocument_static.dir/keduvoclesson.o
make[2]: Leaving directory '/usr/src/RPM/BUILD/libkdeedu-15.12.1/BUILD-i586-alt-linux'
make[2]: Entering directory '/usr/src/RPM/BUILD/libkdeedu-15.12.1/BUILD-i586-alt-linux'
[ 24%] Building CXX object keduvocdocument/CMakeFiles/keduvocdocument_static.dir/keduvoccontainer.o
make[2]: Leaving directory '/usr/src/RPM/BUILD/libkdeedu-15.12.1/BUILD-i586-alt-linux'
make[2]: Entering directory '/usr/src/RPM/BUILD/libkdeedu-15.12.1/BUILD-i586-alt-linux'
[ 32%] Building CXX object keduvocdocument/CMakeFiles/keduvocdocument.dir/keduvocconjugation.o
make[2]: Leaving directory '/usr/src/RPM/BUILD/libkdeedu-15.12.1/BUILD-i586-alt-linux'
make[2]: Entering directory '/usr/src/RPM/BUILD/libkdeedu-15.12.1/BUILD-i586-alt-linux'
[ 39%] Building CXX object keduvocdocument/CMakeFiles/keduvocdocument.dir/keduvocwordtype.o
make[2]: Leaving directory '/usr/src/RPM/BUILD/libkdeedu-15.12.1/BUILD-i586-alt-linux'
make[2]: Entering directory '/usr/src/RPM/BUILD/libkdeedu-15.12.1/BUILD-i586-alt-linux'
[  3%] Building CXX object qtmmlwidget/CMakeFiles/qtmmlwidget.dir/qtmmlwidget.o
/usr/src/RPM/BUILD/libkdeedu-15.12.1/qtmmlwidget/qtmmlwidget.cpp: In member function 'void MmlDocument::insertOperator(MmlNode*, const QString&)':
/usr/src/RPM/BUILD/libkdeedu-15.12.1/qtmmlwidget/qtmmlwidget.cpp:3367:10: warning: variable 'ok' set but not used [-Wunused-but-set-variable]
     bool ok = insertChild(node, mo_node, 0);
          ^~
/usr/src/RPM/BUILD/libkdeedu-15.12.1/qtmmlwidget/qtmmlwidget.cpp: In member function 'MmlNode* MmlDocument::domToMml(const QDomNode&, bool*, QString*)':
/usr/src/RPM/BUILD/libkdeedu-15.12.1/qtmmlwidget/qtmmlwidget.cpp:3440:6: warning: this statement may fall through [-Wimplicit-fallthrough=]
      if (spec->child_spec != child_cnt) {
      ^~
/usr/src/RPM/BUILD/libkdeedu-15.12.1/qtmmlwidget/qtmmlwidget.cpp:3455:2: note: here
  case NodeSpec::ChildAny:
  ^~~~
make[2]: Leaving directory '/usr/src/RPM/BUILD/libkdeedu-15.12.1/BUILD-i586-alt-linux'
make[2]: Entering directory '/usr/src/RPM/BUILD/libkdeedu-15.12.1/BUILD-i586-alt-linux'
[ 50%] Linking CXX static library ../lib/libqtmmlwidget.a
make[2]: Leaving directory '/usr/src/RPM/BUILD/libkdeedu-15.12.1/BUILD-i586-alt-linux'
make[1]: Entering directory '/usr/src/RPM/BUILD/libkdeedu-15.12.1/BUILD-i586-alt-linux'
[ 50%] Built target qtmmlwidget
make[1]: Leaving directory '/usr/src/RPM/BUILD/libkdeedu-15.12.1/BUILD-i586-alt-linux'
make[2]: Entering directory '/usr/src/RPM/BUILD/libkdeedu-15.12.1/BUILD-i586-alt-linux'
[ 37%] Building CXX object keduvocdocument/CMakeFiles/keduvocdocument.dir/keduvocdeclension.o
make[2]: Leaving directory '/usr/src/RPM/BUILD/libkdeedu-15.12.1/BUILD-i586-alt-linux'
make[2]: Entering directory '/usr/src/RPM/BUILD/libkdeedu-15.12.1/BUILD-i586-alt-linux'
[ 42%] Building CXX object keduvocdocument/CMakeFiles/keduvocdocument_static.dir/keduvoctext.o
make[2]: Leaving directory '/usr/src/RPM/BUILD/libkdeedu-15.12.1/BUILD-i586-alt-linux'
make[2]: Entering directory '/usr/src/RPM/BUILD/libkdeedu-15.12.1/BUILD-i586-alt-linux'
[ 44%] Building CXX object keduvocdocument/CMakeFiles/keduvocdocument_static.dir/keduvocarticle.o
make[2]: Leaving directory '/usr/src/RPM/BUILD/libkdeedu-15.12.1/BUILD-i586-alt-linux'
make[2]: Entering directory '/usr/src/RPM/BUILD/libkdeedu-15.12.1/BUILD-i586-alt-linux'
[ 40%] Building CXX object keduvocdocument/CMakeFiles/keduvocdocument.dir/keduvockvtmlcompability.o
make[2]: Leaving directory '/usr/src/RPM/BUILD/libkdeedu-15.12.1/BUILD-i586-alt-linux'
make[2]: Entering directory '/usr/src/RPM/BUILD/libkdeedu-15.12.1/BUILD-i586-alt-linux'
[ 49%] Building CXX object keduvocdocument/CMakeFiles/keduvocdocument.dir/keduvoccsvwriter.o
make[2]: Leaving directory '/usr/src/RPM/BUILD/libkdeedu-15.12.1/BUILD-i586-alt-linux'
make[2]: Entering directory '/usr/src/RPM/BUILD/libkdeedu-15.12.1/BUILD-i586-alt-linux'
[ 57%] Building CXX object keduvocdocument/CMakeFiles/keduvocdocument_static.dir/keduvocwordtype.o
make[2]: Leaving directory '/usr/src/RPM/BUILD/libkdeedu-15.12.1/BUILD-i586-alt-linux'
make[2]: Entering directory '/usr/src/RPM/BUILD/libkdeedu-15.12.1/BUILD-i586-alt-linux'
[ 45%] Building CXX object keduvocdocument/CMakeFiles/keduvocdocument_static.dir/keduvocconjugation.o
make[2]: Leaving directory '/usr/src/RPM/BUILD/libkdeedu-15.12.1/BUILD-i586-alt-linux'
make[2]: Entering directory '/usr/src/RPM/BUILD/libkdeedu-15.12.1/BUILD-i586-alt-linux'
[ 52%] Building CXX object keduvocdocument/CMakeFiles/keduvocdocument_static.dir/keduvocpersonalpronoun.o
make[2]: Leaving directory '/usr/src/RPM/BUILD/libkdeedu-15.12.1/BUILD-i586-alt-linux'
make[2]: Entering directory '/usr/src/RPM/BUILD/libkdeedu-15.12.1/BUILD-i586-alt-linux'
[ 54%] Building CXX object keduvocdocument/CMakeFiles/keduvocdocument.dir/readerwriters/dummyreader.o
make[2]: Leaving directory '/usr/src/RPM/BUILD/libkdeedu-15.12.1/BUILD-i586-alt-linux'
make[2]: Entering directory '/usr/src/RPM/BUILD/libkdeedu-15.12.1/BUILD-i586-alt-linux'
[ 59%] Building CXX object keduvocdocument/CMakeFiles/keduvocdocument.dir/readerwriters/failedreader.o
make[2]: Leaving directory '/usr/src/RPM/BUILD/libkdeedu-15.12.1/BUILD-i586-alt-linux'
make[2]: Entering directory '/usr/src/RPM/BUILD/libkdeedu-15.12.1/BUILD-i586-alt-linux'
[ 47%] Building CXX object keduvocdocument/CMakeFiles/keduvocdocument.dir/keduvockvtml2writer.o
make[2]: Leaving directory '/usr/src/RPM/BUILD/libkdeedu-15.12.1/BUILD-i586-alt-linux'
make[2]: Entering directory '/usr/src/RPM/BUILD/libkdeedu-15.12.1/BUILD-i586-alt-linux'
[ 68%] Building CXX object keduvocdocument/CMakeFiles/keduvocdocument.dir/readerwriters/keduvoccsvreader.o
make[2]: Leaving directory '/usr/src/RPM/BUILD/libkdeedu-15.12.1/BUILD-i586-alt-linux'
make[2]: Entering directory '/usr/src/RPM/BUILD/libkdeedu-15.12.1/BUILD-i586-alt-linux'
[ 65%] Building CXX object keduvocdocument/CMakeFiles/keduvocdocument_static.dir/keduvoccsvwriter.o
make[2]: Leaving directory '/usr/src/RPM/BUILD/libkdeedu-15.12.1/BUILD-i586-alt-linux'
make[2]: Entering directory '/usr/src/RPM/BUILD/libkdeedu-15.12.1/BUILD-i586-alt-linux'
[ 55%] Building CXX object keduvocdocument/CMakeFiles/keduvocdocument_static.dir/keduvocdeclension.o
make[2]: Leaving directory '/usr/src/RPM/BUILD/libkdeedu-15.12.1/BUILD-i586-alt-linux'
make[2]: Entering directory '/usr/src/RPM/BUILD/libkdeedu-15.12.1/BUILD-i586-alt-linux'
[ 63%] Building CXX object keduvocdocument/CMakeFiles/keduvocdocument_static.dir/keduvockvtml2writer.o
make[2]: Leaving directory '/usr/src/RPM/BUILD/libkdeedu-15.12.1/BUILD-i586-alt-linux'
make[2]: Entering directory '/usr/src/RPM/BUILD/libkdeedu-15.12.1/BUILD-i586-alt-linux'
[ 62%] Building CXX object keduvocdocument/CMakeFiles/keduvocdocument_static.dir/keduvockvtmlcompability.o
make[2]: Leaving directory '/usr/src/RPM/BUILD/libkdeedu-15.12.1/BUILD-i586-alt-linux'
make[2]: Entering directory '/usr/src/RPM/BUILD/libkdeedu-15.12.1/BUILD-i586-alt-linux'
[ 70%] Building CXX object keduvocdocument/CMakeFiles/keduvocdocument.dir/readerwriters/keduvocpaukerreader.o
make[2]: Leaving directory '/usr/src/RPM/BUILD/libkdeedu-15.12.1/BUILD-i586-alt-linux'
make[2]: Entering directory '/usr/src/RPM/BUILD/libkdeedu-15.12.1/BUILD-i586-alt-linux'
[ 73%] Building CXX object keduvocdocument/CMakeFiles/keduvocdocument_static.dir/readerwriters/dummyreader.o
make[2]: Leaving directory '/usr/src/RPM/BUILD/libkdeedu-15.12.1/BUILD-i586-alt-linux'
make[2]: Entering directory '/usr/src/RPM/BUILD/libkdeedu-15.12.1/BUILD-i586-alt-linux'
[ 75%] Building CXX object keduvocdocument/CMakeFiles/keduvocdocument_static.dir/readerwriters/failedreader.o
make[2]: Leaving directory '/usr/src/RPM/BUILD/libkdeedu-15.12.1/BUILD-i586-alt-linux'
make[2]: Entering directory '/usr/src/RPM/BUILD/libkdeedu-15.12.1/BUILD-i586-alt-linux'
[ 60%] Building CXX object keduvocdocument/CMakeFiles/keduvocdocument.dir/readerwriters/keduvockvtmlreader.o
make[2]: Leaving directory '/usr/src/RPM/BUILD/libkdeedu-15.12.1/BUILD-i586-alt-linux'
make[2]: Entering directory '/usr/src/RPM/BUILD/libkdeedu-15.12.1/BUILD-i586-alt-linux'
[ 67%] Building CXX object keduvocdocument/CMakeFiles/keduvocdocument.dir/readerwriters/keduvockvtml2reader.o
make[2]: Leaving directory '/usr/src/RPM/BUILD/libkdeedu-15.12.1/BUILD-i586-alt-linux'
make[2]: Entering directory '/usr/src/RPM/BUILD/libkdeedu-15.12.1/BUILD-i586-alt-linux'
[ 72%] Building CXX object keduvocdocument/CMakeFiles/keduvocdocument.dir/readerwriters/keduvocvokabelnreader.o
make[2]: Leaving directory '/usr/src/RPM/BUILD/libkdeedu-15.12.1/BUILD-i586-alt-linux'
make[2]: Entering directory '/usr/src/RPM/BUILD/libkdeedu-15.12.1/BUILD-i586-alt-linux'
[ 80%] Building CXX object keduvocdocument/CMakeFiles/keduvocdocument.dir/readerwriters/keduvocwqlreader.o
make[2]: Leaving directory '/usr/src/RPM/BUILD/libkdeedu-15.12.1/BUILD-i586-alt-linux'
make[2]: Entering directory '/usr/src/RPM/BUILD/libkdeedu-15.12.1/BUILD-i586-alt-linux'
[ 78%] Building CXX object keduvocdocument/CMakeFiles/keduvocdocument_static.dir/readerwriters/keduvockvtml2reader.o
make[2]: Leaving directory '/usr/src/RPM/BUILD/libkdeedu-15.12.1/BUILD-i586-alt-linux'
make[2]: Entering directory '/usr/src/RPM/BUILD/libkdeedu-15.12.1/BUILD-i586-alt-linux'
[ 86%] Building CXX object keduvocdocument/CMakeFiles/keduvocdocument.dir/readerwriters/readermanager.o
make[2]: Leaving directory '/usr/src/RPM/BUILD/libkdeedu-15.12.1/BUILD-i586-alt-linux'
make[2]: Entering directory '/usr/src/RPM/BUILD/libkdeedu-15.12.1/BUILD-i586-alt-linux'
[ 83%] Building CXX object keduvocdocument/CMakeFiles/keduvocdocument_static.dir/readerwriters/keduvocpaukerreader.o
make[2]: Leaving directory '/usr/src/RPM/BUILD/libkdeedu-15.12.1/BUILD-i586-alt-linux'
make[2]: Entering directory '/usr/src/RPM/BUILD/libkdeedu-15.12.1/BUILD-i586-alt-linux'
[ 81%] Building CXX object keduvocdocument/CMakeFiles/keduvocdocument_static.dir/readerwriters/keduvoccsvreader.o
make[2]: Leaving directory '/usr/src/RPM/BUILD/libkdeedu-15.12.1/BUILD-i586-alt-linux'
make[2]: Entering directory '/usr/src/RPM/BUILD/libkdeedu-15.12.1/BUILD-i586-alt-linux'
[ 85%] Building CXX object keduvocdocument/CMakeFiles/keduvocdocument.dir/readerwriters/keduvocxdxfreader.o
make[2]: Leaving directory '/usr/src/RPM/BUILD/libkdeedu-15.12.1/BUILD-i586-alt-linux'
make[2]: Entering directory '/usr/src/RPM/BUILD/libkdeedu-15.12.1/BUILD-i586-alt-linux'
[ 91%] Building CXX object keduvocdocument/CMakeFiles/keduvocdocument_static.dir/readerwriters/keduvocwqlreader.o
make[2]: Leaving directory '/usr/src/RPM/BUILD/libkdeedu-15.12.1/BUILD-i586-alt-linux'
make[2]: Entering directory '/usr/src/RPM/BUILD/libkdeedu-15.12.1/BUILD-i586-alt-linux'
[ 93%] Building CXX object keduvocdocument/CMakeFiles/keduvocdocument_static.dir/readerwriters/keduvocxdxfreader.o
make[2]: Leaving directory '/usr/src/RPM/BUILD/libkdeedu-15.12.1/BUILD-i586-alt-linux'
make[2]: Entering directory '/usr/src/RPM/BUILD/libkdeedu-15.12.1/BUILD-i586-alt-linux'
[ 90%] Building CXX object keduvocdocument/CMakeFiles/keduvocdocument_static.dir/readerwriters/keduvocvokabelnreader.o
make[2]: Leaving directory '/usr/src/RPM/BUILD/libkdeedu-15.12.1/BUILD-i586-alt-linux'
make[2]: Entering directory '/usr/src/RPM/BUILD/libkdeedu-15.12.1/BUILD-i586-alt-linux'
[ 95%] Building CXX object keduvocdocument/CMakeFiles/keduvocdocument_static.dir/readerwriters/readermanager.o
make[2]: Leaving directory '/usr/src/RPM/BUILD/libkdeedu-15.12.1/BUILD-i586-alt-linux'
make[2]: Entering directory '/usr/src/RPM/BUILD/libkdeedu-15.12.1/BUILD-i586-alt-linux'
[ 77%] Building CXX object keduvocdocument/CMakeFiles/keduvocdocument_static.dir/readerwriters/keduvockvtmlreader.o
make[2]: Leaving directory '/usr/src/RPM/BUILD/libkdeedu-15.12.1/BUILD-i586-alt-linux'
make[2]: Entering directory '/usr/src/RPM/BUILD/libkdeedu-15.12.1/BUILD-i586-alt-linux'
[ 88%] Building CXX object keduvocdocument/CMakeFiles/keduvocdocument.dir/sharedkvtmlfiles.o
make[2]: Leaving directory '/usr/src/RPM/BUILD/libkdeedu-15.12.1/BUILD-i586-alt-linux'
make[2]: Entering directory '/usr/src/RPM/BUILD/libkdeedu-15.12.1/BUILD-i586-alt-linux'
[ 98%] Linking CXX shared library ../lib/libkeduvocdocument.so
make[2]: Leaving directory '/usr/src/RPM/BUILD/libkdeedu-15.12.1/BUILD-i586-alt-linux'
make[1]: Entering directory '/usr/src/RPM/BUILD/libkdeedu-15.12.1/BUILD-i586-alt-linux'
[ 98%] Built target keduvocdocument
make[1]: Leaving directory '/usr/src/RPM/BUILD/libkdeedu-15.12.1/BUILD-i586-alt-linux'
make[2]: Entering directory '/usr/src/RPM/BUILD/libkdeedu-15.12.1/BUILD-i586-alt-linux'
[ 96%] Building CXX object keduvocdocument/CMakeFiles/keduvocdocument_static.dir/sharedkvtmlfiles.o
make[2]: Leaving directory '/usr/src/RPM/BUILD/libkdeedu-15.12.1/BUILD-i586-alt-linux'
make[2]: Entering directory '/usr/src/RPM/BUILD/libkdeedu-15.12.1/BUILD-i586-alt-linux'
[100%] Linking CXX static library ../lib/libkeduvocdocument_static.a
make[2]: Leaving directory '/usr/src/RPM/BUILD/libkdeedu-15.12.1/BUILD-i586-alt-linux'
make[1]: Entering directory '/usr/src/RPM/BUILD/libkdeedu-15.12.1/BUILD-i586-alt-linux'
[100%] Built target keduvocdocument_static
make[1]: Leaving directory '/usr/src/RPM/BUILD/libkdeedu-15.12.1/BUILD-i586-alt-linux'
+ popd
~/RPM/BUILD/libkdeedu-15.12.1
+ exit 0
Executing(%install): /bin/sh -e /usr/src/tmp/rpm-tmp.43666
+ umask 022
+ /bin/mkdir -p /usr/src/RPM/BUILD
+ cd /usr/src/RPM/BUILD
+ /bin/chmod -Rf u+rwX -- /usr/src/tmp/libkdeedu4-buildroot
+ :
+ /bin/rm -rf -- /usr/src/tmp/libkdeedu4-buildroot
+ cd libkdeedu-15.12.1
+ __kde_install
+ make -C BUILD-i586-alt-linux DESTDIR=/usr/src/tmp/libkdeedu4-buildroot install
make: Entering directory '/usr/src/RPM/BUILD/libkdeedu-15.12.1/BUILD-i586-alt-linux'
make[1]: Entering directory '/usr/src/RPM/BUILD/libkdeedu-15.12.1/BUILD-i586-alt-linux'
make[2]: Entering directory '/usr/src/RPM/BUILD/libkdeedu-15.12.1/BUILD-i586-alt-linux'
make[2]: Leaving directory '/usr/src/RPM/BUILD/libkdeedu-15.12.1/BUILD-i586-alt-linux'
make[2]: Entering directory '/usr/src/RPM/BUILD/libkdeedu-15.12.1/BUILD-i586-alt-linux'
make[2]: Leaving directory '/usr/src/RPM/BUILD/libkdeedu-15.12.1/BUILD-i586-alt-linux'
[  0%] Built target keduvocdocument_static_automoc
make[2]: Entering directory '/usr/src/RPM/BUILD/libkdeedu-15.12.1/BUILD-i586-alt-linux'
make[2]: Leaving directory '/usr/src/RPM/BUILD/libkdeedu-15.12.1/BUILD-i586-alt-linux'
[ 47%] Built target keduvocdocument_static
make[2]: Entering directory '/usr/src/RPM/BUILD/libkdeedu-15.12.1/BUILD-i586-alt-linux'
make[2]: Leaving directory '/usr/src/RPM/BUILD/libkdeedu-15.12.1/BUILD-i586-alt-linux'
make[2]: Entering directory '/usr/src/RPM/BUILD/libkdeedu-15.12.1/BUILD-i586-alt-linux'
make[2]: Leaving directory '/usr/src/RPM/BUILD/libkdeedu-15.12.1/BUILD-i586-alt-linux'
[ 47%] Built target keduvocdocument_automoc
make[2]: Entering directory '/usr/src/RPM/BUILD/libkdeedu-15.12.1/BUILD-i586-alt-linux'
make[2]: Leaving directory '/usr/src/RPM/BUILD/libkdeedu-15.12.1/BUILD-i586-alt-linux'
[ 95%] Built target keduvocdocument
make[2]: Entering directory '/usr/src/RPM/BUILD/libkdeedu-15.12.1/BUILD-i586-alt-linux'
make[2]: Leaving directory '/usr/src/RPM/BUILD/libkdeedu-15.12.1/BUILD-i586-alt-linux'
make[2]: Entering directory '/usr/src/RPM/BUILD/libkdeedu-15.12.1/BUILD-i586-alt-linux'
make[2]: Leaving directory '/usr/src/RPM/BUILD/libkdeedu-15.12.1/BUILD-i586-alt-linux'
[ 95%] Built target qtmmlwidget_automoc
make[2]: Entering directory '/usr/src/RPM/BUILD/libkdeedu-15.12.1/BUILD-i586-alt-linux'
Scanning dependencies of target qtmmlwidget
make[2]: Leaving directory '/usr/src/RPM/BUILD/libkdeedu-15.12.1/BUILD-i586-alt-linux'
make[2]: Entering directory '/usr/src/RPM/BUILD/libkdeedu-15.12.1/BUILD-i586-alt-linux'
[ 96%] Building CXX object qtmmlwidget/CMakeFiles/qtmmlwidget.dir/qtmmlwidget_automoc.o
[ 98%] Linking CXX static library ../lib/libqtmmlwidget.a
make[2]: Leaving directory '/usr/src/RPM/BUILD/libkdeedu-15.12.1/BUILD-i586-alt-linux'
[100%] Built target qtmmlwidget
make[1]: Leaving directory '/usr/src/RPM/BUILD/libkdeedu-15.12.1/BUILD-i586-alt-linux'
Install the project...
-- Install configuration: "Release"
-- Installing: /usr/src/tmp/libkdeedu4-buildroot/usr/lib/cmake/libkdeedu/LibKdeEduConfig.cmake
-- Installing: /usr/src/tmp/libkdeedu4-buildroot/usr/lib/cmake/libkdeedu/LibKdeEduTargets.cmake
-- Installing: /usr/src/tmp/libkdeedu4-buildroot/usr/lib/cmake/libkdeedu/LibKdeEduTargets-release.cmake
-- Installing: /usr/src/tmp/libkdeedu4-buildroot/usr/lib/libkeduvocdocument.so.4.14.38
-- Installing: /usr/src/tmp/libkdeedu4-buildroot/usr/lib/libkeduvocdocument.so.4
-- Installing: /usr/src/tmp/libkdeedu4-buildroot/usr/lib/libkeduvocdocument.so
-- Installing: /usr/src/tmp/libkdeedu4-buildroot/usr/include/kde4/libkdeedu/libkeduvocdocument_export.h
-- Installing: /usr/src/tmp/libkdeedu4-buildroot/usr/include/kde4/libkdeedu/keduvocdocument.h
-- Installing: /usr/src/tmp/libkdeedu4-buildroot/usr/include/kde4/libkdeedu/keduvocidentifier.h
-- Installing: /usr/src/tmp/libkdeedu4-buildroot/usr/include/kde4/libkdeedu/keduvocexpression.h
-- Installing: /usr/src/tmp/libkdeedu4-buildroot/usr/include/kde4/libkdeedu/keduvoctext.h
-- Installing: /usr/src/tmp/libkdeedu4-buildroot/usr/include/kde4/libkdeedu/keduvocarticle.h
-- Installing: /usr/src/tmp/libkdeedu4-buildroot/usr/include/kde4/libkdeedu/keduvocconjugation.h
-- Installing: /usr/src/tmp/libkdeedu4-buildroot/usr/include/kde4/libkdeedu/keduvoclesson.h
-- Installing: /usr/src/tmp/libkdeedu4-buildroot/usr/include/kde4/libkdeedu/keduvocleitnerbox.h
-- Installing: /usr/src/tmp/libkdeedu4-buildroot/usr/include/kde4/libkdeedu/keduvoccontainer.h
-- Installing: /usr/src/tmp/libkdeedu4-buildroot/usr/include/kde4/libkdeedu/keduvocwordflags.h
-- Installing: /usr/src/tmp/libkdeedu4-buildroot/usr/include/kde4/libkdeedu/keduvocmultiplechoice.h
-- Installing: /usr/src/tmp/libkdeedu4-buildroot/usr/include/kde4/libkdeedu/keduvoctranslation.h
-- Installing: /usr/src/tmp/libkdeedu4-buildroot/usr/include/kde4/libkdeedu/keduvocwordtype.h
-- Installing: /usr/src/tmp/libkdeedu4-buildroot/usr/include/kde4/libkdeedu/keduvocpersonalpronoun.h
-- Installing: /usr/src/tmp/libkdeedu4-buildroot/usr/include/kde4/libkdeedu/sharedkvtmlfiles.h
-- Installing: /usr/src/tmp/libkdeedu4-buildroot/usr/include/kde4/libkdeedu/keduvocdeclension.h
-- Installing: /usr/src/tmp/libkdeedu4-buildroot/usr/include/kde4/libkdeedu/keduvockvtml2writer.h
-- Installing: /usr/src/tmp/libkdeedu4-buildroot/usr/lib/libqtmmlwidget.a
-- Installing: /usr/src/tmp/libkdeedu4-buildroot/usr/include/kde4/libkdeedu/qtmml/QtMmlDocument
-- Installing: /usr/src/tmp/libkdeedu4-buildroot/usr/include/kde4/libkdeedu/qtmml/QtMmlWidget
-- Installing: /usr/src/tmp/libkdeedu4-buildroot/usr/include/kde4/libkdeedu/qtmml/qtmmlwidget.h
make: Leaving directory '/usr/src/RPM/BUILD/libkdeedu-15.12.1/BUILD-i586-alt-linux'
+ mkdir -p /usr/src/tmp/libkdeedu4-buildroot//usr/lib/kde4/devel
+ pushd /usr/src/tmp/libkdeedu4-buildroot//usr/lib
~/tmp/libkdeedu4-buildroot/usr/lib ~/RPM/BUILD/libkdeedu-15.12.1
+ for l in lib*.so
+ '[' -L libkeduvocdocument.so ']'
++ readlink libkeduvocdocument.so
+ f=libkeduvocdocument.so.4
++ relative /usr/src/tmp/libkdeedu4-buildroot//usr/lib/libkeduvocdocument.so.4 /usr/src/tmp/libkdeedu4-buildroot//usr/lib/kde4/devel/libkeduvocdocument.so.4
+ ln -sf ../../libkeduvocdocument.so.4 /usr/src/tmp/libkdeedu4-buildroot//usr/lib/kde4/devel/libkeduvocdocument.so
+ rm -f libkeduvocdocument.so
+ popd
~/RPM/BUILD/libkdeedu-15.12.1
+ '[' -d /usr/src/tmp/libkdeedu4-buildroot//usr/lib/kconf_update_bin ']'
+ '[' -d /usr/src/tmp/libkdeedu4-buildroot//usr/share/kde4/share ']'
+ '[' -d /usr/src/tmp/libkdeedu4-buildroot//usr/share/kde4/bin ']'
+ '[' -d /usr/src/tmp/libkdeedu4-buildroot//etc/xdg/menus ']'
+ '[' -d /usr/src/tmp/libkdeedu4-buildroot//usr/share/kde4/apps/cmake/modules/ ']'
+ /usr/lib/rpm/brp-alt
Cleaning files in /usr/src/tmp/libkdeedu4-buildroot (auto)
mode of './usr/lib/libkeduvocdocument.so.4.14.38' changed from 0755 (rwxr-xr-x) to 0644 (rw-r--r--)
Verifying and fixing files in /usr/src/tmp/libkdeedu4-buildroot (binconfig,pkgconfig,libtool,desktop)
Checking contents of files in /usr/src/tmp/libkdeedu4-buildroot/ (default)
Compressing files in /usr/src/tmp/libkdeedu4-buildroot (auto)
Adjusting library links in /usr/src/tmp/libkdeedu4-buildroot
./usr/lib:
	libkeduvocdocument.so.4 -> libkeduvocdocument.so.4.14.38
Verifying ELF objects in /usr/src/tmp/libkdeedu4-buildroot (arch=normal,fhs=normal,lfs=relaxed,lint=relaxed,rpath=normal,stack=normal,textrel=normal,unresolved=normal)
Hardlinking identical .pyc and .opt-?.pyc files
Hardlinking identical .pyc and .pyo files
Processing files: libkdeedu4-15.12.1-alt1
Executing(%doc): /bin/sh -e /usr/src/tmp/rpm-tmp.66216
+ umask 022
+ /bin/mkdir -p /usr/src/RPM/BUILD
+ cd /usr/src/RPM/BUILD
+ cd libkdeedu-15.12.1
+ DOCDIR=/usr/src/tmp/libkdeedu4-buildroot/usr/share/doc/libkdeedu4-15.12.1
+ export DOCDIR
+ rm -rf /usr/src/tmp/libkdeedu4-buildroot/usr/share/doc/libkdeedu4-15.12.1
+ /bin/mkdir -p /usr/src/tmp/libkdeedu4-buildroot/usr/share/doc/libkdeedu4-15.12.1
+ cp -prL README AUTHORS /usr/src/tmp/libkdeedu4-buildroot/usr/share/doc/libkdeedu4-15.12.1
+ chmod -R go-w /usr/src/tmp/libkdeedu4-buildroot/usr/share/doc/libkdeedu4-15.12.1
+ chmod -R a+rX /usr/src/tmp/libkdeedu4-buildroot/usr/share/doc/libkdeedu4-15.12.1
+ exit 0
Finding Provides (using /usr/lib/rpm/find-provides)
Executing: /bin/sh -e /usr/src/tmp/rpm-tmp.snDatN
find-provides: running scripts (alternatives,debuginfo,gir,lib,pam,perl,pkgconfig,python,python3,shell,typelib)
Finding Requires (using /usr/lib/rpm/find-requires)
Executing: /bin/sh -e /usr/src/tmp/rpm-tmp.0FEQos
find-requires: running scripts (cpp,debuginfo,files,gir-js,gir-python,gir,lib,pam,perl,pkgconfig,pkgconfiglib,python,python3,rpmlib,shebang,shell,static,symlinks,typelib)
Provides: libkeduvocdocument4 = 15.12.1-alt1, kde4edu-core = 15.12.1-alt1, libkeduvocdocument.so.4 = set:mdZjQ7gatim5m1EOAkHe3jhwVssAGWbA0SOAcKXWvRjoXxeDfZfWeq1pWlSupZojvJxUZE0w6oX11aYaJfSZdaooUMaduEg79ZAKZpwj3hOs77Gi53ZCl89KCN4LcsWciyjZa59F8pTdmuOsEKYmh7DF301ZDs0eUpHd1m32FMHFKG3AnTX0BYRiXzx9uobDommGpXMZ34OlnxIEYzCMQo1h0pxDob05LPVtzg2dPZCLL7150JFG3YhuybCIXpEkm8cjhxZi2J3xblznjXBY2NDL8ZGKrD8sXCuMdi6cP0ElYCtsxhAWDbiji2FQ2WrZnGDktaK2Dx3Zwn9PEbfNQux6ggKadpaGsDFtMjnL3Zv3Ey4g8TafiRb2OtZ2bir6DZt59dWXe2CVKSTqkkaUgqvqU7baGkWDbEoJge4GZuAZ2Z8QcPCjV5zPDhJgZiq475ggCbhtlcuZ9Yw9R4o0RZ8CjwZswT9BPZ0dTxA3BML0tvZzMPRoATrSn1XjY75FiFjc48SeU7s2lEnNAW9gcpuS8bO0rc4I7D2kmPP60J9B4Ysq9Jm6cIUPo2riH3p3uQ0T93FywwOW3M3EsksqfMBVw05vnzoQB85jgbRDsTHS1Z7qeLfmEl0KbQKRblkzLXyuKHelYz130k0V5E9UJ9le4gvfbfxk44AygvmAwEEpX52cbMZkZthPMRvad2xMjgn7ET9mO3yfHe2Wn
Requires: libQtCore.so.4 >= set:phXvZ5FZ2sr0Lr1ddKpCWTKgBORVBz3ACLH1ZDqoumwaGL6dnOqV9qgqZaFibf5xtx22zzkwi2iKjxBFEb3wSfmS8eSFMfvcaasTkPaozFatkVHUtdRM0g6V06DmxMRVZ9YlrR3pbUOk6ecvzTq2pOvBVDhEzCaSdyw7CZ3ss0MbTdZ5BKc0dghSnZj5Z2e0kiRTiIQkX5F66pq4DtYepdMb1cArjpDBJ0hFRhvMtQPEExPqJwJi0pggzdhX0iw8l8obnhOLKGb0oZcEriI9JQMwL41IzgcAKpfFF3Z7TTbGrarf3ZhgbKEVtn0mVAnbg0XrCtiR8A08UIgl25Wq4r3e6eKIpExLexnqAn70EoYxR7igD6BfjfUVL6OAq3wwhpdjGL5MgZwQEv, libQtXml.so.4 >= set:mglXG0DYmDfhj5OniahGZwZpffCEbbbuuBNdhRNJX2Cpr96YcP15oScP14v0Ukpm7BlUaQ8SwTm9qosXT2Fqm8H3lgHL3YF1qtJnEx2ICZ143, libc.so.6(GLIBC_2.0), libc.so.6(GLIBC_2.1.3), libkdecore.so.5 >= set:qkZsrwRNrO1JQCXfRUwiK4ZvV3paNbrj3v1AsJQ2iFRN1OvoV9thu8ccIOewtZyQITWmZehCYnIeJ0xR6Tpg2TsnQmOoC29dpUixyG8Zh3sIXX36GUPW6Njvv7tY7, libkio.so.5 >= set:pmzbAEquMQNnhPJL, libstdc++.so.6(CXXABI_1.3), libstdc++.so.6(CXXABI_1.3.9), libstdc++.so.6(GLIBCXX_3.4), rtld(GNU_HASH)
Requires(rpmlib): rpmlib(SetVersions)
Obsoletes: libkeduvocdocument4 < 15.12.1-alt1, kde4edu-core < 15.12.1-alt1
Finding debuginfo files (using /usr/lib/rpm/find-debuginfo-files)
Executing: /bin/sh -e /usr/src/tmp/rpm-tmp.1djuZZ
Creating libkdeedu4-debuginfo package
Processing files: libkdeedu4-devel-15.12.1-alt1
Finding Provides (using /usr/lib/rpm/find-provides)
Executing: /bin/sh -e /usr/src/tmp/rpm-tmp.KLbmvs
find-provides: running scripts (alternatives,debuginfo,gir,lib,pam,perl,pkgconfig,python,python3,shell,typelib)
Finding Requires (using /usr/lib/rpm/find-requires)
Executing: /bin/sh -e /usr/src/tmp/rpm-tmp.rt3ybI
find-requires: running scripts (cpp,debuginfo,files,gir-js,gir-python,gir,lib,pam,perl,pkgconfig,pkgconfiglib,python,python3,rpmlib,shebang,shell,static,symlinks,typelib)
/usr/src/tmp/libkdeedu4-buildroot/usr/include/kde4/libkdeedu/keduvoctext.h:18:10: fatal error: QtCore/QDateTime: No such file or directory
 #include <QtCore/QDateTime>
          ^~~~~~~~~~~~~~~~~~
compilation terminated.
cpp.req: /usr/src/tmp/libkdeedu4-buildroot/usr/include/kde4/libkdeedu/keduvoctext.h: cpp failed, trying c++ mode
In file included from /usr/src/tmp/libkdeedu4-buildroot/usr/include/kde4/libkdeedu/libkeduvocdocument_export.h:24,
                 from /usr/src/tmp/libkdeedu4-buildroot/usr/include/kde4/libkdeedu/keduvoctext.h:17:
/usr/include/kde4/kdemacros.h:162:11: fatal error: QtCore/qglobal.h: No such file or directory
 # include <QtCore/qglobal.h>
           ^~~~~~~~~~~~~~~~~~
compilation terminated.
cpp.req: WARNING: /usr/src/tmp/libkdeedu4-buildroot/usr/include/kde4/libkdeedu/keduvoctext.h: cpp failed
In file included from /usr/src/tmp/libkdeedu4-buildroot/usr/include/kde4/libkdeedu/keduvoccontainer.h:22,
                 from /usr/src/tmp/libkdeedu4-buildroot/usr/include/kde4/libkdeedu/keduvoclesson.h:22:
/usr/src/tmp/libkdeedu4-buildroot/usr/include/kde4/libkdeedu/keduvoctext.h:18:10: fatal error: QtCore/QDateTime: No such file or directory
 #include <QtCore/QDateTime>
          ^~~~~~~~~~~~~~~~~~
compilation terminated.
cpp.req: /usr/src/tmp/libkdeedu4-buildroot/usr/include/kde4/libkdeedu/keduvoclesson.h: cpp failed, trying c++ mode
In file included from /usr/src/tmp/libkdeedu4-buildroot/usr/include/kde4/libkdeedu/libkeduvocdocument_export.h:24,
                 from /usr/src/tmp/libkdeedu4-buildroot/usr/include/kde4/libkdeedu/keduvoclesson.h:20:
/usr/include/kde4/kdemacros.h:162:11: fatal error: QtCore/qglobal.h: No such file or directory
 # include <QtCore/qglobal.h>
           ^~~~~~~~~~~~~~~~~~
compilation terminated.
cpp.req: WARNING: /usr/src/tmp/libkdeedu4-buildroot/usr/include/kde4/libkdeedu/keduvoclesson.h: cpp failed
/usr/src/tmp/libkdeedu4-buildroot/usr/include/kde4/libkdeedu/keduvocarticle.h:23:10: fatal error: QtCore/QStringList: No such file or directory
 #include <QtCore/QStringList>
          ^~~~~~~~~~~~~~~~~~~~
compilation terminated.
cpp.req: /usr/src/tmp/libkdeedu4-buildroot/usr/include/kde4/libkdeedu/keduvocarticle.h: cpp failed, trying c++ mode
In file included from /usr/src/tmp/libkdeedu4-buildroot/usr/include/kde4/libkdeedu/libkeduvocdocument_export.h:24,
                 from /usr/src/tmp/libkdeedu4-buildroot/usr/include/kde4/libkdeedu/keduvocarticle.h:21:
/usr/include/kde4/kdemacros.h:162:11: fatal error: QtCore/qglobal.h: No such file or directory
 # include <QtCore/qglobal.h>
           ^~~~~~~~~~~~~~~~~~
compilation terminated.
cpp.req: WARNING: /usr/src/tmp/libkdeedu4-buildroot/usr/include/kde4/libkdeedu/keduvocarticle.h: cpp failed
In file included from /usr/src/tmp/libkdeedu4-buildroot/usr/include/kde4/libkdeedu/keduvocconjugation.h:29,
                 from /usr/src/tmp/libkdeedu4-buildroot/usr/include/kde4/libkdeedu/keduvocpersonalpronoun.h:19,
                 from /usr/src/tmp/libkdeedu4-buildroot/usr/include/kde4/libkdeedu/keduvocidentifier.h:18,
                 from /usr/src/tmp/libkdeedu4-buildroot/usr/include/kde4/libkdeedu/keduvocdocument.h:24:
/usr/src/tmp/libkdeedu4-buildroot/usr/include/kde4/libkdeedu/keduvoctext.h:18:10: fatal error: QtCore/QDateTime: No such file or directory
 #include <QtCore/QDateTime>
          ^~~~~~~~~~~~~~~~~~
compilation terminated.
cpp.req: /usr/src/tmp/libkdeedu4-buildroot/usr/include/kde4/libkdeedu/keduvocdocument.h: cpp failed, trying c++ mode
In file included from /usr/src/tmp/libkdeedu4-buildroot/usr/include/kde4/libkdeedu/libkeduvocdocument_export.h:24,
                 from /usr/src/tmp/libkdeedu4-buildroot/usr/include/kde4/libkdeedu/keduvocdocument.h:22:
/usr/include/kde4/kdemacros.h:162:11: fatal error: QtCore/qglobal.h: No such file or directory
 # include <QtCore/qglobal.h>
           ^~~~~~~~~~~~~~~~~~
compilation terminated.
cpp.req: WARNING: /usr/src/tmp/libkdeedu4-buildroot/usr/include/kde4/libkdeedu/keduvocdocument.h: cpp failed
In file included from /usr/src/tmp/libkdeedu4-buildroot/usr/include/kde4/libkdeedu/keduvoccontainer.h:22,
                 from /usr/src/tmp/libkdeedu4-buildroot/usr/include/kde4/libkdeedu/keduvocwordtype.h:22:
/usr/src/tmp/libkdeedu4-buildroot/usr/include/kde4/libkdeedu/keduvoctext.h:18:10: fatal error: QtCore/QDateTime: No such file or directory
 #include <QtCore/QDateTime>
          ^~~~~~~~~~~~~~~~~~
compilation terminated.
cpp.req: /usr/src/tmp/libkdeedu4-buildroot/usr/include/kde4/libkdeedu/keduvocwordtype.h: cpp failed, trying c++ mode
In file included from /usr/src/tmp/libkdeedu4-buildroot/usr/include/kde4/libkdeedu/libkeduvocdocument_export.h:24,
                 from /usr/src/tmp/libkdeedu4-buildroot/usr/include/kde4/libkdeedu/keduvocwordtype.h:20:
/usr/include/kde4/kdemacros.h:162:11: fatal error: QtCore/qglobal.h: No such file or directory
 # include <QtCore/qglobal.h>
           ^~~~~~~~~~~~~~~~~~
compilation terminated.
cpp.req: WARNING: /usr/src/tmp/libkdeedu4-buildroot/usr/include/kde4/libkdeedu/keduvocwordtype.h: cpp failed
In file included from /usr/src/tmp/libkdeedu4-buildroot/usr/include/kde4/libkdeedu/keduvoccontainer.h:22:
/usr/src/tmp/libkdeedu4-buildroot/usr/include/kde4/libkdeedu/keduvoctext.h:18:10: fatal error: QtCore/QDateTime: No such file or directory
 #include <QtCore/QDateTime>
          ^~~~~~~~~~~~~~~~~~
compilation terminated.
cpp.req: /usr/src/tmp/libkdeedu4-buildroot/usr/include/kde4/libkdeedu/keduvoccontainer.h: cpp failed, trying c++ mode
In file included from /usr/src/tmp/libkdeedu4-buildroot/usr/include/kde4/libkdeedu/libkeduvocdocument_export.h:24,
                 from /usr/src/tmp/libkdeedu4-buildroot/usr/include/kde4/libkdeedu/keduvoccontainer.h:20:
/usr/include/kde4/kdemacros.h:162:11: fatal error: QtCore/qglobal.h: No such file or directory
 # include <QtCore/qglobal.h>
           ^~~~~~~~~~~~~~~~~~
compilation terminated.
cpp.req: WARNING: /usr/src/tmp/libkdeedu4-buildroot/usr/include/kde4/libkdeedu/keduvoccontainer.h: cpp failed
/usr/src/tmp/libkdeedu4-buildroot/usr/include/kde4/libkdeedu/keduvocwordflags.h:17:10: fatal error: QFlags: No such file or directory
 #include <QFlags>
          ^~~~~~~~
compilation terminated.
cpp.req: /usr/src/tmp/libkdeedu4-buildroot/usr/include/kde4/libkdeedu/keduvocwordflags.h: cpp failed, trying c++ mode
/usr/src/tmp/libkdeedu4-buildroot/usr/include/kde4/libkdeedu/keduvocwordflags.h:17:10: fatal error: QFlags: No such file or directory
 #include <QFlags>
          ^~~~~~~~
compilation terminated.
cpp.req: WARNING: /usr/src/tmp/libkdeedu4-buildroot/usr/include/kde4/libkdeedu/keduvocwordflags.h: cpp failed
/usr/src/tmp/libkdeedu4-buildroot/usr/include/kde4/libkdeedu/sharedkvtmlfiles.h:21:10: fatal error: QtCore/QStringList: No such file or directory
 #include <QtCore/QStringList>
          ^~~~~~~~~~~~~~~~~~~~
compilation terminated.
cpp.req: /usr/src/tmp/libkdeedu4-buildroot/usr/include/kde4/libkdeedu/sharedkvtmlfiles.h: cpp failed, trying c++ mode
In file included from /usr/src/tmp/libkdeedu4-buildroot/usr/include/kde4/libkdeedu/libkeduvocdocument_export.h:24,
                 from /usr/src/tmp/libkdeedu4-buildroot/usr/include/kde4/libkdeedu/sharedkvtmlfiles.h:19:
/usr/include/kde4/kdemacros.h:162:11: fatal error: QtCore/qglobal.h: No such file or directory
 # include <QtCore/qglobal.h>
           ^~~~~~~~~~~~~~~~~~
compilation terminated.
cpp.req: WARNING: /usr/src/tmp/libkdeedu4-buildroot/usr/include/kde4/libkdeedu/sharedkvtmlfiles.h: cpp failed
In file included from /usr/src/tmp/libkdeedu4-buildroot/usr/include/kde4/libkdeedu/keduvocdeclension.h:28:
/usr/src/tmp/libkdeedu4-buildroot/usr/include/kde4/libkdeedu/keduvoctext.h:18:10: fatal error: QtCore/QDateTime: No such file or directory
 #include <QtCore/QDateTime>
          ^~~~~~~~~~~~~~~~~~
compilation terminated.
cpp.req: /usr/src/tmp/libkdeedu4-buildroot/usr/include/kde4/libkdeedu/keduvocdeclension.h: cpp failed, trying c++ mode
In file included from /usr/src/tmp/libkdeedu4-buildroot/usr/include/kde4/libkdeedu/libkeduvocdocument_export.h:24,
                 from /usr/src/tmp/libkdeedu4-buildroot/usr/include/kde4/libkdeedu/keduvocdeclension.h:26:
/usr/include/kde4/kdemacros.h:162:11: fatal error: QtCore/qglobal.h: No such file or directory
 # include <QtCore/qglobal.h>
           ^~~~~~~~~~~~~~~~~~
compilation terminated.
cpp.req: WARNING: /usr/src/tmp/libkdeedu4-buildroot/usr/include/kde4/libkdeedu/keduvocdeclension.h: cpp failed
/usr/src/tmp/libkdeedu4-buildroot/usr/include/kde4/libkdeedu/keduvocexpression.h:24:10: fatal error: QtCore/QDateTime: No such file or directory
 #include <QtCore/QDateTime>
          ^~~~~~~~~~~~~~~~~~
compilation terminated.
cpp.req: /usr/src/tmp/libkdeedu4-buildroot/usr/include/kde4/libkdeedu/keduvocexpression.h: cpp failed, trying c++ mode
In file included from /usr/src/tmp/libkdeedu4-buildroot/usr/include/kde4/libkdeedu/libkeduvocdocument_export.h:24,
                 from /usr/src/tmp/libkdeedu4-buildroot/usr/include/kde4/libkdeedu/keduvocexpression.h:22:
/usr/include/kde4/kdemacros.h:162:11: fatal error: QtCore/qglobal.h: No such file or directory
 # include <QtCore/qglobal.h>
           ^~~~~~~~~~~~~~~~~~
compilation terminated.
cpp.req: WARNING: /usr/src/tmp/libkdeedu4-buildroot/usr/include/kde4/libkdeedu/keduvocexpression.h: cpp failed
In file included from /usr/src/tmp/libkdeedu4-buildroot/usr/include/kde4/libkdeedu/keduvocconjugation.h:29,
                 from /usr/src/tmp/libkdeedu4-buildroot/usr/include/kde4/libkdeedu/keduvocpersonalpronoun.h:19,
                 from /usr/src/tmp/libkdeedu4-buildroot/usr/include/kde4/libkdeedu/keduvocidentifier.h:18:
/usr/src/tmp/libkdeedu4-buildroot/usr/include/kde4/libkdeedu/keduvoctext.h:18:10: fatal error: QtCore/QDateTime: No such file or directory
 #include <QtCore/QDateTime>
          ^~~~~~~~~~~~~~~~~~
compilation terminated.
cpp.req: /usr/src/tmp/libkdeedu4-buildroot/usr/include/kde4/libkdeedu/keduvocidentifier.h: cpp failed, trying c++ mode
In file included from /usr/src/tmp/libkdeedu4-buildroot/usr/include/kde4/libkdeedu/libkeduvocdocument_export.h:24,
                 from /usr/src/tmp/libkdeedu4-buildroot/usr/include/kde4/libkdeedu/keduvocidentifier.h:16:
/usr/include/kde4/kdemacros.h:162:11: fatal error: QtCore/qglobal.h: No such file or directory
 # include <QtCore/qglobal.h>
           ^~~~~~~~~~~~~~~~~~
compilation terminated.
cpp.req: WARNING: /usr/src/tmp/libkdeedu4-buildroot/usr/include/kde4/libkdeedu/keduvocidentifier.h: cpp failed
In file included from /usr/src/tmp/libkdeedu4-buildroot/usr/include/kde4/libkdeedu/keduvoccontainer.h:22,
                 from /usr/src/tmp/libkdeedu4-buildroot/usr/include/kde4/libkdeedu/keduvocleitnerbox.h:19:
/usr/src/tmp/libkdeedu4-buildroot/usr/include/kde4/libkdeedu/keduvoctext.h:18:10: fatal error: QtCore/QDateTime: No such file or directory
 #include <QtCore/QDateTime>
          ^~~~~~~~~~~~~~~~~~
compilation terminated.
cpp.req: /usr/src/tmp/libkdeedu4-buildroot/usr/include/kde4/libkdeedu/keduvocleitnerbox.h: cpp failed, trying c++ mode
In file included from /usr/src/tmp/libkdeedu4-buildroot/usr/include/kde4/libkdeedu/libkeduvocdocument_export.h:24,
                 from /usr/src/tmp/libkdeedu4-buildroot/usr/include/kde4/libkdeedu/keduvocleitnerbox.h:17:
/usr/include/kde4/kdemacros.h:162:11: fatal error: QtCore/qglobal.h: No such file or directory
 # include <QtCore/qglobal.h>
           ^~~~~~~~~~~~~~~~~~
compilation terminated.
cpp.req: WARNING: /usr/src/tmp/libkdeedu4-buildroot/usr/include/kde4/libkdeedu/keduvocleitnerbox.h: cpp failed
In file included from /usr/src/tmp/libkdeedu4-buildroot/usr/include/kde4/libkdeedu/keduvocconjugation.h:29:
/usr/src/tmp/libkdeedu4-buildroot/usr/include/kde4/libkdeedu/keduvoctext.h:18:10: fatal error: QtCore/QDateTime: No such file or directory
 #include <QtCore/QDateTime>
          ^~~~~~~~~~~~~~~~~~
compilation terminated.
cpp.req: /usr/src/tmp/libkdeedu4-buildroot/usr/include/kde4/libkdeedu/keduvocconjugation.h: cpp failed, trying c++ mode
In file included from /usr/src/tmp/libkdeedu4-buildroot/usr/include/kde4/libkdeedu/libkeduvocdocument_export.h:24,
                 from /usr/src/tmp/libkdeedu4-buildroot/usr/include/kde4/libkdeedu/keduvocconjugation.h:28:
/usr/include/kde4/kdemacros.h:162:11: fatal error: QtCore/qglobal.h: No such file or directory
 # include <QtCore/qglobal.h>
           ^~~~~~~~~~~~~~~~~~
compilation terminated.
cpp.req: WARNING: /usr/src/tmp/libkdeedu4-buildroot/usr/include/kde4/libkdeedu/keduvocconjugation.h: cpp failed
In file included from /usr/src/tmp/libkdeedu4-buildroot/usr/include/kde4/libkdeedu/keduvocconjugation.h:29,
                 from /usr/src/tmp/libkdeedu4-buildroot/usr/include/kde4/libkdeedu/keduvoctranslation.h:21:
/usr/src/tmp/libkdeedu4-buildroot/usr/include/kde4/libkdeedu/keduvoctext.h:18:10: fatal error: QtCore/QDateTime: No such file or directory
 #include <QtCore/QDateTime>
          ^~~~~~~~~~~~~~~~~~
compilation terminated.
cpp.req: /usr/src/tmp/libkdeedu4-buildroot/usr/include/kde4/libkdeedu/keduvoctranslation.h: cpp failed, trying c++ mode
In file included from /usr/src/tmp/libkdeedu4-buildroot/usr/include/kde4/libkdeedu/libkeduvocdocument_export.h:24,
                 from /usr/src/tmp/libkdeedu4-buildroot/usr/include/kde4/libkdeedu/keduvoctranslation.h:20:
/usr/include/kde4/kdemacros.h:162:11: fatal error: QtCore/qglobal.h: No such file or directory
 # include <QtCore/qglobal.h>
           ^~~~~~~~~~~~~~~~~~
compilation terminated.
cpp.req: WARNING: /usr/src/tmp/libkdeedu4-buildroot/usr/include/kde4/libkdeedu/keduvoctranslation.h: cpp failed
/usr/src/tmp/libkdeedu4-buildroot/usr/include/kde4/libkdeedu/keduvockvtml2writer.h:20:10: fatal error: QtXml/QDomDocument: No such file or directory
 #include <QtXml/QDomDocument>
          ^~~~~~~~~~~~~~~~~~~~
compilation terminated.
cpp.req: /usr/src/tmp/libkdeedu4-buildroot/usr/include/kde4/libkdeedu/keduvockvtml2writer.h: cpp failed, trying c++ mode
/usr/src/tmp/libkdeedu4-buildroot/usr/include/kde4/libkdeedu/keduvockvtml2writer.h:20:10: fatal error: QtXml/QDomDocument: No such file or directory
 #include <QtXml/QDomDocument>
          ^~~~~~~~~~~~~~~~~~~~
compilation terminated.
cpp.req: WARNING: /usr/src/tmp/libkdeedu4-buildroot/usr/include/kde4/libkdeedu/keduvockvtml2writer.h: cpp failed
/usr/src/tmp/libkdeedu4-buildroot/usr/include/kde4/libkdeedu/keduvocmultiplechoice.h:32:10: fatal error: QtCore/QStringList: No such file or directory
 #include <QtCore/QStringList>
          ^~~~~~~~~~~~~~~~~~~~
compilation terminated.
cpp.req: /usr/src/tmp/libkdeedu4-buildroot/usr/include/kde4/libkdeedu/keduvocmultiplechoice.h: cpp failed, trying c++ mode
In file included from /usr/src/tmp/libkdeedu4-buildroot/usr/include/kde4/libkdeedu/libkeduvocdocument_export.h:24,
                 from /usr/src/tmp/libkdeedu4-buildroot/usr/include/kde4/libkdeedu/keduvocmultiplechoice.h:30:
/usr/include/kde4/kdemacros.h:162:11: fatal error: QtCore/qglobal.h: No such file or directory
 # include <QtCore/qglobal.h>
           ^~~~~~~~~~~~~~~~~~
compilation terminated.
cpp.req: WARNING: /usr/src/tmp/libkdeedu4-buildroot/usr/include/kde4/libkdeedu/keduvocmultiplechoice.h: cpp failed
In file included from /usr/src/tmp/libkdeedu4-buildroot/usr/include/kde4/libkdeedu/keduvocconjugation.h:29,
                 from /usr/src/tmp/libkdeedu4-buildroot/usr/include/kde4/libkdeedu/keduvocpersonalpronoun.h:19:
/usr/src/tmp/libkdeedu4-buildroot/usr/include/kde4/libkdeedu/keduvoctext.h:18:10: fatal error: QtCore/QDateTime: No such file or directory
 #include <QtCore/QDateTime>
          ^~~~~~~~~~~~~~~~~~
compilation terminated.
cpp.req: /usr/src/tmp/libkdeedu4-buildroot/usr/include/kde4/libkdeedu/keduvocpersonalpronoun.h: cpp failed, trying c++ mode
In file included from /usr/src/tmp/libkdeedu4-buildroot/usr/include/kde4/libkdeedu/libkeduvocdocument_export.h:24,
                 from /usr/src/tmp/libkdeedu4-buildroot/usr/include/kde4/libkdeedu/keduvocpersonalpronoun.h:18:
/usr/include/kde4/kdemacros.h:162:11: fatal error: QtCore/qglobal.h: No such file or directory
 # include <QtCore/qglobal.h>
           ^~~~~~~~~~~~~~~~~~
compilation terminated.
cpp.req: WARNING: /usr/src/tmp/libkdeedu4-buildroot/usr/include/kde4/libkdeedu/keduvocpersonalpronoun.h: cpp failed
/usr/src/tmp/libkdeedu4-buildroot/usr/include/kde4/libkdeedu/qtmml/qtmmlwidget.h:50:10: fatal error: QtGui/QFrame: No such file or directory
 #include <QtGui/QFrame>
          ^~~~~~~~~~~~~~
compilation terminated.
cpp.req: /usr/src/tmp/libkdeedu4-buildroot/usr/include/kde4/libkdeedu/qtmml/qtmmlwidget.h: cpp failed, trying c++ mode
/usr/src/tmp/libkdeedu4-buildroot/usr/include/kde4/libkdeedu/qtmml/qtmmlwidget.h:50:10: fatal error: QtGui/QFrame: No such file or directory
 #include <QtGui/QFrame>
          ^~~~~~~~~~~~~~
compilation terminated.
cpp.req: WARNING: /usr/src/tmp/libkdeedu4-buildroot/usr/include/kde4/libkdeedu/qtmml/qtmmlwidget.h: cpp failed
Requires: libkdeedu4 = 15.12.1-alt1, /usr/lib/libkeduvocdocument.so.4, kde4libs-devel
Finding debuginfo files (using /usr/lib/rpm/find-debuginfo-files)
Executing: /bin/sh -e /usr/src/tmp/rpm-tmp.DMVfWK
Processing files: libkdeedu4-debuginfo-15.12.1-alt1
Finding Provides (using /usr/lib/rpm/find-provides)
Executing: /bin/sh -e /usr/src/tmp/rpm-tmp.wyto5R
find-provides: running scripts (debuginfo)
Finding Requires (using /usr/lib/rpm/find-requires)
Executing: /bin/sh -e /usr/src/tmp/rpm-tmp.pn6ViL
find-requires: running scripts (debuginfo)
Provides: debug(libkeduvocdocument.so.4)
Requires: libkdeedu4 = 15.12.1-alt1, debug(libQtCore.so.4), debug(libQtXml.so.4), debug(libc.so.6), debug(libkdecore.so.5), debug(libkio.so.5), debug(libstdc++.so.6)
Removing 1 extra deps from libkdeedu4-devel due to dependency on libkdeedu4
Wrote: /usr/src/RPM/RPMS/i586/libkdeedu4-15.12.1-alt1.i586.rpm
Wrote: /usr/src/RPM/RPMS/i586/libkdeedu4-devel-15.12.1-alt1.i586.rpm
Wrote: /usr/src/RPM/RPMS/i586/libkdeedu4-debuginfo-15.12.1-alt1.i586.rpm
87.24user 7.01system 1:26.38elapsed 109%CPU (0avgtext+0avgdata 170636maxresident)k
0inputs+0outputs (0major+2408860minor)pagefaults 0swaps
111.64user 11.93system 2:19.58elapsed 88%CPU (0avgtext+0avgdata 170636maxresident)k
0inputs+0outputs (0major+3441928minor)pagefaults 0swaps
--- libkdeedu4-15.12.1-alt1.i586.rpm.repo	2016-02-02 10:55:13.000000000 +0000
+++ libkdeedu4-15.12.1-alt1.i586.rpm.hasher	2019-01-02 08:17:59.204601425 +0000
@@ -1,3 +1,3 @@
-/usr/lib/libkeduvocdocument.so.4	120777	libkeduvocdocument.so.4.14.16
-/usr/lib/libkeduvocdocument.so.4.14.16	100644	
+/usr/lib/libkeduvocdocument.so.4	120777	libkeduvocdocument.so.4.14.38
+/usr/lib/libkeduvocdocument.so.4.14.38	100644	
 /usr/share/doc/libkdeedu4-15.12.1	40755	
@@ -13,2 +13,3 @@
 Requires: libstdc++.so.6(CXXABI_1.3)  
+Requires: libstdc++.so.6(CXXABI_1.3.9)  
 Requires: libstdc++.so.6(GLIBCXX_3.4)  
--- libkdeedu4-debuginfo-15.12.1-alt1.i586.rpm.repo	2016-02-02 10:55:13.000000000 +0000
+++ libkdeedu4-debuginfo-15.12.1-alt1.i586.rpm.hasher	2019-01-02 08:17:59.216601424 +0000
@@ -1,3 +1,3 @@
-/usr/lib/debug/usr/lib/libkeduvocdocument.so.4.14.16.debug	100644	
-/usr/lib/debug/usr/lib/libkeduvocdocument.so.4.debug	120777	libkeduvocdocument.so.4.14.16.debug
+/usr/lib/debug/usr/lib/libkeduvocdocument.so.4.14.38.debug	100644	
+/usr/lib/debug/usr/lib/libkeduvocdocument.so.4.debug	120777	libkeduvocdocument.so.4.14.38.debug
 /usr/src/debug/libkdeedu-15.12.1	40755