<86>Dec  4 08:40:00 userdel[73408]: delete user 'rooter'
<86>Dec  4 08:40:00 userdel[73408]: removed group 'rooter' owned by 'rooter'
<86>Dec  4 08:40:00 userdel[73408]: removed shadow group 'rooter' owned by 'rooter'
<86>Dec  4 08:40:00 groupadd[73441]: group added to /etc/group: name=rooter, GID=540
<86>Dec  4 08:40:00 groupadd[73441]: group added to /etc/gshadow: name=rooter
<86>Dec  4 08:40:00 groupadd[73441]: new group: name=rooter, GID=540
<86>Dec  4 08:40:00 useradd[73457]: new user: name=rooter, UID=540, GID=540, home=/root, shell=/bin/bash
<86>Dec  4 08:40:00 userdel[73487]: delete user 'builder'
<86>Dec  4 08:40:00 groupadd[73511]: group added to /etc/group: name=builder, GID=541
<86>Dec  4 08:40:00 groupadd[73511]: group added to /etc/gshadow: name=builder
<86>Dec  4 08:40:00 groupadd[73511]: new group: name=builder, GID=541
<86>Dec  4 08:40:00 useradd[73576]: new user: name=builder, UID=541, GID=541, home=/usr/src, shell=/bin/bash
<13>Dec  4 08:40:40 rpmi: libidn2-2.0.5-alt1 1526923875 installed
<13>Dec  4 08:40:40 rpmi: libopenblas-0.2.20-alt1 1527005646 installed
<13>Dec  4 08:40:40 rpmi: libexpat-2.2.4-alt1 1503305345 installed
<13>Dec  4 08:40:40 rpmi: udev-rules-1:239-alt3 sisyphus.215710.300 1540765573 installed
<13>Dec  4 08:40:40 rpmi: libkmod-25-alt1 1522318408 installed
<13>Dec  4 08:40:40 rpmi: libquadmath0-8.2.1-alt1 sisyphus.214000.20 1542662379 installed
<13>Dec  4 08:40:40 rpmi: libpng16-1.6.35-alt1 sisyphus.214397.100 1539159349 installed
<13>Dec  4 08:40:40 rpmi: kmod-25-alt1 1522318408 installed
<13>Dec  4 08:40:40 rpmi: python-module-sphinxcontrib-2.1.1-alt2.1.2 1526455698 installed
<13>Dec  4 08:40:40 rpmi: libnumpy-1:1.13.3-alt2.2.qa1 sisyphus.214885.100 1539806695 installed
<13>Dec  4 08:40:40 rpmi: libnuma-2.0.11-alt1 1450022594 installed
<13>Dec  4 08:40:40 rpmi: libmnl-1.0.4-alt1 1480571791 installed
<13>Dec  4 08:40:40 rpmi: liblz4-1:1.8.3-alt1 sisyphus.213737.100 1538009686 installed
<13>Dec  4 08:40:40 rpmi: libiptables-1.4.21-alt3 1435789455 installed
<13>Dec  4 08:40:40 rpmi: msulogin-1.0-alt1 1366288515 installed
<13>Dec  4 08:40:40 rpmi: mount-2.32-alt2 1528296111 installed
<13>Dec  4 08:40:40 rpmi: libdevmapper-1.02.152-alt2 sisyphus.216915.100 1543418921 installed
<13>Dec  4 08:40:40 rpmi: libjpeg-2:1.5.1-alt1 1498218318 installed
<13>Dec  4 08:40:40 rpmi: libglvnd-7:1.1.0-alt3 sisyphus.215982.100 1541498632 installed
<13>Dec  4 08:40:40 rpmi: libwayland-server-1.16.0-alt1 1535614871 installed
<13>Dec  4 08:40:40 rpmi: libICE-1.0.9-alt1 1409902721 installed
<13>Dec  4 08:40:40 rpmi: libSM-1.2.3-alt1 sisyphus.215747.100 1540812795 installed
<13>Dec  4 08:40:40 rpmi: libtiff5-4.0.3-alt1 1348347501 installed
<13>Dec  4 08:40:40 rpmi: sysvinit-2.88-alt5 1424350686 installed
<13>Dec  4 08:40:40 rpmi: libnetlink-4.18.0-alt1 1534194784 installed
<13>Dec  4 08:40:40 rpmi: libnuma-devel-2.0.11-alt1 1450022594 installed
<13>Dec  4 08:40:41 rpmi: libgfortran4-7.3.1-alt7 sisyphus.214000.100 1542667145 installed
<13>Dec  4 08:40:41 rpmi: libgfortran5-8.2.1-alt1 sisyphus.214000.20 1542662379 installed
<13>Dec  4 08:40:41 rpmi: libquadmath8-devel-8.2.1-alt1 sisyphus.214000.20 1542662379 installed
<13>Dec  4 08:40:41 rpmi: libopenblas-devel-0.2.20-alt1 1527005646 installed
<13>Dec  4 08:40:41 rpmi: pciids-20181203-alt1 sisyphus.217255.100 1543878432 installed
<13>Dec  4 08:40:41 rpmi: tcsh-6.20.00-alt2 1503603381 installed
<13>Dec  4 08:40:41 rpmi: rpm-macros-mpi-selector-1.0.3-alt3 1504498675 installed
<13>Dec  4 08:40:41 rpmi: mpi-selector-1.0.3-alt3 1504498675 installed
<13>Dec  4 08:40:41 rpmi: libpci-3.6.2-alt1.S1 sisyphus.213446.100 1537513661 installed
<13>Dec  4 08:40:41 rpmi: pciutils-3.6.2-alt1.S1 sisyphus.213446.100 1537513661 installed
<13>Dec  4 08:40:41 rpmi: python-module-imagesize-0.7.1-alt1 1461387704 installed
<13>Dec  4 08:40:41 rpmi: python-sphinx-objects.inv-1:2.3.8.20181202-alt1 sisyphus.217202.100 1543792879 installed
<13>Dec  4 08:40:41 rpmi: libxapian-1.4.5-alt3 sisyphus.215025.100 1539610704 installed
<13>Dec  4 08:40:41 rpmi: python-module-google-0.4.2-alt2.1 1517733343 installed
<13>Dec  4 08:40:41 rpmi: libsqlite3-3.25.2-alt2 sisyphus.215082.100 1539700318 installed
<13>Dec  4 08:40:41 rpmi: python-module-enum34-1.1.6-alt3 1527251693 installed
<13>Dec  4 08:40:41 rpmi: libnl3-3.4.0-alt2 1507570088 installed
<13>Dec  4 08:40:41 rpmi: libibverbs-20.1-alt1 sisyphus.215851.40 1541165555 installed
<13>Dec  4 08:40:41 rpmi: librdmacm-20.1-alt1 sisyphus.215851.40 1541165555 installed
<13>Dec  4 08:40:41 rpmi: openmpi-2.0.1-alt7 sisyphus.216567.400 1543514645 installed
<13>Dec  4 08:40:41 rpmi: libibumad-20.1-alt1 sisyphus.215851.40 1541165555 installed
<13>Dec  4 08:40:41 rpmi: libatm-2.5.1-alt4 1349943444 installed
<13>Dec  4 08:40:41 rpmi: chrooted-0.3.9-alt1 1524554183 installed
<13>Dec  4 08:40:41 rpmi: chrooted-resolv-0.3.1-alt2 1176155250 installed
<13>Dec  4 08:40:41 rpmi: gcc-fortran-common-1.4.22-alt1 1519183788 installed
<13>Dec  4 08:40:41 rpmi: libgfortran8-devel-8.2.1-alt1 sisyphus.214000.20 1542662379 installed
<13>Dec  4 08:40:42 rpmi: gcc8-fortran-8.2.1-alt1 sisyphus.214000.20 1542662379 installed
<13>Dec  4 08:40:42 rpmi: gcc-fortran-8-alt1 sisyphus.214000.40 1542664775 installed
<13>Dec  4 08:40:42 rpmi: gcc-c++-common-1.4.22-alt1 1519183788 installed
<13>Dec  4 08:40:42 rpmi: libstdc++8-devel-8.2.1-alt1 sisyphus.214000.20 1542662379 installed
<13>Dec  4 08:40:43 rpmi: gcc8-c++-8.2.1-alt1 sisyphus.214000.20 1542662379 installed
<13>Dec  4 08:40:43 rpmi: gcc-c++-8-alt1 sisyphus.214000.40 1542664775 installed
<13>Dec  4 08:40:43 rpmi: libseccomp-2.3.3-alt1.S1.1 1525143458 installed
<13>Dec  4 08:40:43 rpmi: libpcre2-10.32-alt1 sisyphus.212994.100 1536866761 installed
<13>Dec  4 08:40:43 rpmi: libjson-c-0.12.1-alt2 1517446106 installed
<13>Dec  4 08:40:43 rpmi: libargon2-20171227-alt2 sisyphus.216770.100 1542965282 installed
<13>Dec  4 08:40:43 rpmi: libgpg-error-1.31-alt1.S1 1529015802 installed
<13>Dec  4 08:40:43 rpmi: libgcrypt20-1.8.3-alt3 sisyphus.214019.140 1538990448 installed
<13>Dec  4 08:40:43 rpmi: libsystemd-1:239-alt3 sisyphus.215710.300 1540765641 installed
<13>Dec  4 08:40:43 rpmi: libcryptsetup-2.0.6-alt1 sisyphus.217248.100 1543864717 installed
<13>Dec  4 08:40:43 rpmi: libxslt-1.1.32-alt2 1517429984 installed
<13>Dec  4 08:40:43 rpmi: hwclock-1:2.32-alt2 1528296111 installed
<13>Dec  4 08:40:43 rpmi: startup-0.9.9.6-alt1 sisyphus.215964.200 1542884274 installed
<13>Dec  4 08:40:43 rpmi: systemd-utils-1:239-alt3 sisyphus.215710.300 1540765641 installed
<13>Dec  4 08:40:43 rpmi: udev-hwdb-1:239-alt3 sisyphus.215710.300 1540765573 installed
<13>Dec  4 08:40:43 rpmi: hashalot-0.3-alt1.qa1 1366323553 installed
<13>Dec  4 08:40:43 rpmi: losetup-2.32-alt2 1528296111 installed
<13>Dec  4 08:40:43 rpmi: lsblk-2.32-alt2 1528296111 installed
<13>Dec  4 08:40:43 rpmi: dmsetup-1.02.152-alt2 sisyphus.216915.100 1543418921 installed
<86>Dec  4 08:40:43 groupadd[121668]: group added to /etc/group: name=tape, GID=499
<86>Dec  4 08:40:43 groupadd[121668]: group added to /etc/gshadow: name=tape
<86>Dec  4 08:40:43 groupadd[121668]: new group: name=tape, GID=499
<86>Dec  4 08:40:43 groupadd[121673]: group added to /etc/group: name=dialout, GID=498
<86>Dec  4 08:40:43 groupadd[121673]: group added to /etc/gshadow: name=dialout
<86>Dec  4 08:40:43 groupadd[121673]: new group: name=dialout, GID=498
<86>Dec  4 08:40:43 groupadd[121679]: group added to /etc/group: name=input, GID=497
<86>Dec  4 08:40:43 groupadd[121679]: group added to /etc/gshadow: name=input
<86>Dec  4 08:40:43 groupadd[121679]: new group: name=input, GID=497
<86>Dec  4 08:40:43 groupadd[121683]: group added to /etc/group: name=video, GID=496
<86>Dec  4 08:40:43 groupadd[121683]: group added to /etc/gshadow: name=video
<86>Dec  4 08:40:43 groupadd[121683]: new group: name=video, GID=496
<86>Dec  4 08:40:43 groupadd[121687]: group added to /etc/group: name=render, GID=495
<86>Dec  4 08:40:43 groupadd[121687]: group added to /etc/gshadow: name=render
<86>Dec  4 08:40:43 groupadd[121687]: new group: name=render, GID=495
<13>Dec  4 08:40:43 rpmi: udev-1:239-alt3 sisyphus.215710.300 1540765641 installed
<13>Dec  4 08:40:43 rpmi: libdatrie-0.2.9-alt1_6 1511686676 installed
<13>Dec  4 08:40:43 rpmi: libthai-0.1.28-alt1_1 sisyphus.214516.100 1539257851 installed
<13>Dec  4 08:40:43 rpmi: libfribidi-1.0.5-alt1 1532424345 installed
<13>Dec  4 08:40:44 rpmi: libxblas-1.0.248-alt1.1 1496143682 installed
<13>Dec  4 08:40:44 rpmi: liblapack-1:3.8.0-alt1 1527158339 installed
<13>Dec  4 08:40:45 rpmi: libicu60-1:6.0.2-alt2 1532519733 installed
<13>Dec  4 08:40:45 rpmi: publicsuffix-list-dafsa-20181106-alt1 sisyphus.216228.100 1541611754 installed
<13>Dec  4 08:40:45 rpmi: libpsl-0.20.2-alt2 sisyphus.216228.200 1541611889 installed
<13>Dec  4 08:40:45 rpmi: libnghttp2-1.34.0-alt1 sisyphus.214524.100 1539249634 installed
<13>Dec  4 08:40:45 rpmi: libbrotlicommon-1.0.7-alt1 sisyphus.215491.100 1540428597 installed
<13>Dec  4 08:40:45 rpmi: libbrotlidec-1.0.7-alt1 sisyphus.215491.100 1540428597 installed
<13>Dec  4 08:40:45 rpmi: libpixman-3:0.34.0-alt1 1480491657 installed
<13>Dec  4 08:40:45 rpmi: libgraphite2-1.3.12-alt2.1 sisyphus.215942.100 1540990757 installed
<13>Dec  4 08:40:45 rpmi: libharfbuzz-2.1.3-alt1 sisyphus.216837.100 1543085735 installed
<13>Dec  4 08:40:45 rpmi: libfreetype-2.9.1-alt1.S1 1530781053 installed
<13>Dec  4 08:40:45 rpmi: fontconfig-2.13.1-alt1 sisyphus.215917.100 1540973886 installed
Updating fonts cache: <29>Dec  4 08:40:46 fontconfig: Updating fonts cache: succeeded
[ DONE ]
<13>Dec  4 08:40:46 rpmi: libxshmfence-1.2-alt2 1518613552 installed
<13>Dec  4 08:40:46 rpmi: libwayland-client-1.16.0-alt1 1535614871 installed
<13>Dec  4 08:40:46 rpmi: libpciaccess-1:0.14-alt1 1528969252 installed
<13>Dec  4 08:40:46 rpmi: libdrm-1:2.4.96-alt1 sisyphus.215486.100 1540374027 installed
<13>Dec  4 08:40:46 rpmi: libgbm-4:18.2.6-alt1 sisyphus.217237.100 1543845945 installed
<13>Dec  4 08:40:46 rpmi: libX11-locales-3:1.6.7-alt1 sisyphus.214413.200 1539171080 installed
<13>Dec  4 08:40:46 rpmi: libXdmcp-1.1.1-alt1 1334617701 installed
<13>Dec  4 08:40:46 rpmi: libXau-1.0.8-alt1 1369565808 installed
<13>Dec  4 08:40:46 rpmi: libxcb-1.13.1-alt1 sisyphus.214413.100 1539170896 installed
<13>Dec  4 08:40:46 rpmi: libX11-3:1.6.7-alt1 sisyphus.214413.200 1539171143 installed
<13>Dec  4 08:40:46 rpmi: libXext-1.3.3-alt1 1409902959 installed
<13>Dec  4 08:40:46 rpmi: libXrender-0.9.8-alt1 1371312112 installed
<13>Dec  4 08:40:46 rpmi: libXt-1.1.4-alt1 1369984722 installed
<13>Dec  4 08:40:46 rpmi: libXmu-1.1.2-alt1 1391072530 installed
<13>Dec  4 08:40:46 rpmi: libXft-2.3.2-alt1 1409902660 installed
<13>Dec  4 08:40:46 rpmi: libXxf86vm-1.1.4-alt2 1527672187 installed
<13>Dec  4 08:40:46 rpmi: libXdamage-1.1.3-alt4 1297162593 installed
<13>Dec  4 08:40:46 rpmi: libXfixes-5.0.3-alt1 sisyphus.216396.300 1542022162 installed
<13>Dec  4 08:40:46 rpmi: libGLX-mesa-4:18.2.6-alt1 sisyphus.217237.100 1543845945 installed
<13>Dec  4 08:40:46 rpmi: libEGL-mesa-4:18.2.6-alt1 sisyphus.217237.100 1543845945 installed
<13>Dec  4 08:40:46 rpmi: libEGL-7:1.1.0-alt3 sisyphus.215982.100 1541498632 installed
<13>Dec  4 08:40:46 rpmi: libGLX-7:1.1.0-alt3 sisyphus.215982.100 1541498632 installed
<13>Dec  4 08:40:46 rpmi: libGL-7:1.1.0-alt3 sisyphus.215982.100 1541498632 installed
<13>Dec  4 08:40:46 rpmi: libcairo-1:1.16.0-alt1 sisyphus.215566.100 1540457683 installed
<13>Dec  4 08:40:46 rpmi: libpango-1.42.4-alt1 1534787259 installed
<13>Dec  4 08:40:46 rpmi: libtinfo-devel-6.1.20180407-alt2 sisyphus.215627.200 1540831974 installed
<13>Dec  4 08:40:46 rpmi: libncurses-devel-6.1.20180407-alt2 sisyphus.215627.200 1540831974 installed
<13>Dec  4 08:40:46 rpmi: python-modules-curses-2.7.14-alt7.1 sisyphus.212296.100 1535808823 installed
<13>Dec  4 08:40:46 rpmi: libverto-0.3.0-alt1_5 1525957714 installed
<13>Dec  4 08:40:46 rpmi: libkeyutils-1.6-alt1 sisyphus.217029.100 1543414265 installed
<13>Dec  4 08:40:46 rpmi: libcom_err-1.44.3-alt1 1532134732 installed
<13>Dec  4 08:40:46 rpmi: libgdbm-1.8.3-alt10 1454943334 installed
<13>Dec  4 08:40:46 rpmi: libtasn1-4.13-alt2 1521133850 installed
<13>Dec  4 08:40:46 rpmi: rpm-macros-alternatives-0.4.5-alt1.1 1404382149 installed
<13>Dec  4 08:40:46 rpmi: alternatives-0.4.5-alt1.1 1404382149 installed
<13>Dec  4 08:40:46 rpmi: libp11-kit-0.23.9-alt5 1525798298 installed
<13>Dec  4 08:40:46 rpmi: ca-certificates-2018.11.12-alt1 sisyphus.216395.300 1542114035 installed
<13>Dec  4 08:40:46 rpmi: ca-trust-0.1.1-alt2 1515595785 installed
<13>Dec  4 08:40:46 rpmi: p11-kit-trust-0.23.9-alt5 1525798298 installed
<13>Dec  4 08:40:46 rpmi: libcrypto1.1-1.1.0j-alt1 sisyphus.216647.100 1542743878 installed
<13>Dec  4 08:40:46 rpmi: libssl1.1-1.1.0j-alt1 sisyphus.216647.100 1542743878 installed
<86>Dec  4 08:40:46 groupadd[124748]: group added to /etc/group: name=_keytab, GID=494
<86>Dec  4 08:40:46 groupadd[124748]: group added to /etc/gshadow: name=_keytab
<86>Dec  4 08:40:46 groupadd[124748]: new group: name=_keytab, GID=494
<13>Dec  4 08:40:46 rpmi: libkrb5-1.16.2-alt2 sisyphus.216877.200 1543483297 installed
<13>Dec  4 08:40:46 rpmi: libtirpc-1.0.3-alt1 1532008017 installed
<13>Dec  4 08:40:46 rpmi: libnsl2-1.1.0-alt1_1 1511548749 installed
<13>Dec  4 08:40:46 rpmi: python-modules-compiler-2.7.14-alt7.1 sisyphus.212296.100 1535808823 installed
<13>Dec  4 08:40:46 rpmi: python-modules-email-2.7.14-alt7.1 sisyphus.212296.100 1535808823 installed
<13>Dec  4 08:40:46 rpmi: python-modules-unittest-2.7.14-alt7.1 sisyphus.212296.100 1535808823 installed
<13>Dec  4 08:40:46 rpmi: python-modules-nis-2.7.14-alt7.1 sisyphus.212296.100 1535808823 installed
<13>Dec  4 08:40:46 rpmi: python-modules-encodings-2.7.14-alt7.1 sisyphus.212296.100 1535808823 installed
<13>Dec  4 08:40:47 rpmi: python-modules-2.7.14-alt7.1 sisyphus.212296.100 1535808823 installed
<13>Dec  4 08:40:47 rpmi: python-module-six-1.11.0-alt2 1535611135 installed
<13>Dec  4 08:40:47 rpmi: python-module-pkg_resources-1:40.5.0-alt1 sisyphus.216029.100 1541106477 installed
<13>Dec  4 08:40:47 rpmi: python-modules-ctypes-2.7.14-alt7.1 sisyphus.212296.100 1535808823 installed
<13>Dec  4 08:40:47 rpmi: python-modules-json-2.7.14-alt7.1 sisyphus.212296.100 1535808823 installed
<13>Dec  4 08:40:47 rpmi: python-modules-xml-2.7.14-alt7.1 sisyphus.212296.100 1535808823 installed
<13>Dec  4 08:40:47 rpmi: python-modules-multiprocessing-2.7.14-alt7.1 sisyphus.212296.100 1535808823 installed
<13>Dec  4 08:40:47 rpmi: python-modules-logging-2.7.14-alt7.1 sisyphus.212296.100 1535808823 installed
<13>Dec  4 08:40:47 rpmi: python-modules-hotshot-2.7.14-alt7.1 sisyphus.212296.100 1535808823 installed
<13>Dec  4 08:40:47 rpmi: python-module-chardet-3.0.4-alt1 1506613818 installed
<13>Dec  4 08:40:47 rpmi: python-tools-2to3-2.7.14-alt7.1 sisyphus.212296.100 1535808823 installed
<13>Dec  4 08:40:47 rpmi: python-module-whoosh-2.7.4-alt1 1527697941 installed
<13>Dec  4 08:40:47 rpmi: python-module-webencodings-0.5.1-alt1.1 1517943573 installed
<13>Dec  4 08:40:47 rpmi: python-module-more-itertools-4.3.0-alt1 1533048475 installed
<13>Dec  4 08:40:47 rpmi: python-modules-bsddb-2.7.14-alt7.1 sisyphus.212296.100 1535808823 installed
<13>Dec  4 08:40:47 rpmi: python-2.7.14-alt7.1 sisyphus.212296.100 1535808823 installed
<13>Dec  4 08:40:47 rpmi: python-strict-2.7.14-alt7.1 sisyphus.212296.100 1535808793 installed
<13>Dec  4 08:40:47 rpmi: python-modules-distutils-2.7.14-alt7.1 sisyphus.212296.100 1535808823 installed
<13>Dec  4 08:40:47 rpmi: python-module-numpy-1:1.13.3-alt2.2.qa1 sisyphus.214885.100 1539806695 installed
<13>Dec  4 08:40:47 rpmi: python-module-numpy-testing-1:1.13.3-alt2.2.qa1 sisyphus.214885.100 1539806695 installed
<13>Dec  4 08:40:47 rpmi: python-module-idna-2.7-alt1 1530720902 installed
<13>Dec  4 08:40:47 rpmi: python-module-cssselect-0.9.1-alt1.2 1526980827 installed
<13>Dec  4 08:40:47 rpmi: python-module-html5lib-1:0.999999999-alt4.qa1 sisyphus.214868.100 1539741045 installed
<13>Dec  4 08:40:47 rpmi: python-module-lxml-4.2.1-alt1.1 1525119302 installed
<13>Dec  4 08:40:47 rpmi: python-module-docutils-0.14-alt2 1535729778 installed
<13>Dec  4 08:40:47 rpmi: python-module-pycparser-2.19-alt1 sisyphus.216095.100 1541345023 installed
<13>Dec  4 08:40:48 rpmi: python-module-cffi-1.10.0-alt1.1 1525117736 installed
<13>Dec  4 08:40:48 rpmi: python-module-asn1crypto-0.24.0-alt1 1521037480 installed
<13>Dec  4 08:40:48 rpmi: python-module-ntlm-1.1.0-alt1.1.1.1 1460405346 installed
<13>Dec  4 08:40:48 rpmi: python-module-pytz-1:2016.10-alt1 1484291011 installed
<13>Dec  4 08:40:48 rpmi: python-module-babel-1:2.4.0-alt1.1 1517644530 installed
<13>Dec  4 08:40:48 rpmi: python-module-attrs-18.2.0-alt1 sisyphus.214354.100 1539088435 installed
<13>Dec  4 08:40:48 rpmi: python-module-PyStemmer-1.0.1-alt1.2.1 1321388303 installed
<13>Dec  4 08:40:48 rpmi: python-module-snowballstemmer-1.2.0-alt2.1 1457859319 installed
<13>Dec  4 08:40:48 rpmi: python-module-markupsafe-0.23-alt1.2.1.1 1525118834 installed
<13>Dec  4 08:40:48 rpmi: python-module-jinja2-2.10-alt1 1521724576 installed
<13>Dec  4 08:40:48 rpmi: python-module-simplejson-3.15.0-alt1.qa1 sisyphus.214917.100 1539845528 installed
<13>Dec  4 08:40:48 rpmi: python-module-ndg-0.4.2-alt1.qa1 1531457735 installed
<13>Dec  4 08:40:48 rpmi: python-module-ipaddress-1.0.18-alt1.1 1517713372 installed
<13>Dec  4 08:40:48 rpmi: python-module-cryptography-2.4.2-alt1 sisyphus.216799.200 1543487260 installed
<13>Dec  4 08:40:48 rpmi: python-module-OpenSSL-18.0.0-alt1 1532996168 installed
<13>Dec  4 08:40:48 rpmi: python-module-ndg-httpsclient-0.4.2-alt1.qa1 1531457735 installed
<13>Dec  4 08:40:48 rpmi: python-module-backports-3.5.0.1-alt1.1.1 1517645428 installed
<13>Dec  4 08:40:48 rpmi: python-module-backports.ssl_match_hostname-3.5.0.1-alt1.1.1 1517645428 installed
<13>Dec  4 08:40:48 rpmi: python-module-urllib3-2:1.21.1-alt1 1506613994 installed
<13>Dec  4 08:40:48 rpmi: python-module-requests-2.19.1-alt1 1530831197 installed
<13>Dec  4 08:40:48 rpmi: python-module-typing-3.6.4-alt1 1517577671 installed
<13>Dec  4 08:40:48 rpmi: python-modules-sqlite3-2.7.14-alt7.1 sisyphus.212296.100 1535808823 installed
<13>Dec  4 08:40:48 rpmi: python-module-SQLAlchemy-1.0.12-alt1.1 1525119509 installed
<13>Dec  4 08:40:48 rpmi: python-module-py-1.7.0-alt1 sisyphus.214414.220 1539670883 installed
<13>Dec  4 08:40:48 rpmi: python-module-funcsigs-1.0.2-alt1.1 1517699355 installed
<13>Dec  4 08:40:48 rpmi: python-module-scandir-1.9.0-alt1 1535455370 installed
<13>Dec  4 08:40:48 rpmi: python-module-pathlib2-2.3.2-alt1 1535455443 installed
<13>Dec  4 08:40:48 rpmi: python-module-atomicwrites-1.2.1-alt1 sisyphus.214347.100 1539076636 installed
<13>Dec  4 08:40:48 rpmi: python-module-xapian-1.4.5-alt2.qa1 1531484078 installed
<13>Dec  4 08:40:48 rpmi: python-module-pluggy-0.8.0-alt1 sisyphus.215346.100 1540073015 installed
<13>Dec  4 08:40:48 rpmi: python-module-pytest-3.9.3-alt1 sisyphus.215666.100 1540687418 installed
<13>Dec  4 08:40:48 rpmi: python-module-alabaster-0.7.6-alt3 1526385201 installed
<13>Dec  4 08:40:49 rpmi: python-module-Pygments-2.2.0-alt2 1526455576 installed
<13>Dec  4 08:40:49 rpmi: python-module-sphinxcontrib-websupport-1.0.1-alt3.qa1 sisyphus.214922.100 1539851266 installed
<13>Dec  4 08:40:49 rpmi: python-module-sphinx-1:1.6.5-alt3 sisyphus.213215.100 1537280252 installed
<13>Dec  4 08:40:49 rpmi: python-module-numpydoc-1:0.7.0-alt1 1511771218 installed
<13>Dec  4 08:40:49 rpmi: libnsl2-devel-1.1.0-alt1_1 1511548749 installed
<13>Dec  4 08:40:49 rpmi: python-dev-2.7.14-alt7.1 sisyphus.212296.100 1535808823 installed
<13>Dec  4 08:40:49 rpmi: python-module-setuptools-1:40.5.0-alt1 sisyphus.216029.100 1541106477 installed
<13>Dec  4 08:40:49 rpmi: scons-3.0.1-alt1 1518686948 installed
<86>Dec  4 08:40:49 groupadd[127664]: group added to /etc/group: name=sasl, GID=493
<86>Dec  4 08:40:49 groupadd[127664]: group added to /etc/gshadow: name=sasl
<86>Dec  4 08:40:49 groupadd[127664]: new group: name=sasl, GID=493
<13>Dec  4 08:40:49 rpmi: libsasl2-3-2.1.27-alt0.2 1535660695 installed
<13>Dec  4 08:40:49 rpmi: libldap-2.4.46-alt1 1535562135 installed
<13>Dec  4 08:40:49 rpmi: libcurl-7.62.0-alt3 sisyphus.216461.100 1542191614 installed
<13>Dec  4 08:40:52 rpmi: R-base-3.5.0-alt2 1528129641 installed
<86>Dec  4 08:40:52 groupadd[2166]: group added to /etc/group: name=iputils, GID=492
<86>Dec  4 08:40:52 groupadd[2166]: group added to /etc/gshadow: name=iputils
<86>Dec  4 08:40:52 groupadd[2166]: new group: name=iputils, GID=492
<86>Dec  4 08:40:52 useradd[2188]: new user: name=iputils, UID=499, GID=492, home=/dev/null, shell=/dev/null
<86>Dec  4 08:40:52 groupadd[2208]: group added to /etc/group: name=netadmin, GID=491
<86>Dec  4 08:40:52 groupadd[2208]: group added to /etc/gshadow: name=netadmin
<86>Dec  4 08:40:52 groupadd[2208]: new group: name=netadmin, GID=491
<13>Dec  4 08:40:52 rpmi: iputils-20180629-alt1 1535650704 installed
sysctl: cannot stat /proc/sys/net/ipv4/ping_group_range: No such file or directory
<13>Dec  4 08:40:53 rpmi: iproute2-4.18.0-alt1 1534194784 installed
<13>Dec  4 08:40:53 rpmi: rdma-core-20.1-alt1 sisyphus.215851.40 1541165555 installed
<13>Dec  4 08:40:53 rpmi: ibacm-20.1-alt1 sisyphus.215851.40 1541165555 installed
<13>Dec  4 08:40:53 rpmi: rdma-core-devel-20.1-alt1 sisyphus.215851.40 1541165555 installed
<13>Dec  4 08:40:53 rpmi: openmpi-devel-2.0.1-alt7 sisyphus.216567.400 1543514645 installed
<13>Dec  4 08:40:53 rpmi: R-devel-3.5.0-alt2 1528129641 installed
<13>Dec  4 08:40:53 rpmi: libnumpy-devel-1:1.13.3-alt2.2.qa1 sisyphus.214885.100 1539806695 installed
<13>Dec  4 08:40:53 rpmi: liblapack-devel-1:3.8.0-alt1 1527158339 installed
Building target platforms: i586
Building for target i586
Wrote: /usr/src/in/nosrpm/pswarm-1.5-alt11.nosrc.rpm
Installing pswarm-1.5-alt11.src.rpm
Building target platforms: i586
Building for target i586
Executing(%prep): /bin/sh -e /usr/src/tmp/rpm-tmp.58281
+ umask 022
+ /bin/mkdir -p /usr/src/RPM/BUILD
+ cd /usr/src/RPM/BUILD
+ cd /usr/src/RPM/BUILD
+ rm -rf pswarm-1.5
+ echo 'Source #0 (pswarm-1.5.tar):'
Source #0 (pswarm-1.5.tar):
+ /bin/tar -xf /usr/src/RPM/SOURCES/pswarm-1.5.tar
+ cd pswarm-1.5
+ /bin/chmod -c -Rf u+rwX,go-w .
+ rm -f ampl blas.dll lapack.dll libs/Rdll.lib libs/amplsolv.lib libs/amplsolver.a libs/blas.dll libs/blas.lib libs/lapack.dll libs/lapack.lib
+ sed -i 's|2\.5|2.7|g' makefile
+ sed -i 's|@MPIDIR@|/usr/lib/openmpi|' makefile
+ sed -i 's|@SOMVER@|0|' makefile
+ sed -i 's|@SOVER@|0.0.0|' makefile
+ exit 0
Executing(%build): /bin/sh -e /usr/src/tmp/rpm-tmp.58281
+ umask 022
+ /bin/mkdir -p /usr/src/RPM/BUILD
+ cd /usr/src/RPM/BUILD
+ cd pswarm-1.5
+ mpi-selector --set openmpi
+ source /usr/lib/openmpi/bin/mpivars.sh
++ echo /usr/src/bin:/bin:/usr/bin:/usr/X11R6/bin:/usr/games
++ grep -q /usr/lib/openmpi/bin
++ PATH=/usr/lib/openmpi/bin:/usr/src/bin:/bin:/usr/bin:/usr/X11R6/bin:/usr/games
++ export PATH
++ echo
++ grep -q /usr/lib/openmpi/lib
++ LD_LIBRARY_PATH=/usr/lib/openmpi/lib
++ export LD_LIBRARY_PATH
++ echo
++ grep -q /usr/lib/openmpi/man
++ MANPATH=/usr/lib/openmpi/man:
++ export MANPATH
+ export 'OMPI_LDFLAGS=-Wl,--as-needed,-R,/usr/lib/openmpi/lib -L/usr/lib/openmpi/lib'
+ OMPI_LDFLAGS='-Wl,--as-needed,-R,/usr/lib/openmpi/lib -L/usr/lib/openmpi/lib'
+ for i in parallel_linear parallel serial_linear serial r_linear r py_linear py
+ make -j8 parallel_linear
make: Entering directory '/usr/src/RPM/BUILD/pswarm-1.5'
mpicc -g -DMPI   -g -O3 -fPIC  -g -DLINEAR -o pswarm.parallel_linear ./pattern.c ./pswarm.c ./pswarm_main.c ./cache.c ./user.c ./mve_solver.c ./mve_presolve.c -lm -ldl -Wl,-R/usr/lib/openmpi/lib  -L/usr/lib -llapack -lopenblas
./pattern.c: In function 'print_D':
./pattern.c:695:6: warning: type of 'n' defaults to 'int' [-Wimplicit-int]
 void print_D(n)
      ^~~~~~~
./pattern.c: In function 'print_TC':
./pattern.c:707:6: warning: type of 'n' defaults to 'int' [-Wimplicit-int]
 void print_TC(n)
      ^~~~~~~~
./cache.c: In function 'save_cache_file':
./cache.c:101:5: warning: ignoring return value of 'write', declared with attribute warn_unused_result [-Wunused-result]
     write(fid,tmp->key,n*sizeof(double));
     ^~~~~~~~~~~~~~~~~~~~~~~~~~~~~~~~~~~~
./cache.c:102:5: warning: ignoring return value of 'write', declared with attribute warn_unused_result [-Wunused-result]
     write(fid,tmp->value,m*sizeof(double));
     ^~~~~~~~~~~~~~~~~~~~~~~~~~~~~~~~~~~~~~
./cache.c: In function 'load_cache_file':
./cache.c:133:5: warning: ignoring return value of 'read', declared with attribute warn_unused_result [-Wunused-result]
     read(fid,value, m*sizeof(double));
     ^~~~~~~~~~~~~~~~~~~~~~~~~~~~~~~~~
make: Leaving directory '/usr/src/RPM/BUILD/pswarm-1.5'
+ for i in parallel_linear parallel serial_linear serial r_linear r py_linear py
+ make -j8 parallel
make: Entering directory '/usr/src/RPM/BUILD/pswarm-1.5'
mpicc -g -DMPI   -g -O3 -fPIC  -o pswarm.parallel ./pattern.c ./pswarm.c ./pswarm_main.c ./cache.c ./user.c -lm -ldl -Wl,-R/usr/lib/openmpi/lib 
./pattern.c: In function 'print_D':
./pattern.c:695:6: warning: type of 'n' defaults to 'int' [-Wimplicit-int]
 void print_D(n)
      ^~~~~~~
./pattern.c: In function 'print_TC':
./pattern.c:707:6: warning: type of 'n' defaults to 'int' [-Wimplicit-int]
 void print_TC(n)
      ^~~~~~~~
./cache.c: In function 'save_cache_file':
./cache.c:101:5: warning: ignoring return value of 'write', declared with attribute warn_unused_result [-Wunused-result]
     write(fid,tmp->key,n*sizeof(double));
     ^~~~~~~~~~~~~~~~~~~~~~~~~~~~~~~~~~~~
./cache.c:102:5: warning: ignoring return value of 'write', declared with attribute warn_unused_result [-Wunused-result]
     write(fid,tmp->value,m*sizeof(double));
     ^~~~~~~~~~~~~~~~~~~~~~~~~~~~~~~~~~~~~~
./cache.c: In function 'load_cache_file':
./cache.c:133:5: warning: ignoring return value of 'read', declared with attribute warn_unused_result [-Wunused-result]
     read(fid,value, m*sizeof(double));
     ^~~~~~~~~~~~~~~~~~~~~~~~~~~~~~~~~
make: Leaving directory '/usr/src/RPM/BUILD/pswarm-1.5'
+ for i in parallel_linear parallel serial_linear serial r_linear r py_linear py
+ make -j8 serial_linear
make: Entering directory '/usr/src/RPM/BUILD/pswarm-1.5'
gcc  -g -O3 -fPIC  -g -DLINEAR -o pswarm.serial_linear ./pattern.c ./pswarm.c ./pswarm_main.c ./cache.c ./user.c ./mve_solver.c ./mve_presolve.c -lm -ldl -L/usr/lib -llapack -lopenblas
./pattern.c: In function 'print_D':
./pattern.c:695:6: warning: type of 'n' defaults to 'int' [-Wimplicit-int]
 void print_D(n)
      ^~~~~~~
./pattern.c: In function 'print_TC':
./pattern.c:707:6: warning: type of 'n' defaults to 'int' [-Wimplicit-int]
 void print_TC(n)
      ^~~~~~~~
./cache.c: In function 'save_cache_file':
./cache.c:101:5: warning: ignoring return value of 'write', declared with attribute warn_unused_result [-Wunused-result]
     write(fid,tmp->key,n*sizeof(double));
     ^~~~~~~~~~~~~~~~~~~~~~~~~~~~~~~~~~~~
./cache.c:102:5: warning: ignoring return value of 'write', declared with attribute warn_unused_result [-Wunused-result]
     write(fid,tmp->value,m*sizeof(double));
     ^~~~~~~~~~~~~~~~~~~~~~~~~~~~~~~~~~~~~~
./cache.c: In function 'load_cache_file':
./cache.c:133:5: warning: ignoring return value of 'read', declared with attribute warn_unused_result [-Wunused-result]
     read(fid,value, m*sizeof(double));
     ^~~~~~~~~~~~~~~~~~~~~~~~~~~~~~~~~
make: Leaving directory '/usr/src/RPM/BUILD/pswarm-1.5'
+ for i in parallel_linear parallel serial_linear serial r_linear r py_linear py
+ make -j8 serial
make: Entering directory '/usr/src/RPM/BUILD/pswarm-1.5'
gcc  -g -O3 -fPIC  -o pswarm.serial ./pattern.c ./pswarm.c ./pswarm_main.c ./cache.c ./user.c -lm -ldl
./pattern.c: In function 'print_D':
./pattern.c:695:6: warning: type of 'n' defaults to 'int' [-Wimplicit-int]
 void print_D(n)
      ^~~~~~~
./pattern.c: In function 'print_TC':
./pattern.c:707:6: warning: type of 'n' defaults to 'int' [-Wimplicit-int]
 void print_TC(n)
      ^~~~~~~~
./cache.c: In function 'save_cache_file':
./cache.c:101:5: warning: ignoring return value of 'write', declared with attribute warn_unused_result [-Wunused-result]
     write(fid,tmp->key,n*sizeof(double));
     ^~~~~~~~~~~~~~~~~~~~~~~~~~~~~~~~~~~~
./cache.c:102:5: warning: ignoring return value of 'write', declared with attribute warn_unused_result [-Wunused-result]
     write(fid,tmp->value,m*sizeof(double));
     ^~~~~~~~~~~~~~~~~~~~~~~~~~~~~~~~~~~~~~
./cache.c: In function 'load_cache_file':
./cache.c:133:5: warning: ignoring return value of 'read', declared with attribute warn_unused_result [-Wunused-result]
     read(fid,value, m*sizeof(double));
     ^~~~~~~~~~~~~~~~~~~~~~~~~~~~~~~~~
make: Leaving directory '/usr/src/RPM/BUILD/pswarm-1.5'
+ for i in parallel_linear parallel serial_linear serial r_linear r py_linear py
+ make -j8 r_linear
make: Entering directory '/usr/src/RPM/BUILD/pswarm-1.5'
gcc -g -O3 -fPIC  -g -DLINEAR -c ./pattern.c ./pswarm.c                ./mve_solver.c ./mve_presolve.c
./pattern.c: In function 'print_D':
./pattern.c:695:6: warning: type of 'n' defaults to 'int' [-Wimplicit-int]
 void print_D(n)
      ^~~~~~~
./pattern.c: In function 'print_TC':
./pattern.c:707:6: warning: type of 'n' defaults to 'int' [-Wimplicit-int]
 void print_TC(n)
      ^~~~~~~~
x=`echo ./pattern.c ./pswarm.c                ./mve_solver.c ./mve_presolve.c | sed 's/\.[cs]/.o/g'` && ar ruv libpswarm.a $x
ar: creating libpswarm.a
a - ./pattern.o
a - ./pswarm.o
a - ./mve_solver.o
a - ./mve_presolve.o
ranlib libpswarm.a
gcc -shared -Wl,-soname,libpswarm.so.0 \
	`echo ./pattern.c ./pswarm.c                ./mve_solver.c ./mve_presolve.c | sed 's/\.[cs]/.o/g'`\
	-o libpswarm.so.0.0.0 -llapack -lopenblas -lm
rm -f libpswarm.so.0 libpswarm.so
ln -s libpswarm.so.0.0.0 libpswarm.so.0
ln -s libpswarm.so.0 libpswarm.so
make: Leaving directory '/usr/src/RPM/BUILD/pswarm-1.5'
make: Entering directory '/usr/src/RPM/BUILD/pswarm-1.5'
gcc -g -O3 -fPIC  -g -I/usr/include/R -c ./pswarm_r.c                           
x=`echo ./pswarm_r.c                            | sed 's/\.[cs]/.o/g'` && R CMD SHLIB -L. libpswarm.so -L/usr/lib -llapack -lopenblas $x -o pswarm_r.so
make[1]: Entering directory '/usr/src/RPM/BUILD/pswarm-1.5'
make[1]: warning: jobserver unavailable: using -j1.  Add '+' to parent make rule.
make[1]: Leaving directory '/usr/src/RPM/BUILD/pswarm-1.5'
make[1]: Entering directory '/usr/src/RPM/BUILD/pswarm-1.5'
i586-alt-linux-gcc -shared -L/usr/lib/R/lib -L/usr/local/lib -o pswarm_r.so ./pswarm_r.o -L. libpswarm.so -L/usr/lib -llapack -lopenblas -L/usr/lib/R/lib -lR
make[1]: Leaving directory '/usr/src/RPM/BUILD/pswarm-1.5'
make: Leaving directory '/usr/src/RPM/BUILD/pswarm-1.5'
+ for i in parallel_linear parallel serial_linear serial r_linear r py_linear py
+ make -j8 r
make: Entering directory '/usr/src/RPM/BUILD/pswarm-1.5'
gcc -g -O3 -fPIC  -c ./pattern.c ./pswarm.c               
./pattern.c: In function 'print_D':
./pattern.c:695:6: warning: type of 'n' defaults to 'int' [-Wimplicit-int]
 void print_D(n)
      ^~~~~~~
./pattern.c: In function 'print_TC':
./pattern.c:707:6: warning: type of 'n' defaults to 'int' [-Wimplicit-int]
 void print_TC(n)
      ^~~~~~~~
x=`echo ./pattern.c ./pswarm.c                | sed 's/\.[cs]/.o/g'` && ar ruv libpswarm_nonlinear.a $x
ar: creating libpswarm_nonlinear.a
a - ./pattern.o
a - ./pswarm.o
ranlib libpswarm_nonlinear.a
gcc -shared -Wl,-soname,libpswarm_nonlinear.so.0 \
	`echo ./pattern.c ./pswarm.c                | sed 's/\.[cs]/.o/g'`\
	-o libpswarm_nonlinear.so.0.0.0 -lm
rm -f libpswarm_nonlinear.so.0 libpswarm_nonlinear.so
ln -s libpswarm_nonlinear.so.0.0.0 libpswarm_nonlinear.so.0
ln -s libpswarm_nonlinear.so.0 libpswarm_nonlinear.so
make: Leaving directory '/usr/src/RPM/BUILD/pswarm-1.5'
make: Entering directory '/usr/src/RPM/BUILD/pswarm-1.5'
gcc -g -O3 -fPIC  -g -I/usr/include/R -c ./pswarm_r.c                           
x=`echo ./pswarm_r.c                            | sed 's/\.[cs]/.o/g'` && R CMD SHLIB -L. libpswarm_nonlinear.so $x -o pswarm_r_nonlinear.so
make[1]: Entering directory '/usr/src/RPM/BUILD/pswarm-1.5'
make[1]: warning: jobserver unavailable: using -j1.  Add '+' to parent make rule.
make[1]: Leaving directory '/usr/src/RPM/BUILD/pswarm-1.5'
make[1]: Entering directory '/usr/src/RPM/BUILD/pswarm-1.5'
i586-alt-linux-gcc -shared -L/usr/lib/R/lib -L/usr/local/lib -o pswarm_r_nonlinear.so ./pswarm_r.o -L. libpswarm_nonlinear.so -L/usr/lib/R/lib -lR
make[1]: Leaving directory '/usr/src/RPM/BUILD/pswarm-1.5'
make: Leaving directory '/usr/src/RPM/BUILD/pswarm-1.5'
+ for i in parallel_linear parallel serial_linear serial r_linear r py_linear py
+ make -j8 py_linear
make: Entering directory '/usr/src/RPM/BUILD/pswarm-1.5'
gcc -g -O3 -fPIC  -g -DLINEAR -c ./pattern.c ./pswarm.c                ./mve_solver.c ./mve_presolve.c
./pattern.c: In function 'print_D':
./pattern.c:695:6: warning: type of 'n' defaults to 'int' [-Wimplicit-int]
 void print_D(n)
      ^~~~~~~
./pattern.c: In function 'print_TC':
./pattern.c:707:6: warning: type of 'n' defaults to 'int' [-Wimplicit-int]
 void print_TC(n)
      ^~~~~~~~
x=`echo ./pattern.c ./pswarm.c                ./mve_solver.c ./mve_presolve.c | sed 's/\.[cs]/.o/g'` && ar ruv libpswarm.a $x
r - ./pattern.o
r - ./pswarm.o
r - ./mve_solver.o
r - ./mve_presolve.o
ranlib libpswarm.a
gcc -shared -Wl,-soname,libpswarm.so.0 \
	`echo ./pattern.c ./pswarm.c                ./mve_solver.c ./mve_presolve.c | sed 's/\.[cs]/.o/g'`\
	-o libpswarm.so.0.0.0 -llapack -lopenblas -lm
rm -f libpswarm.so.0 libpswarm.so
ln -s libpswarm.so.0.0.0 libpswarm.so.0
ln -s libpswarm.so.0 libpswarm.so
make: Leaving directory '/usr/src/RPM/BUILD/pswarm-1.5'
make: Entering directory '/usr/src/RPM/BUILD/pswarm-1.5'
gcc -g -O3 -fPIC  -g -I/usr/include/python2.7 -I/usr/include/numpy -c ./pswarm_py.c                         
In file included from /usr/include/numpy/ndarraytypes.h:1809,
                 from /usr/include/numpy/ndarrayobject.h:18,
                 from /usr/include/numpy/arrayobject.h:4,
                 from ./pswarm_py.h:2,
                 from ./pswarm_py.c:1:
/usr/include/numpy/npy_1_7_deprecated_api.h:15:2: warning: #warning "Using deprecated NumPy API, disable it by " "#defining NPY_NO_DEPRECATED_API NPY_1_7_API_VERSION" [-Wcpp]
 #warning "Using deprecated NumPy API, disable it by " \
  ^~~~~~~
x=`echo ./pswarm_py.c                          | sed 's/\.[cs]/.o/g'` && gcc -shared -g -O3 -fPIC  -g -I/usr/include/python2.7 -I/usr/include/numpy $x -L. libpswarm.so -L/usr/lib -llapack -lopenblas -o pswarm_py.so -lpython2.7
make: Leaving directory '/usr/src/RPM/BUILD/pswarm-1.5'
+ for i in parallel_linear parallel serial_linear serial r_linear r py_linear py
+ make -j8 py
make: Entering directory '/usr/src/RPM/BUILD/pswarm-1.5'
gcc -g -O3 -fPIC  -c ./pattern.c ./pswarm.c               
./pattern.c: In function 'print_D':
./pattern.c:695:6: warning: type of 'n' defaults to 'int' [-Wimplicit-int]
 void print_D(n)
      ^~~~~~~
./pattern.c: In function 'print_TC':
./pattern.c:707:6: warning: type of 'n' defaults to 'int' [-Wimplicit-int]
 void print_TC(n)
      ^~~~~~~~
x=`echo ./pattern.c ./pswarm.c                | sed 's/\.[cs]/.o/g'` && ar ruv libpswarm_nonlinear.a $x
r - ./pattern.o
r - ./pswarm.o
ranlib libpswarm_nonlinear.a
gcc -shared -Wl,-soname,libpswarm_nonlinear.so.0 \
	`echo ./pattern.c ./pswarm.c                | sed 's/\.[cs]/.o/g'`\
	-o libpswarm_nonlinear.so.0.0.0 -lm
rm -f libpswarm_nonlinear.so.0 libpswarm_nonlinear.so
ln -s libpswarm_nonlinear.so.0.0.0 libpswarm_nonlinear.so.0
ln -s libpswarm_nonlinear.so.0 libpswarm_nonlinear.so
make: Leaving directory '/usr/src/RPM/BUILD/pswarm-1.5'
make: Entering directory '/usr/src/RPM/BUILD/pswarm-1.5'
gcc -g -O3 -fPIC  -g -I/usr/include/python2.7 -I/usr/include/numpy -c ./pswarm_py.c                         
In file included from /usr/include/numpy/ndarraytypes.h:1809,
                 from /usr/include/numpy/ndarrayobject.h:18,
                 from /usr/include/numpy/arrayobject.h:4,
                 from ./pswarm_py.h:2,
                 from ./pswarm_py.c:1:
/usr/include/numpy/npy_1_7_deprecated_api.h:15:2: warning: #warning "Using deprecated NumPy API, disable it by " "#defining NPY_NO_DEPRECATED_API NPY_1_7_API_VERSION" [-Wcpp]
 #warning "Using deprecated NumPy API, disable it by " \
  ^~~~~~~
x=`echo ./pswarm_py.c                          | sed 's/\.[cs]/.o/g'` && gcc -shared -g -O3 -fPIC  -g -I/usr/include/python2.7 -I/usr/include/numpy $x -L. libpswarm_nonlinear.so -o pswarm_py_nonlinear.so -lpython2.7
make: Leaving directory '/usr/src/RPM/BUILD/pswarm-1.5'
+ exit 0
Executing(%install): /bin/sh -e /usr/src/tmp/rpm-tmp.55714
+ umask 022
+ /bin/mkdir -p /usr/src/RPM/BUILD
+ cd /usr/src/RPM/BUILD
+ /bin/chmod -Rf u+rwX -- /usr/src/tmp/pswarm-buildroot
+ :
+ /bin/rm -rf -- /usr/src/tmp/pswarm-buildroot
+ cd pswarm-1.5
+ install -d /usr/src/tmp/pswarm-buildroot/usr/bin
+ install -m755 pswarm.parallel pswarm.parallel_linear pswarm.serial pswarm.serial_linear /usr/src/tmp/pswarm-buildroot/usr/bin
+ ln -s pswarm.parallel_linear /usr/src/tmp/pswarm-buildroot/usr/bin/pswarm
+ install -d /usr/src/tmp/pswarm-buildroot/usr/lib
+ install -m644 libpswarm.a libpswarm_nonlinear.a /usr/src/tmp/pswarm-buildroot/usr/lib
+ cp -P job.sol libpswarm.so libpswarm.so.0 libpswarm.so.0.0.0 libpswarm_nonlinear.so libpswarm_nonlinear.so.0 libpswarm_nonlinear.so.0.0.0 pswarm_py.so pswarm_py_nonlinear.so pswarm_r.so pswarm_r_nonlinear.so /usr/src/tmp/pswarm-buildroot/usr/lib/
+ install -d /usr/src/tmp/pswarm-buildroot/usr/include/pswarm
+ install -p -m644 pattern.h pswarm.h pswarm_main.h pswarm_py.h pswarm_r.h /usr/src/tmp/pswarm-buildroot/usr/include
+ install -p -m644 include/arith.h include/asl.h include/blas.h include/f2c.h include/funcadd.h include/getstub.h include/lapack.h include/nlp.h include/stdio1.h /usr/src/tmp/pswarm-buildroot/usr/include/pswarm
++ pkg-config libR --variable=rlibdir
+ RLIBDIR=/usr/lib/R/lib
+ install -d /usr/src/tmp/pswarm-buildroot/usr/lib/R/lib
+ install -m644 pswarm_r.so pswarm_r_nonlinear.so /usr/src/tmp/pswarm-buildroot/usr/lib/R/lib
+ pushd /usr/src/tmp/pswarm-buildroot
~/tmp/pswarm-buildroot ~/RPM/BUILD/pswarm-1.5
+ find .//usr/lib/R/lib -type f
+ sed 's|.\(.*\)|\1|'
+ popd
~/RPM/BUILD/pswarm-1.5
+ install -d /usr/src/tmp/pswarm-buildroot/usr/lib/python2.7/site-packages/pswarm_test
+ install -m644 pswarm_py.so pswarm_py_nonlinear.so /usr/src/tmp/pswarm-buildroot/usr/lib/python2.7/site-packages
+ touch __init__.py
+ install -p -m644 RunPSwarm.py __init__.py hs024.py /usr/src/tmp/pswarm-buildroot/usr/lib/python2.7/site-packages/pswarm_test
+ /usr/lib/rpm/brp-alt
Cleaning files in /usr/src/tmp/pswarm-buildroot (auto)
mode of './usr/lib/pswarm_r_nonlinear.so' changed from 0755 (rwxr-xr-x) to 0644 (rw-r--r--)
mode of './usr/lib/pswarm_r.so' changed from 0755 (rwxr-xr-x) to 0644 (rw-r--r--)
mode of './usr/lib/pswarm_py_nonlinear.so' changed from 0755 (rwxr-xr-x) to 0644 (rw-r--r--)
mode of './usr/lib/pswarm_py.so' changed from 0755 (rwxr-xr-x) to 0644 (rw-r--r--)
mode of './usr/lib/libpswarm_nonlinear.so.0.0.0' changed from 0755 (rwxr-xr-x) to 0644 (rw-r--r--)
mode of './usr/lib/libpswarm.so.0.0.0' changed from 0755 (rwxr-xr-x) to 0644 (rw-r--r--)
Verifying and fixing files in /usr/src/tmp/pswarm-buildroot (binconfig,pkgconfig,libtool,desktop)
Checking contents of files in /usr/src/tmp/pswarm-buildroot/ (default)
Compressing files in /usr/src/tmp/pswarm-buildroot (auto)
Adjusting library links in /usr/src/tmp/pswarm-buildroot
./usr/lib:
	libpswarm.so.0 -> libpswarm.so.0.0.0
	libpswarm_nonlinear.so.0 -> libpswarm_nonlinear.so.0.0.0
./usr/lib/R/lib:
Verifying ELF objects in /usr/src/tmp/pswarm-buildroot (arch=normal,fhs=normal,lfs=relaxed,lint=relaxed,rpath=normal,stack=normal,textrel=normal,unresolved=normal)
verify-elf: WARNING: ./usr/lib/libpswarm_nonlinear.so.0.0.0: uses non-LFS functions: fopen
verify-elf: WARNING: ./usr/lib/libpswarm.so.0.0.0: uses non-LFS functions: fopen
verify-elf: WARNING: ./usr/bin/pswarm.serial_linear: uses non-LFS functions: fopen open
verify-elf: WARNING: ./usr/bin/pswarm.serial: uses non-LFS functions: fopen open
verify-elf: WARNING: ./usr/bin/pswarm.parallel_linear: RPATH entry found: /usr/lib/openmpi/lib
verify-elf: WARNING: ./usr/bin/pswarm.parallel_linear: uses non-LFS functions: fopen open
verify-elf: WARNING: ./usr/bin/pswarm.parallel: RPATH entry found: /usr/lib/openmpi/lib
verify-elf: WARNING: ./usr/bin/pswarm.parallel: uses non-LFS functions: fopen open
Bytecompiling python modules in /usr/src/tmp/pswarm-buildroot using /usr/bin/python2.7
compile /usr/src/tmp/pswarm-buildroot/usr/lib/python2.7/site-packages/pswarm_test/RunPSwarm.py
compile /usr/src/tmp/pswarm-buildroot/usr/lib/python2.7/site-packages/pswarm_test/__init__.py
compile /usr/src/tmp/pswarm-buildroot/usr/lib/python2.7/site-packages/pswarm_test/hs024.py
Bytecompiling python modules with optimization in /usr/src/tmp/pswarm-buildroot using /usr/bin/python2.7 -O
compile /usr/src/tmp/pswarm-buildroot/usr/lib/python2.7/site-packages/pswarm_test/RunPSwarm.py
compile /usr/src/tmp/pswarm-buildroot/usr/lib/python2.7/site-packages/pswarm_test/__init__.py
compile /usr/src/tmp/pswarm-buildroot/usr/lib/python2.7/site-packages/pswarm_test/hs024.py
Hardlinking identical .pyc and .pyo files
'./usr/lib/python2.7/site-packages/pswarm_test/hs024.pyo' => './usr/lib/python2.7/site-packages/pswarm_test/hs024.pyc'
'./usr/lib/python2.7/site-packages/pswarm_test/__init__.pyo' => './usr/lib/python2.7/site-packages/pswarm_test/__init__.pyc'
'./usr/lib/python2.7/site-packages/pswarm_test/RunPSwarm.pyo' => './usr/lib/python2.7/site-packages/pswarm_test/RunPSwarm.pyc'
Processing files: pswarm-1.5-alt11
Executing(%doc): /bin/sh -e /usr/src/tmp/rpm-tmp.35165
+ umask 022
+ /bin/mkdir -p /usr/src/RPM/BUILD
+ cd /usr/src/RPM/BUILD
+ cd pswarm-1.5
+ DOCDIR=/usr/src/tmp/pswarm-buildroot/usr/share/doc/pswarm-1.5
+ export DOCDIR
+ rm -rf /usr/src/tmp/pswarm-buildroot/usr/share/doc/pswarm-1.5
+ /bin/mkdir -p /usr/src/tmp/pswarm-buildroot/usr/share/doc/pswarm-1.5
+ cp -prL lgpl.txt README.txt /usr/src/tmp/pswarm-buildroot/usr/share/doc/pswarm-1.5
+ chmod -R go-w /usr/src/tmp/pswarm-buildroot/usr/share/doc/pswarm-1.5
+ chmod -R a+rX /usr/src/tmp/pswarm-buildroot/usr/share/doc/pswarm-1.5
+ exit 0
Finding Provides (using /usr/lib/rpm/find-provides)
Executing: /bin/sh -e /usr/src/tmp/rpm-tmp.T50pMz
find-provides: running scripts (alternatives,debuginfo,lib,pam,perl,pkgconfig,python,shell)
Finding Requires (using /usr/lib/rpm/find-requires)
Executing: /bin/sh -e /usr/src/tmp/rpm-tmp.JY6BYm
find-requires: running scripts (cpp,debuginfo,files,lib,pam,perl,pkgconfig,pkgconfiglib,python,rpmlib,shebang,shell,static,symlinks)
Requires: libpswarm = 1.5-alt11, /lib/ld-linux.so.2, /usr/lib/openmpi/lib/libmpi.so.20, libc.so.6(GLIBC_2.0), libc.so.6(GLIBC_2.1), libc.so.6(GLIBC_2.11), libc.so.6(GLIBC_2.3.4), libc.so.6(GLIBC_2.4), liblapack.so.4 >= set:olWkTWOkZzXUGjOum6By1m, libm.so.6(GLIBC_2.0), libopenblas.so.0 >= set:roO3nmUxOcmiBOftDFEOF0, libpthread.so.0(GLIBC_2.0), rtld(GNU_HASH)
Requires(rpmlib): rpmlib(SetVersions)
Finding debuginfo files (using /usr/lib/rpm/find-debuginfo-files)
Executing: /bin/sh -e /usr/src/tmp/rpm-tmp.g0cdUx
Creating pswarm-debuginfo package
Processing files: libpswarm-1.5-alt11
Finding Provides (using /usr/lib/rpm/find-provides)
Executing: /bin/sh -e /usr/src/tmp/rpm-tmp.oGQyV0
find-provides: running scripts (alternatives,debuginfo,lib,pam,perl,pkgconfig,python,shell)
Finding Requires (using /usr/lib/rpm/find-requires)
Executing: /bin/sh -e /usr/src/tmp/rpm-tmp.ZuJjvX
find-requires: running scripts (cpp,debuginfo,files,lib,pam,perl,pkgconfig,pkgconfiglib,python,rpmlib,shebang,shell,static,symlinks)
shebang.req.files: executable script /usr/src/tmp/pswarm-buildroot/usr/lib/job.sol is not executable
shell.req: /usr/src/tmp/pswarm-buildroot/usr/lib/job.sol: module not found (skip)
shell.req: /usr/src/tmp/pswarm-buildroot/usr/lib/job.sol: mpipbsexec not found (skip)
find-requires: FINDPACKAGE-COMMANDS: module mpipbsexec
Provides: libpswarm.so.0 = set:jdfoTnUO56DZej0Dtx4hoURO1Rjl6uNuj0WjM4XJgk3rBR3gToTsb6pQ6jOU4uajCdgnn, libpswarm_nonlinear.so.0 = set:idfoixgNVFYmKDSOEEtC5i4xVEJrK5zcnPbLUGDqIZAVMVwlEK9iN
Requires: libc.so.6(GLIBC_2.0), libc.so.6(GLIBC_2.1), libc.so.6(GLIBC_2.1.3), libc.so.6(GLIBC_2.3.4), libc.so.6(GLIBC_2.4), liblapack.so.4 >= set:olWkTWOkZzXUGjOum6By1m, libm.so.6(GLIBC_2.0), libopenblas.so.0 >= set:roO3nmUxOcmiBOftDFEOF0, rtld(GNU_HASH)
Requires(rpmlib): rpmlib(SetVersions)
Finding debuginfo files (using /usr/lib/rpm/find-debuginfo-files)
Executing: /bin/sh -e /usr/src/tmp/rpm-tmp.1JjIQc
Creating libpswarm-debuginfo package
Processing files: libpswarm-devel-1.5-alt11
Finding Provides (using /usr/lib/rpm/find-provides)
Executing: /bin/sh -e /usr/src/tmp/rpm-tmp.mOZorH
find-provides: running scripts (alternatives,debuginfo,lib,pam,perl,pkgconfig,python,shell)
Finding Requires (using /usr/lib/rpm/find-requires)
Executing: /bin/sh -e /usr/src/tmp/rpm-tmp.Qo6T0v
find-requires: running scripts (cpp,debuginfo,files,lib,pam,perl,pkgconfig,pkgconfiglib,python,rpmlib,shebang,shell,static,symlinks)
/usr/src/tmp/pswarm-buildroot/usr/include/pswarm_r.h:8:10: fatal error: R.h: No such file or directory
 #include <R.h>
          ^~~~~
compilation terminated.
cpp.req: /usr/src/tmp/pswarm-buildroot/usr/include/pswarm_r.h: cpp failed, trying c++ mode
/usr/src/tmp/pswarm-buildroot/usr/include/pswarm_r.h:8:10: fatal error: R.h: No such file or directory
 #include <R.h>
          ^~~~~
compilation terminated.
cpp.req: WARNING: /usr/src/tmp/pswarm-buildroot/usr/include/pswarm_r.h: cpp failed
/usr/src/tmp/pswarm-buildroot/usr/include/pswarm_py.h:1:10: fatal error: Python.h: No such file or directory
 #include <Python.h>
          ^~~~~~~~~~
compilation terminated.
cpp.req: /usr/src/tmp/pswarm-buildroot/usr/include/pswarm_py.h: cpp failed, trying c++ mode
/usr/src/tmp/pswarm-buildroot/usr/include/pswarm_py.h:1:10: fatal error: Python.h: No such file or directory
 #include <Python.h>
          ^~~~~~~~~~
compilation terminated.
cpp.req: WARNING: /usr/src/tmp/pswarm-buildroot/usr/include/pswarm_py.h: cpp failed
Provides: pswarm_py.so = set:hd6wqPIiT2GzUQbbp6XH0, pswarm_py_nonlinear.so = set:hd6wqPIiT2GzUQbbp6XH0, pswarm_r.so = set:hdT36oTpkmI1kzr4qPAvA9S6FAsf, pswarm_r_nonlinear.so = set:hdT36oTpkmI1kzr4qPAvA9S6FAsf
Requires: libpswarm = 1.5-alt11, python-module-pswarm_py = 1.5-alt11, /usr/lib/libpswarm.so.0, /usr/lib/libpswarm_nonlinear.so.0, libR.so >= set:ojQcijL5cc8n6ujYIUjDGkTS4yk3u4qECitZcoDo7vQadkyDh5z0fZfWfOTrP5mQjmMImPXW41GmncagAW7, libc.so.6(GLIBC_2.0), libc.so.6(GLIBC_2.1.3), libc.so.6(GLIBC_2.11), libc.so.6(GLIBC_2.3.4), libc.so.6(GLIBC_2.4), libpswarm.so.0 >= set:jhU4frn4, libpswarm_nonlinear.so.0 >= set:igsyDJb0, libpython2.7.so.1.0 >= set:ojlg5opWTHNLJpFLQ8XHtxnCQRQhZrRPiAeqWdTffvodobVeTOekV8OFv4VFwePn800hecexU5v3rh7ZGGW98, rtld(GNU_HASH)
Requires(rpmlib): rpmlib(SetVersions)
Finding debuginfo files (using /usr/lib/rpm/find-debuginfo-files)
Executing: /bin/sh -e /usr/src/tmp/rpm-tmp.4dlcMz
Creating libpswarm-devel-debuginfo package
Processing files: libpswarm-devel-static-1.5-alt11
Finding Provides (using /usr/lib/rpm/find-provides)
Executing: /bin/sh -e /usr/src/tmp/rpm-tmp.69KsDL
find-provides: running scripts (alternatives,debuginfo,lib,pam,perl,pkgconfig,python,shell)
Finding Requires (using /usr/lib/rpm/find-requires)
Executing: /bin/sh -e /usr/src/tmp/rpm-tmp.ZQDKqh
find-requires: running scripts (cpp,debuginfo,files,lib,pam,perl,pkgconfig,pkgconfiglib,python,rpmlib,shebang,shell,static,symlinks)
Requires: libpswarm-devel = 1.5-alt11, glibc-devel-static
Finding debuginfo files (using /usr/lib/rpm/find-debuginfo-files)
Executing: /bin/sh -e /usr/src/tmp/rpm-tmp.PhxL1h
Processing files: python-module-pswarm_py-1.5-alt11
Finding Provides (using /usr/lib/rpm/find-provides)
Executing: /bin/sh -e /usr/src/tmp/rpm-tmp.zCVMWq
find-provides: running scripts (alternatives,debuginfo,lib,pam,perl,pkgconfig,python,shell)
Finding Requires (using /usr/lib/rpm/find-requires)
Executing: /bin/sh -e /usr/src/tmp/rpm-tmp.EpdiXY
find-requires: running scripts (cpp,debuginfo,files,lib,pam,perl,pkgconfig,pkgconfiglib,python,rpmlib,shebang,shell,static,symlinks)
Provides: python2.7-module-pswarm_py = 1.5-alt11, python2.7(pswarm_py), python2.7(pswarm_py_nonlinear)
Requires: python = 2.7, /usr/lib/python2.7/site-packages, libc.so.6(GLIBC_2.0), libc.so.6(GLIBC_2.1.3), libc.so.6(GLIBC_2.11), libc.so.6(GLIBC_2.3.4), libc.so.6(GLIBC_2.4), libpswarm.so.0 >= set:jhU4frn4, libpswarm_nonlinear.so.0 >= set:igsyDJb0, libpython2.7.so.1.0 >= set:ojlg5opWTHNLJpFLQ8XHtxnCQRQhZrRPiAeqWdTffvodobVeTOekV8OFv4VFwePn800hecexU5v3rh7ZGGW98, rtld(GNU_HASH)
Requires(rpmlib): rpmlib(SetVersions)
Finding debuginfo files (using /usr/lib/rpm/find-debuginfo-files)
Executing: /bin/sh -e /usr/src/tmp/rpm-tmp.QBqokP
Creating python-module-pswarm_py-debuginfo package
Processing files: python-module-pswarm_test-1.5-alt11
Finding Provides (using /usr/lib/rpm/find-provides)
Executing: /bin/sh -e /usr/src/tmp/rpm-tmp.JRMnvZ
find-provides: running scripts (alternatives,debuginfo,lib,pam,perl,pkgconfig,python,shell)
Finding Requires (using /usr/lib/rpm/find-requires)
Executing: /bin/sh -e /usr/src/tmp/rpm-tmp.gxuODj
find-requires: running scripts (cpp,debuginfo,files,lib,pam,perl,pkgconfig,pkgconfiglib,python,rpmlib,shebang,shell,static,symlinks)
python.req: /usr/src/tmp/pswarm-buildroot/usr/lib/python2.7/site-packages/pswarm_test/RunPSwarm.py: hiding pswarm_test, which SEEMS TO BE SELF-SATISFIED
Provides: python2.7-module-pswarm_py = 1.5-alt11, python2.7(pswarm_test), python2.7(pswarm_test.RunPSwarm), python2.7(pswarm_test.hs024)
Requires: python-module-pswarm_py = 1.5-alt11, python = 2.7, /usr/lib/python2.7/site-packages, python-modules, python2.7(numpy), python2.7(pswarm_py)
Finding debuginfo files (using /usr/lib/rpm/find-debuginfo-files)
Executing: /bin/sh -e /usr/src/tmp/rpm-tmp.00Qf4S
Processing files: R-pswarm-1.5-alt11
Executing(%doc): /bin/sh -e /usr/src/tmp/rpm-tmp.64379
+ umask 022
+ /bin/mkdir -p /usr/src/RPM/BUILD
+ cd /usr/src/RPM/BUILD
+ cd pswarm-1.5
+ DOCDIR=/usr/src/tmp/pswarm-buildroot/usr/share/doc/R-pswarm-1.5
+ export DOCDIR
+ rm -rf /usr/src/tmp/pswarm-buildroot/usr/share/doc/R-pswarm-1.5
+ /bin/mkdir -p /usr/src/tmp/pswarm-buildroot/usr/share/doc/R-pswarm-1.5
+ cp -prL RunPSwarm.r hs024.r /usr/src/tmp/pswarm-buildroot/usr/share/doc/R-pswarm-1.5
+ chmod -R go-w /usr/src/tmp/pswarm-buildroot/usr/share/doc/R-pswarm-1.5
+ chmod -R a+rX /usr/src/tmp/pswarm-buildroot/usr/share/doc/R-pswarm-1.5
+ exit 0
Finding Provides (using /usr/lib/rpm/find-provides)
Executing: /bin/sh -e /usr/src/tmp/rpm-tmp.os2yOU
find-provides: running scripts (alternatives,debuginfo,lib,pam,perl,pkgconfig,python,shell)
Finding Requires (using /usr/lib/rpm/find-requires)
Executing: /bin/sh -e /usr/src/tmp/rpm-tmp.fU23nb
find-requires: running scripts (cpp,debuginfo,files,lib,pam,perl,pkgconfig,pkgconfiglib,python,rpmlib,shebang,shell,static,symlinks)
Requires: libR.so >= set:ojQcijL5cc8n6ujYIUjDGkTS4yk3u4qECitZcoDo7vQadkyDh5z0fZfWfOTrP5mQjmMImPXW41GmncagAW7, libc.so.6(GLIBC_2.0), libc.so.6(GLIBC_2.1.3), libc.so.6(GLIBC_2.11), libpswarm.so.0 >= set:jhU4frn4, libpswarm_nonlinear.so.0 >= set:igsyDJb0, rtld(GNU_HASH)
Requires(rpmlib): rpmlib(SetVersions)
Finding debuginfo files (using /usr/lib/rpm/find-debuginfo-files)
Executing: /bin/sh -e /usr/src/tmp/rpm-tmp.Ox2NvM
Creating R-pswarm-debuginfo package
Processing files: pswarm-debuginfo-1.5-alt11
Finding Provides (using /usr/lib/rpm/find-provides)
Executing: /bin/sh -e /usr/src/tmp/rpm-tmp.NrckwS
find-provides: running scripts (debuginfo)
Finding Requires (using /usr/lib/rpm/find-requires)
Executing: /bin/sh -e /usr/src/tmp/rpm-tmp.9evIwI
find-requires: running scripts (debuginfo)
Requires: pswarm = 1.5-alt11, /usr/lib/debug/lib/ld-linux.so.2.debug, /usr/lib/debug/usr/lib/openmpi/lib/libmpi.so.20.debug, debug(libc.so.6), debug(liblapack.so.4), debug(libm.so.6), debug(libopenblas.so.0), debug(libpthread.so.0)
Processing files: libpswarm-debuginfo-1.5-alt11
Finding Provides (using /usr/lib/rpm/find-provides)
Executing: /bin/sh -e /usr/src/tmp/rpm-tmp.AqPN1R
find-provides: running scripts (debuginfo)
Finding Requires (using /usr/lib/rpm/find-requires)
Executing: /bin/sh -e /usr/src/tmp/rpm-tmp.9SGOVi
find-requires: running scripts (debuginfo)
Provides: debug(libpswarm.so.0), debug(libpswarm_nonlinear.so.0)
Requires: libpswarm = 1.5-alt11, debug(libc.so.6), debug(liblapack.so.4), debug(libm.so.6), debug(libopenblas.so.0)
Processing files: libpswarm-devel-debuginfo-1.5-alt11
Finding Provides (using /usr/lib/rpm/find-provides)
Executing: /bin/sh -e /usr/src/tmp/rpm-tmp.ufVrTk
find-provides: running scripts (debuginfo)
Finding Requires (using /usr/lib/rpm/find-requires)
Executing: /bin/sh -e /usr/src/tmp/rpm-tmp.WiUun4
find-requires: running scripts (debuginfo)
Provides: debug(pswarm_py.so), debug(pswarm_py_nonlinear.so), debug(pswarm_r.so), debug(pswarm_r_nonlinear.so)
Requires: libpswarm-devel = 1.5-alt11, debug(libR.so), debug(libc.so.6), debug(libpswarm.so.0), debug(libpswarm_nonlinear.so.0), debug(libpython2.7.so.1.0)
Processing files: python-module-pswarm_py-debuginfo-1.5-alt11
Finding Provides (using /usr/lib/rpm/find-provides)
Executing: /bin/sh -e /usr/src/tmp/rpm-tmp.9U7UXJ
find-provides: running scripts (debuginfo)
Finding Requires (using /usr/lib/rpm/find-requires)
Executing: /bin/sh -e /usr/src/tmp/rpm-tmp.oBJMs2
find-requires: running scripts (debuginfo)
Requires: python-module-pswarm_py = 1.5-alt11, debug(libc.so.6), debug(libpswarm.so.0), debug(libpswarm_nonlinear.so.0), debug(libpython2.7.so.1.0)
Processing files: R-pswarm-debuginfo-1.5-alt11
Finding Provides (using /usr/lib/rpm/find-provides)
Executing: /bin/sh -e /usr/src/tmp/rpm-tmp.ya36xU
find-provides: running scripts (debuginfo)
Finding Requires (using /usr/lib/rpm/find-requires)
Executing: /bin/sh -e /usr/src/tmp/rpm-tmp.EMpv7c
find-requires: running scripts (debuginfo)
Requires: R-pswarm = 1.5-alt11, debug(libR.so), debug(libc.so.6), debug(libpswarm.so.0), debug(libpswarm_nonlinear.so.0)
Adding to python-module-pswarm_py a strict dependency on libpswarm
Adding to R-pswarm a strict dependency on libpswarm
Adding to libpswarm-devel-debuginfo a strict dependency on libpswarm-debuginfo
Adding to python-module-pswarm_py-debuginfo a strict dependency on libpswarm-debuginfo
Adding to R-pswarm-debuginfo a strict dependency on libpswarm-debuginfo
Adding to pswarm-debuginfo a strict dependency on libpswarm-debuginfo
Removing from pswarm-debuginfo 6 sources provided by libpswarm-debuginfo
Removing from libpswarm-devel-debuginfo 1 sources provided by libpswarm-debuginfo
Removing from python-module-pswarm_py-debuginfo 1 sources provided by libpswarm-debuginfo
Removing from R-pswarm-debuginfo 1 sources provided by libpswarm-debuginfo
Adding to libpswarm-devel-debuginfo a strict dependency on python-module-pswarm_py-debuginfo
Removing from libpswarm-devel-debuginfo 2 sources provided by python-module-pswarm_py-debuginfo
Removing 4 extra deps from libpswarm-devel due to dependency on libpswarm
Removing 2 extra deps from python-module-pswarm_py due to dependency on libpswarm
Removing 2 extra deps from R-pswarm due to dependency on libpswarm
Removing 1 extra deps from python-module-pswarm_test due to dependency on python-module-pswarm_py
Removing 2 extra deps from libpswarm-devel-debuginfo due to dependency on libpswarm-debuginfo
Removing 2 extra deps from python-module-pswarm_py-debuginfo due to dependency on libpswarm-debuginfo
Removing 2 extra deps from R-pswarm-debuginfo due to dependency on libpswarm-debuginfo
Removing 9 extra deps from pswarm due to repentancy on libpswarm
Removing 6 extra deps from libpswarm-devel due to repentancy on libpswarm
Removing 6 extra deps from python-module-pswarm_py due to repentancy on libpswarm
Removing 4 extra deps from R-pswarm due to repentancy on libpswarm
Removing 3 extra deps from libpswarm-devel due to repentancy on python-module-pswarm_py
Removing 2 extra deps from python-module-pswarm_test due to repentancy on python-module-pswarm_py
Removing 4 extra deps from pswarm-debuginfo due to repentancy on libpswarm-debuginfo
Removing 1 extra deps from libpswarm-devel-debuginfo due to repentancy on libpswarm-debuginfo
Removing 1 extra deps from python-module-pswarm_py-debuginfo due to repentancy on libpswarm-debuginfo
Removing 1 extra deps from R-pswarm-debuginfo due to repentancy on libpswarm-debuginfo
Removing 2 extra deps from libpswarm-devel-debuginfo due to repentancy on python-module-pswarm_py-debuginfo
Wrote: /usr/src/RPM/RPMS/i586/pswarm-1.5-alt11.i586.rpm
Wrote: /usr/src/RPM/RPMS/i586/libpswarm-1.5-alt11.i586.rpm
Wrote: /usr/src/RPM/RPMS/i586/libpswarm-devel-1.5-alt11.i586.rpm
Wrote: /usr/src/RPM/RPMS/i586/libpswarm-devel-static-1.5-alt11.i586.rpm
Wrote: /usr/src/RPM/RPMS/i586/python-module-pswarm_py-1.5-alt11.i586.rpm
Wrote: /usr/src/RPM/RPMS/i586/python-module-pswarm_test-1.5-alt11.i586.rpm
Wrote: /usr/src/RPM/RPMS/i586/R-pswarm-1.5-alt11.i586.rpm
Wrote: /usr/src/RPM/RPMS/i586/pswarm-debuginfo-1.5-alt11.i586.rpm
Wrote: /usr/src/RPM/RPMS/i586/libpswarm-debuginfo-1.5-alt11.i586.rpm
Wrote: /usr/src/RPM/RPMS/i586/libpswarm-devel-debuginfo-1.5-alt11.i586.rpm
Wrote: /usr/src/RPM/RPMS/i586/python-module-pswarm_py-debuginfo-1.5-alt11.i586.rpm
Wrote: /usr/src/RPM/RPMS/i586/R-pswarm-debuginfo-1.5-alt11.i586.rpm
26.30user 4.32system 1:09.18elapsed 44%CPU (0avgtext+0avgdata 35360maxresident)k
0inputs+0outputs (0major+1614215minor)pagefaults 0swaps
49.04user 8.99system 2:32.24elapsed 38%CPU (0avgtext+0avgdata 122688maxresident)k
113088inputs+0outputs (0major+2397252minor)pagefaults 0swaps